hive-dev mailing list archives

Site index · List index
Message view « Date » · « Thread »
Top « Date » · « Thread »
From Apache Jenkins Server <jenk...@builds.apache.org>
Subject Build failed in Jenkins: Hive-0.9.1-SNAPSHOT-h0.21 #194
Date Sat, 10 Nov 2012 16:02:38 GMT
See <https://builds.apache.org/job/Hive-0.9.1-SNAPSHOT-h0.21/194/>

------------------------------------------
[...truncated 5336 lines...]
     [copy] Copying 2 files to /x1/jenkins/jenkins-slave/workspace/Hive-0.9.1-SNAPSHOT-h0.21/hive/build/common/test/resources

init:
     [echo] Project: common

create-dirs:
     [echo] Project: serde
    [mkdir] Created dir: /x1/jenkins/jenkins-slave/workspace/Hive-0.9.1-SNAPSHOT-h0.21/hive/build/serde
    [mkdir] Created dir: /x1/jenkins/jenkins-slave/workspace/Hive-0.9.1-SNAPSHOT-h0.21/hive/build/serde/classes
    [mkdir] Created dir: /x1/jenkins/jenkins-slave/workspace/Hive-0.9.1-SNAPSHOT-h0.21/hive/build/serde/test
    [mkdir] Created dir: /x1/jenkins/jenkins-slave/workspace/Hive-0.9.1-SNAPSHOT-h0.21/hive/build/serde/test/src
    [mkdir] Created dir: /x1/jenkins/jenkins-slave/workspace/Hive-0.9.1-SNAPSHOT-h0.21/hive/build/serde/test/classes
    [mkdir] Created dir: /x1/jenkins/jenkins-slave/workspace/Hive-0.9.1-SNAPSHOT-h0.21/hive/build/serde/test/resources
     [copy] Warning: /x1/jenkins/jenkins-slave/workspace/Hive-0.9.1-SNAPSHOT-h0.21/hive/serde/src/test/resources
does not exist.

init:
     [echo] Project: serde

create-dirs:
     [echo] Project: metastore
    [mkdir] Created dir: /x1/jenkins/jenkins-slave/workspace/Hive-0.9.1-SNAPSHOT-h0.21/hive/build/metastore
    [mkdir] Created dir: /x1/jenkins/jenkins-slave/workspace/Hive-0.9.1-SNAPSHOT-h0.21/hive/build/metastore/classes
    [mkdir] Created dir: /x1/jenkins/jenkins-slave/workspace/Hive-0.9.1-SNAPSHOT-h0.21/hive/build/metastore/test
    [mkdir] Created dir: /x1/jenkins/jenkins-slave/workspace/Hive-0.9.1-SNAPSHOT-h0.21/hive/build/metastore/test/src
    [mkdir] Created dir: /x1/jenkins/jenkins-slave/workspace/Hive-0.9.1-SNAPSHOT-h0.21/hive/build/metastore/test/classes
    [mkdir] Created dir: /x1/jenkins/jenkins-slave/workspace/Hive-0.9.1-SNAPSHOT-h0.21/hive/build/metastore/test/resources
     [copy] Warning: /x1/jenkins/jenkins-slave/workspace/Hive-0.9.1-SNAPSHOT-h0.21/hive/metastore/src/test/resources
does not exist.

init:
     [echo] Project: metastore

create-dirs:
     [echo] Project: ql
    [mkdir] Created dir: /x1/jenkins/jenkins-slave/workspace/Hive-0.9.1-SNAPSHOT-h0.21/hive/build/ql
    [mkdir] Created dir: /x1/jenkins/jenkins-slave/workspace/Hive-0.9.1-SNAPSHOT-h0.21/hive/build/ql/classes
    [mkdir] Created dir: /x1/jenkins/jenkins-slave/workspace/Hive-0.9.1-SNAPSHOT-h0.21/hive/build/ql/test
    [mkdir] Created dir: /x1/jenkins/jenkins-slave/workspace/Hive-0.9.1-SNAPSHOT-h0.21/hive/build/ql/test/src
    [mkdir] Created dir: /x1/jenkins/jenkins-slave/workspace/Hive-0.9.1-SNAPSHOT-h0.21/hive/build/ql/test/classes
    [mkdir] Created dir: /x1/jenkins/jenkins-slave/workspace/Hive-0.9.1-SNAPSHOT-h0.21/hive/build/ql/test/resources
     [copy] Warning: /x1/jenkins/jenkins-slave/workspace/Hive-0.9.1-SNAPSHOT-h0.21/hive/ql/src/test/resources
does not exist.

init:
     [echo] Project: ql

create-dirs:
     [echo] Project: contrib
    [mkdir] Created dir: /x1/jenkins/jenkins-slave/workspace/Hive-0.9.1-SNAPSHOT-h0.21/hive/build/contrib
    [mkdir] Created dir: /x1/jenkins/jenkins-slave/workspace/Hive-0.9.1-SNAPSHOT-h0.21/hive/build/contrib/classes
    [mkdir] Created dir: /x1/jenkins/jenkins-slave/workspace/Hive-0.9.1-SNAPSHOT-h0.21/hive/build/contrib/test
    [mkdir] Created dir: /x1/jenkins/jenkins-slave/workspace/Hive-0.9.1-SNAPSHOT-h0.21/hive/build/contrib/test/src
    [mkdir] Created dir: /x1/jenkins/jenkins-slave/workspace/Hive-0.9.1-SNAPSHOT-h0.21/hive/build/contrib/test/classes
    [mkdir] Created dir: /x1/jenkins/jenkins-slave/workspace/Hive-0.9.1-SNAPSHOT-h0.21/hive/build/contrib/test/resources
     [copy] Warning: /x1/jenkins/jenkins-slave/workspace/Hive-0.9.1-SNAPSHOT-h0.21/hive/contrib/src/test/resources
does not exist.

init:
     [echo] Project: contrib

create-dirs:
     [echo] Project: service
    [mkdir] Created dir: /x1/jenkins/jenkins-slave/workspace/Hive-0.9.1-SNAPSHOT-h0.21/hive/build/service
    [mkdir] Created dir: /x1/jenkins/jenkins-slave/workspace/Hive-0.9.1-SNAPSHOT-h0.21/hive/build/service/classes
    [mkdir] Created dir: /x1/jenkins/jenkins-slave/workspace/Hive-0.9.1-SNAPSHOT-h0.21/hive/build/service/test
    [mkdir] Created dir: /x1/jenkins/jenkins-slave/workspace/Hive-0.9.1-SNAPSHOT-h0.21/hive/build/service/test/src
    [mkdir] Created dir: /x1/jenkins/jenkins-slave/workspace/Hive-0.9.1-SNAPSHOT-h0.21/hive/build/service/test/classes
    [mkdir] Created dir: /x1/jenkins/jenkins-slave/workspace/Hive-0.9.1-SNAPSHOT-h0.21/hive/build/service/test/resources
     [copy] Warning: /x1/jenkins/jenkins-slave/workspace/Hive-0.9.1-SNAPSHOT-h0.21/hive/service/src/test/resources
does not exist.

init:
     [echo] Project: service

create-dirs:
     [echo] Project: cli
    [mkdir] Created dir: /x1/jenkins/jenkins-slave/workspace/Hive-0.9.1-SNAPSHOT-h0.21/hive/build/cli
    [mkdir] Created dir: /x1/jenkins/jenkins-slave/workspace/Hive-0.9.1-SNAPSHOT-h0.21/hive/build/cli/classes
    [mkdir] Created dir: /x1/jenkins/jenkins-slave/workspace/Hive-0.9.1-SNAPSHOT-h0.21/hive/build/cli/test
    [mkdir] Created dir: /x1/jenkins/jenkins-slave/workspace/Hive-0.9.1-SNAPSHOT-h0.21/hive/build/cli/test/src
    [mkdir] Created dir: /x1/jenkins/jenkins-slave/workspace/Hive-0.9.1-SNAPSHOT-h0.21/hive/build/cli/test/classes
    [mkdir] Created dir: /x1/jenkins/jenkins-slave/workspace/Hive-0.9.1-SNAPSHOT-h0.21/hive/build/cli/test/resources
     [copy] Warning: /x1/jenkins/jenkins-slave/workspace/Hive-0.9.1-SNAPSHOT-h0.21/hive/cli/src/test/resources
does not exist.

init:
     [echo] Project: cli

create-dirs:
     [echo] Project: jdbc
    [mkdir] Created dir: /x1/jenkins/jenkins-slave/workspace/Hive-0.9.1-SNAPSHOT-h0.21/hive/build/jdbc
    [mkdir] Created dir: /x1/jenkins/jenkins-slave/workspace/Hive-0.9.1-SNAPSHOT-h0.21/hive/build/jdbc/classes
    [mkdir] Created dir: /x1/jenkins/jenkins-slave/workspace/Hive-0.9.1-SNAPSHOT-h0.21/hive/build/jdbc/test
    [mkdir] Created dir: /x1/jenkins/jenkins-slave/workspace/Hive-0.9.1-SNAPSHOT-h0.21/hive/build/jdbc/test/src
    [mkdir] Created dir: /x1/jenkins/jenkins-slave/workspace/Hive-0.9.1-SNAPSHOT-h0.21/hive/build/jdbc/test/classes
    [mkdir] Created dir: /x1/jenkins/jenkins-slave/workspace/Hive-0.9.1-SNAPSHOT-h0.21/hive/build/jdbc/test/resources
     [copy] Warning: /x1/jenkins/jenkins-slave/workspace/Hive-0.9.1-SNAPSHOT-h0.21/hive/jdbc/src/test/resources
does not exist.

init:
     [echo] Project: jdbc

create-dirs:
     [echo] Project: hwi
    [mkdir] Created dir: /x1/jenkins/jenkins-slave/workspace/Hive-0.9.1-SNAPSHOT-h0.21/hive/build/hwi
    [mkdir] Created dir: /x1/jenkins/jenkins-slave/workspace/Hive-0.9.1-SNAPSHOT-h0.21/hive/build/hwi/classes
    [mkdir] Created dir: /x1/jenkins/jenkins-slave/workspace/Hive-0.9.1-SNAPSHOT-h0.21/hive/build/hwi/test
    [mkdir] Created dir: /x1/jenkins/jenkins-slave/workspace/Hive-0.9.1-SNAPSHOT-h0.21/hive/build/hwi/test/src
    [mkdir] Created dir: /x1/jenkins/jenkins-slave/workspace/Hive-0.9.1-SNAPSHOT-h0.21/hive/build/hwi/test/classes
    [mkdir] Created dir: /x1/jenkins/jenkins-slave/workspace/Hive-0.9.1-SNAPSHOT-h0.21/hive/build/hwi/test/resources
     [copy] Warning: /x1/jenkins/jenkins-slave/workspace/Hive-0.9.1-SNAPSHOT-h0.21/hive/hwi/src/test/resources
does not exist.

init:
     [echo] Project: hwi

create-dirs:
     [echo] Project: hbase-handler
    [mkdir] Created dir: /x1/jenkins/jenkins-slave/workspace/Hive-0.9.1-SNAPSHOT-h0.21/hive/build/hbase-handler
    [mkdir] Created dir: /x1/jenkins/jenkins-slave/workspace/Hive-0.9.1-SNAPSHOT-h0.21/hive/build/hbase-handler/classes
    [mkdir] Created dir: /x1/jenkins/jenkins-slave/workspace/Hive-0.9.1-SNAPSHOT-h0.21/hive/build/hbase-handler/test
    [mkdir] Created dir: /x1/jenkins/jenkins-slave/workspace/Hive-0.9.1-SNAPSHOT-h0.21/hive/build/hbase-handler/test/src
    [mkdir] Created dir: /x1/jenkins/jenkins-slave/workspace/Hive-0.9.1-SNAPSHOT-h0.21/hive/build/hbase-handler/test/classes
    [mkdir] Created dir: /x1/jenkins/jenkins-slave/workspace/Hive-0.9.1-SNAPSHOT-h0.21/hive/build/hbase-handler/test/resources
     [copy] Warning: /x1/jenkins/jenkins-slave/workspace/Hive-0.9.1-SNAPSHOT-h0.21/hive/hbase-handler/src/test/resources
does not exist.

init:
     [echo] Project: hbase-handler

create-dirs:
     [echo] Project: pdk
    [mkdir] Created dir: /x1/jenkins/jenkins-slave/workspace/Hive-0.9.1-SNAPSHOT-h0.21/hive/build/pdk
    [mkdir] Created dir: /x1/jenkins/jenkins-slave/workspace/Hive-0.9.1-SNAPSHOT-h0.21/hive/build/pdk/classes
    [mkdir] Created dir: /x1/jenkins/jenkins-slave/workspace/Hive-0.9.1-SNAPSHOT-h0.21/hive/build/pdk/test
    [mkdir] Created dir: /x1/jenkins/jenkins-slave/workspace/Hive-0.9.1-SNAPSHOT-h0.21/hive/build/pdk/test/src
    [mkdir] Created dir: /x1/jenkins/jenkins-slave/workspace/Hive-0.9.1-SNAPSHOT-h0.21/hive/build/pdk/test/classes
    [mkdir] Created dir: /x1/jenkins/jenkins-slave/workspace/Hive-0.9.1-SNAPSHOT-h0.21/hive/build/pdk/test/resources
     [copy] Warning: /x1/jenkins/jenkins-slave/workspace/Hive-0.9.1-SNAPSHOT-h0.21/hive/pdk/src/test/resources
does not exist.

init:
     [echo] Project: pdk

create-dirs:
     [echo] Project: builtins
    [mkdir] Created dir: /x1/jenkins/jenkins-slave/workspace/Hive-0.9.1-SNAPSHOT-h0.21/hive/build/builtins
    [mkdir] Created dir: /x1/jenkins/jenkins-slave/workspace/Hive-0.9.1-SNAPSHOT-h0.21/hive/build/builtins/classes
    [mkdir] Created dir: /x1/jenkins/jenkins-slave/workspace/Hive-0.9.1-SNAPSHOT-h0.21/hive/build/builtins/test
    [mkdir] Created dir: /x1/jenkins/jenkins-slave/workspace/Hive-0.9.1-SNAPSHOT-h0.21/hive/build/builtins/test/src
    [mkdir] Created dir: /x1/jenkins/jenkins-slave/workspace/Hive-0.9.1-SNAPSHOT-h0.21/hive/build/builtins/test/classes
    [mkdir] Created dir: /x1/jenkins/jenkins-slave/workspace/Hive-0.9.1-SNAPSHOT-h0.21/hive/build/builtins/test/resources
     [copy] Warning: /x1/jenkins/jenkins-slave/workspace/Hive-0.9.1-SNAPSHOT-h0.21/hive/builtins/src/test/resources
does not exist.

init:
     [echo] Project: builtins

jar:
     [echo] Project: hive

create-dirs:
     [echo] Project: shims
     [copy] Warning: /x1/jenkins/jenkins-slave/workspace/Hive-0.9.1-SNAPSHOT-h0.21/hive/shims/src/test/resources
does not exist.

init:
     [echo] Project: shims

ivy-init-settings:
     [echo] Project: shims

ivy-resolve:
     [echo] Project: shims
[ivy:resolve] :: loading settings :: file = /x1/jenkins/jenkins-slave/workspace/Hive-0.9.1-SNAPSHOT-h0.21/hive/ivy/ivysettings.xml
[ivy:resolve] downloading http://repo1.maven.org/maven2/org/apache/zookeeper/zookeeper/3.4.3/zookeeper-3.4.3.jar
...
[ivy:resolve] ...................................................... (749kB)
[ivy:resolve] .. (0kB)
[ivy:resolve] downloading http://repo1.maven.org/maven2/org/apache/thrift/libthrift/0.7.0/libthrift-0.7.0.jar
...
[ivy:resolve] ........................................................................................................
(294kB)
[ivy:resolve] .. (0kB)
[ivy:resolve] downloading http://repo1.maven.org/maven2/commons-logging/commons-logging/1.0.4/commons-logging-1.0.4.jar
...
[ivy:resolve] ...... (37kB)
[ivy:resolve] .. (0kB)
[ivy:resolve] downloading http://repo1.maven.org/maven2/com/google/guava/guava/r09/guava-r09.jar
...
[ivy:resolve] ........................................................................ (1117kB)
[ivy:resolve] .. (0kB)
[ivy:resolve] downloading http://repo1.maven.org/maven2/org/codehaus/jackson/jackson-core-asl/1.8.8/jackson-core-asl-1.8.8.jar
...
[ivy:resolve] .............. (222kB)
[ivy:resolve] .. (0kB)
[ivy:resolve] 	[SUCCESSFUL ] org.codehaus.jackson#jackson-core-asl;1.8.8!jackson-core-asl.jar
(132ms)
[ivy:resolve] downloading http://repo1.maven.org/maven2/org/codehaus/jackson/jackson-mapper-asl/1.8.8/jackson-mapper-asl-1.8.8.jar
...
[ivy:resolve] ..................................... (652kB)
[ivy:resolve] .. (0kB)
[ivy:resolve] 
[ivy:resolve] :: problems summary ::
[ivy:resolve] :::: WARNINGS
[ivy:resolve] 	problem while downloading module descriptor: http://repo1.maven.org/maven2/commons-logging/commons-logging-api/1.0.4/commons-logging-api-1.0.4.pom:
/home/jenkins/.ivy2/cache/commons-logging/commons-logging-api/ivy-1.0.4.xml.original.part
(No such file or directory) (298ms)
[ivy:resolve] 		module not found: commons-logging#commons-logging-api;1.0.4
[ivy:resolve] 	==== local: tried
[ivy:resolve] 	  /home/jenkins/.ivy2/local/commons-logging/commons-logging-api/1.0.4/ivys/ivy.xml
[ivy:resolve] 	  -- artifact commons-logging#commons-logging-api;1.0.4!commons-logging-api.jar:
[ivy:resolve] 	  /home/jenkins/.ivy2/local/commons-logging/commons-logging-api/1.0.4/jars/commons-logging-api.jar
[ivy:resolve] 	==== apache-snapshot: tried
[ivy:resolve] 	  https://repository.apache.org/content/repositories/snapshots/commons-logging/commons-logging-api/1.0.4/commons-logging-api-1.0.4.pom
[ivy:resolve] 	  -- artifact commons-logging#commons-logging-api;1.0.4!commons-logging-api.jar:
[ivy:resolve] 	  https://repository.apache.org/content/repositories/snapshots/commons-logging/commons-logging-api/1.0.4/commons-logging-api-1.0.4.jar
[ivy:resolve] 	==== maven2: tried
[ivy:resolve] 	  http://repo1.maven.org/maven2/commons-logging/commons-logging-api/1.0.4/commons-logging-api-1.0.4.pom
[ivy:resolve] 	==== datanucleus-repo: tried
[ivy:resolve] 	  -- artifact commons-logging#commons-logging-api;1.0.4!commons-logging-api.jar:
[ivy:resolve] 	  http://www.datanucleus.org/downloads/maven2/commons-logging/commons-logging-api/1.0.4/commons-logging-api-1.0.4.jar
[ivy:resolve] 	==== hadoop-source: tried
[ivy:resolve] 	  -- artifact commons-logging#commons-logging-api;1.0.4!commons-logging-api.jar:
[ivy:resolve] 	  http://mirror.facebook.net/facebook/hive-deps/hadoop/core/commons-logging-api-1.0.4/commons-logging-api-1.0.4.jar
[ivy:resolve] 	==== hadoop-source2: tried
[ivy:resolve] 	  -- artifact commons-logging#commons-logging-api;1.0.4!commons-logging-api.jar:
[ivy:resolve] 	  http://archive.cloudera.com/hive-deps/hadoop/core/commons-logging-api-1.0.4/commons-logging-api-1.0.4.jar
[ivy:resolve] 		[FAILED     ] org.apache.zookeeper#zookeeper;3.4.3!zookeeper.jar: impossible
to move part file to definitive one: /home/jenkins/.ivy2/cache/org.apache.zookeeper/zookeeper/jars/zookeeper-3.4.3.jar.part
-> /home/jenkins/.ivy2/cache/org.apache.zookeeper/zookeeper/jars/zookeeper-3.4.3.jar (617ms)
[ivy:resolve] 		[FAILED     ] org.apache.thrift#libthrift;0.7.0!libthrift.jar: impossible
to move part file to definitive one: /home/jenkins/.ivy2/cache/org.apache.thrift/libthrift/jars/libthrift-0.7.0.jar.part
-> /home/jenkins/.ivy2/cache/org.apache.thrift/libthrift/jars/libthrift-0.7.0.jar (184ms)
[ivy:resolve] 		[FAILED     ] commons-logging#commons-logging;1.0.4!commons-logging.jar: /home/jenkins/.ivy2/cache/commons-logging/commons-logging/jars/commons-logging-1.0.4.jar.part
(No such file or directory) (282ms)
[ivy:resolve] 		[FAILED     ] com.google.guava#guava;r09!guava.jar: /home/jenkins/.ivy2/cache/com.google.guava/guava/jars/guava-r09.jar.part
(No such file or directory) (757ms)
[ivy:resolve] 		[FAILED     ] org.codehaus.jackson#jackson-mapper-asl;1.8.8!jackson-mapper-asl.jar:
invalid sha1: expected=01bb32d9d2527c083a56e234acca49a48d3c65c8 computed=20aa4b7ed9c9d14217be92cd5f520bec822e798b
(234ms)
[ivy:resolve] 		[FAILED     ] org.codehaus.jackson#jackson-mapper-asl;1.8.8!jackson-mapper-asl.jar:
 (0ms)
[ivy:resolve] 	==== local: tried
[ivy:resolve] 	  /home/jenkins/.ivy2/local/org.codehaus.jackson/jackson-mapper-asl/1.8.8/jars/jackson-mapper-asl.jar
[ivy:resolve] 	==== apache-snapshot: tried
[ivy:resolve] 	  https://repository.apache.org/content/repositories/snapshots/org/codehaus/jackson/jackson-mapper-asl/1.8.8/jackson-mapper-asl-1.8.8.jar
[ivy:resolve] 	==== maven2: tried
[ivy:resolve] 	  http://repo1.maven.org/maven2/org/codehaus/jackson/jackson-mapper-asl/1.8.8/jackson-mapper-asl-1.8.8.jar
[ivy:resolve] 	==== datanucleus-repo: tried
[ivy:resolve] 	  http://www.datanucleus.org/downloads/maven2/org/codehaus/jackson/jackson-mapper-asl/1.8.8/jackson-mapper-asl-1.8.8.jar
[ivy:resolve] 	==== hadoop-source: tried
[ivy:resolve] 	  http://mirror.facebook.net/facebook/hive-deps/hadoop/core/jackson-mapper-asl-1.8.8/jackson-mapper-asl-1.8.8.jar
[ivy:resolve] 	==== hadoop-source2: tried
[ivy:resolve] 	  http://archive.cloudera.com/hive-deps/hadoop/core/jackson-mapper-asl-1.8.8/jackson-mapper-asl-1.8.8.jar
[ivy:resolve] 		::::::::::::::::::::::::::::::::::::::::::::::
[ivy:resolve] 		::          UNRESOLVED DEPENDENCIES         ::
[ivy:resolve] 		::::::::::::::::::::::::::::::::::::::::::::::
[ivy:resolve] 		:: commons-logging#commons-logging-api;1.0.4: not found
[ivy:resolve] 		::::::::::::::::::::::::::::::::::::::::::::::
[ivy:resolve] 		::::::::::::::::::::::::::::::::::::::::::::::
[ivy:resolve] 		::              FAILED DOWNLOADS            ::
[ivy:resolve] 		:: ^ see resolution messages for details  ^ ::
[ivy:resolve] 		::::::::::::::::::::::::::::::::::::::::::::::
[ivy:resolve] 		:: org.codehaus.jackson#jackson-mapper-asl;1.8.8!jackson-mapper-asl.jar
[ivy:resolve] 		::::::::::::::::::::::::::::::::::::::::::::::
[ivy:resolve] 
[ivy:resolve] :: USE VERBOSE OR DEBUG MESSAGE LEVEL FOR MORE DETAILS

BUILD FAILED
/x1/jenkins/jenkins-slave/workspace/Hive-0.9.1-SNAPSHOT-h0.21/hive/build.xml:302: The following
error occurred while executing this line:
/x1/jenkins/jenkins-slave/workspace/Hive-0.9.1-SNAPSHOT-h0.21/hive/build.xml:152: The following
error occurred while executing this line:
/x1/jenkins/jenkins-slave/workspace/Hive-0.9.1-SNAPSHOT-h0.21/hive/build-common.xml:125: impossible
to resolve dependencies:
	resolve failed - see output for details

Total time: 14 seconds
Build step 'Invoke Ant' marked build as failure
Archiving artifacts
Recording test results

Mime
View raw message