hive-dev mailing list archives

Site index · List index
Message view « Date » · « Thread »
Top « Date » · « Thread »
From Apache Jenkins Server <jenk...@builds.apache.org>
Subject Build failed in Jenkins: Hive-0.9.1-SNAPSHOT-h0.21 #185
Date Thu, 01 Nov 2012 16:18:51 GMT
See <https://builds.apache.org/job/Hive-0.9.1-SNAPSHOT-h0.21/185/>

------------------------------------------
[...truncated 10092 lines...]

compile-test:
     [echo] Project: metastore
    [javac] Compiling 18 source files to <https://builds.apache.org/job/Hive-0.9.1-SNAPSHOT-h0.21/185/artifact/hive/build/metastore/test/classes>

create-dirs:
     [echo] Project: odbc
    [mkdir] Created dir: <https://builds.apache.org/job/Hive-0.9.1-SNAPSHOT-h0.21/185/artifact/hive/build/odbc>
    [mkdir] Created dir: <https://builds.apache.org/job/Hive-0.9.1-SNAPSHOT-h0.21/185/artifact/hive/build/odbc/classes>
    [mkdir] Created dir: <https://builds.apache.org/job/Hive-0.9.1-SNAPSHOT-h0.21/185/artifact/hive/build/odbc/test>
    [mkdir] Created dir: <https://builds.apache.org/job/Hive-0.9.1-SNAPSHOT-h0.21/185/artifact/hive/build/odbc/test/src>
    [mkdir] Created dir: <https://builds.apache.org/job/Hive-0.9.1-SNAPSHOT-h0.21/185/artifact/hive/build/odbc/test/classes>
    [mkdir] Created dir: <https://builds.apache.org/job/Hive-0.9.1-SNAPSHOT-h0.21/185/artifact/hive/build/odbc/test/resources>
     [copy] Warning: <https://builds.apache.org/job/Hive-0.9.1-SNAPSHOT-h0.21/ws/hive/odbc/src/test/resources>
does not exist.

init:
     [echo] Project: odbc

setup:
     [echo] Project: odbc

ivy-init-settings:
     [echo] Project: odbc

ivy-resolve:
     [echo] Project: odbc
[ivy:resolve] :: loading settings :: file = <https://builds.apache.org/job/Hive-0.9.1-SNAPSHOT-h0.21/ws/hive/ivy/ivysettings.xml>
[ivy:report] Processing <https://builds.apache.org/job/Hive-0.9.1-SNAPSHOT-h0.21/185/artifact/hive/build/ivy/resolution-cache/org.apache.hive-hive-odbc-default.xml>
to <https://builds.apache.org/job/Hive-0.9.1-SNAPSHOT-h0.21/185/artifact/hive/build/ivy/report/org.apache.hive-hive-odbc-default.html>

ivy-retrieve:
     [echo] Project: odbc

compile:
     [echo] Project: odbc
     [copy] Warning: <https://builds.apache.org/job/Hive-0.9.1-SNAPSHOT-h0.21/ws/hive/odbc/src/conf>
does not exist.

ivy-resolve-test:
     [echo] Project: odbc

ivy-retrieve-test:
     [echo] Project: odbc

compile-test:
     [echo] Project: odbc

create-dirs:
     [echo] Project: serde
     [copy] Warning: <https://builds.apache.org/job/Hive-0.9.1-SNAPSHOT-h0.21/ws/hive/serde/src/test/resources>
does not exist.

init:
     [echo] Project: serde

ivy-init-settings:
     [echo] Project: serde

ivy-resolve:
     [echo] Project: serde
[ivy:resolve] :: loading settings :: file = <https://builds.apache.org/job/Hive-0.9.1-SNAPSHOT-h0.21/ws/hive/ivy/ivysettings.xml>
[ivy:report] Processing <https://builds.apache.org/job/Hive-0.9.1-SNAPSHOT-h0.21/185/artifact/hive/build/ivy/resolution-cache/org.apache.hive-hive-serde-default.xml>
to <https://builds.apache.org/job/Hive-0.9.1-SNAPSHOT-h0.21/185/artifact/hive/build/ivy/report/org.apache.hive-hive-serde-default.html>

ivy-retrieve:
     [echo] Project: serde

dynamic-serde:

compile:
     [echo] Project: serde

ivy-resolve-test:
     [echo] Project: serde

ivy-retrieve-test:
     [echo] Project: serde

compile-test:
     [echo] Project: serde
    [javac] Compiling 26 source files to <https://builds.apache.org/job/Hive-0.9.1-SNAPSHOT-h0.21/185/artifact/hive/build/serde/test/classes>
    [javac] Note: Some input files use or override a deprecated API.
    [javac] Note: Recompile with -Xlint:deprecation for details.
    [javac] Note: Some input files use unchecked or unsafe operations.
    [javac] Note: Recompile with -Xlint:unchecked for details.

create-dirs:
     [echo] Project: service
     [copy] Warning: <https://builds.apache.org/job/Hive-0.9.1-SNAPSHOT-h0.21/ws/hive/service/src/test/resources>
does not exist.

init:
     [echo] Project: service

ivy-init-settings:
     [echo] Project: service

ivy-resolve:
     [echo] Project: service
[ivy:resolve] :: loading settings :: file = <https://builds.apache.org/job/Hive-0.9.1-SNAPSHOT-h0.21/ws/hive/ivy/ivysettings.xml>
[ivy:report] Processing <https://builds.apache.org/job/Hive-0.9.1-SNAPSHOT-h0.21/185/artifact/hive/build/ivy/resolution-cache/org.apache.hive-hive-service-default.xml>
to <https://builds.apache.org/job/Hive-0.9.1-SNAPSHOT-h0.21/185/artifact/hive/build/ivy/report/org.apache.hive-hive-service-default.html>

ivy-retrieve:
     [echo] Project: service

compile:
     [echo] Project: service

ivy-resolve-test:
     [echo] Project: service

ivy-retrieve-test:
     [echo] Project: service

compile-test:
     [echo] Project: service
    [javac] Compiling 2 source files to <https://builds.apache.org/job/Hive-0.9.1-SNAPSHOT-h0.21/185/artifact/hive/build/service/test/classes>

test:
     [echo] Project: hive

test-shims:
     [echo] Project: hive

test-conditions:
     [echo] Project: shims

gen-test:
     [echo] Project: shims

create-dirs:
     [echo] Project: shims
     [copy] Warning: <https://builds.apache.org/job/Hive-0.9.1-SNAPSHOT-h0.21/ws/hive/shims/src/test/resources>
does not exist.

init:
     [echo] Project: shims

ivy-init-settings:
     [echo] Project: shims

ivy-resolve:
     [echo] Project: shims
[ivy:resolve] :: loading settings :: file = <https://builds.apache.org/job/Hive-0.9.1-SNAPSHOT-h0.21/ws/hive/ivy/ivysettings.xml>
[ivy:report] Processing <https://builds.apache.org/job/Hive-0.9.1-SNAPSHOT-h0.21/185/artifact/hive/build/ivy/resolution-cache/org.apache.hive-hive-shims-default.xml>
to <https://builds.apache.org/job/Hive-0.9.1-SNAPSHOT-h0.21/185/artifact/hive/build/ivy/report/org.apache.hive-hive-shims-default.html>

ivy-retrieve:
     [echo] Project: shims

compile:
     [echo] Project: shims
     [echo] Building shims 0.20

build_shims:
     [echo] Project: shims
     [echo] Compiling <https://builds.apache.org/job/Hive-0.9.1-SNAPSHOT-h0.21/ws/hive/shims/src/common/java;/home/jenkins/jenkins-slave/workspace/Hive-0.9.1-SNAPSHOT-h0.21/hive/shims/src/0.20/java>
against hadoop 0.20.2 (<https://builds.apache.org/job/Hive-0.9.1-SNAPSHOT-h0.21/185/artifact/hive/build/hadoopcore/hadoop-0.20.2)>

ivy-init-settings:
     [echo] Project: shims

ivy-resolve-hadoop-shim:
     [echo] Project: shims
[ivy:resolve] :: loading settings :: file = <https://builds.apache.org/job/Hive-0.9.1-SNAPSHOT-h0.21/ws/hive/ivy/ivysettings.xml>

ivy-retrieve-hadoop-shim:
     [echo] Project: shims
     [echo] Building shims 0.20S

build_shims:
     [echo] Project: shims
     [echo] Compiling <https://builds.apache.org/job/Hive-0.9.1-SNAPSHOT-h0.21/ws/hive/shims/src/common/java;/home/jenkins/jenkins-slave/workspace/Hive-0.9.1-SNAPSHOT-h0.21/hive/shims/src/common-secure/java;/home/jenkins/jenkins-slave/workspace/Hive-0.9.1-SNAPSHOT-h0.21/hive/shims/src/0.20S/java>
against hadoop 1.0.0 (<https://builds.apache.org/job/Hive-0.9.1-SNAPSHOT-h0.21/185/artifact/hive/build/hadoopcore/hadoop-1.0.0)>

ivy-init-settings:
     [echo] Project: shims

ivy-resolve-hadoop-shim:
     [echo] Project: shims
[ivy:resolve] :: loading settings :: file = <https://builds.apache.org/job/Hive-0.9.1-SNAPSHOT-h0.21/ws/hive/ivy/ivysettings.xml>

ivy-retrieve-hadoop-shim:
     [echo] Project: shims
     [echo] Building shims 0.23

build_shims:
     [echo] Project: shims
     [echo] Compiling <https://builds.apache.org/job/Hive-0.9.1-SNAPSHOT-h0.21/ws/hive/shims/src/common/java;/home/jenkins/jenkins-slave/workspace/Hive-0.9.1-SNAPSHOT-h0.21/hive/shims/src/common-secure/java;/home/jenkins/jenkins-slave/workspace/Hive-0.9.1-SNAPSHOT-h0.21/hive/shims/src/0.23/java>
against hadoop 0.23.1 (<https://builds.apache.org/job/Hive-0.9.1-SNAPSHOT-h0.21/185/artifact/hive/build/hadoopcore/hadoop-0.23.1)>

ivy-init-settings:
     [echo] Project: shims

ivy-resolve-hadoop-shim:
     [echo] Project: shims
[ivy:resolve] :: loading settings :: file = <https://builds.apache.org/job/Hive-0.9.1-SNAPSHOT-h0.21/ws/hive/ivy/ivysettings.xml>

ivy-retrieve-hadoop-shim:
     [echo] Project: shims

ivy-resolve-test:
     [echo] Project: shims

ivy-retrieve-test:
     [echo] Project: shims

compile-test:
     [echo] Project: shims

compile_secure_test:
     [echo] Project: shims
     [echo] Compiling shim tests against hadoop 1.0.0 (<https://builds.apache.org/job/Hive-0.9.1-SNAPSHOT-h0.21/185/artifact/hive/build/hadoopcore/hadoop-1.0.0)>
    [javac] Compiling 2 source files to <https://builds.apache.org/job/Hive-0.9.1-SNAPSHOT-h0.21/185/artifact/hive/build/shims/test/classes>

test-jar:
     [echo] Project: shims
      [jar] Building MANIFEST-only jar: <https://builds.apache.org/job/Hive-0.9.1-SNAPSHOT-h0.21/185/artifact/hive/build/shims/test/test-udfs.jar>

test-init:
     [echo] Project: shims
    [mkdir] Created dir: <https://builds.apache.org/job/Hive-0.9.1-SNAPSHOT-h0.21/185/artifact/hive/build/shims/test/data>
    [mkdir] Created dir: <https://builds.apache.org/job/Hive-0.9.1-SNAPSHOT-h0.21/185/artifact/hive/build/shims/test/logs/clientpositive>
    [mkdir] Created dir: <https://builds.apache.org/job/Hive-0.9.1-SNAPSHOT-h0.21/185/artifact/hive/build/shims/test/logs/clientnegative>
    [mkdir] Created dir: <https://builds.apache.org/job/Hive-0.9.1-SNAPSHOT-h0.21/185/artifact/hive/build/shims/test/logs/positive>
    [mkdir] Created dir: <https://builds.apache.org/job/Hive-0.9.1-SNAPSHOT-h0.21/185/artifact/hive/build/shims/test/logs/negative>
    [mkdir] Created dir: <https://builds.apache.org/job/Hive-0.9.1-SNAPSHOT-h0.21/185/artifact/hive/build/shims/test/data/warehouse>
    [mkdir] Created dir: <https://builds.apache.org/job/Hive-0.9.1-SNAPSHOT-h0.21/185/artifact/hive/build/shims/test/data/metadb>

test:
     [echo] Project: shims
    [junit] WARNING: multiple versions of ant detected in path for junit 
    [junit]          jar:file:/home/hudson/tools/ant/apache-ant-1.8.1/lib/ant.jar!/org/apache/tools/ant/Project.class
    [junit]      and jar:<https://builds.apache.org/job/Hive-0.9.1-SNAPSHOT-h0.21/185/artifact/hive/build/ivy/lib/hadoop0.20S.shim/ant-1.6.5.jar!/org/apache/tools/ant/Project.class>
    [junit] Running org.apache.hadoop.hive.thrift.TestHadoop20SAuthBridge
    [junit] WARNING: org.apache.hadoop.metrics.jvm.EventCounter is deprecated. Please use
org.apache.hadoop.log.metrics.EventCounter in all the log4j.properties files.
    [junit] org.apache.thrift.transport.TTransportException: Could not create ServerSocket
on address 0.0.0.0/0.0.0.0:10000.
    [junit] 	at org.apache.thrift.transport.TServerSocket.<init>(TServerSocket.java:93)
    [junit] 	at org.apache.thrift.transport.TServerSocket.<init>(TServerSocket.java:75)
    [junit] 	at org.apache.hadoop.hive.metastore.TServerSocketKeepAlive.<init>(TServerSocketKeepAlive.java:34)
    [junit] 	at org.apache.hadoop.hive.metastore.HiveMetaStore.startMetaStore(HiveMetaStore.java:2999)
    [junit] 	at org.apache.hadoop.hive.metastore.HiveMetaStore.startMetaStore(HiveMetaStore.java:2975)
    [junit] 	at org.apache.hadoop.hive.metastore.MetaStoreUtils$1.run(MetaStoreUtils.java:740)
    [junit] 	at java.lang.Thread.run(Thread.java:662)
    [junit] Tests run: 3, Failures: 0, Errors: 1, Time elapsed: 81.112 sec
    [junit] Test org.apache.hadoop.hive.thrift.TestHadoop20SAuthBridge FAILED
    [junit] Running org.apache.hadoop.hive.thrift.TestZooKeeperTokenStore
    [junit] WARNING: org.apache.hadoop.metrics.jvm.EventCounter is deprecated. Please use
org.apache.hadoop.log.metrics.EventCounter in all the log4j.properties files.
    [junit] Tests run: 4, Failures: 0, Errors: 0, Time elapsed: 1.548 sec

BUILD FAILED
<https://builds.apache.org/job/Hive-0.9.1-SNAPSHOT-h0.21/ws/hive/build.xml>:313: The
following error occurred while executing this line:
<https://builds.apache.org/job/Hive-0.9.1-SNAPSHOT-h0.21/ws/hive/build.xml>:331: The
following error occurred while executing this line:
<https://builds.apache.org/job/Hive-0.9.1-SNAPSHOT-h0.21/ws/hive/build-common.xml>:435:
Tests failed!

Total time: 1 minute 59 seconds
Build step 'Invoke Ant' marked build as failure
Archiving artifacts
Recording test results

Mime
View raw message