hive-dev mailing list archives

Site index · List index
Message view « Date » · « Thread »
Top « Date » · « Thread »
From Apache Jenkins Server <jenk...@builds.apache.org>
Subject Build failed in Jenkins: Hive-0.9.1-SNAPSHOT-h0.21-keepgoing=false #171
Date Thu, 18 Oct 2012 16:07:48 GMT
See <https://builds.apache.org/job/Hive-0.9.1-SNAPSHOT-h0.21-keepgoing=false/171/>

------------------------------------------
[...truncated 5746 lines...]
[ivy:resolve] .................................... (184kB)
[ivy:resolve] .. (0kB)
[ivy:resolve] 	[SUCCESSFUL ] commons-beanutils#commons-beanutils;1.7.0!commons-beanutils.jar
(84ms)
[ivy:resolve] downloading http://repo1.maven.org/maven2/org/mortbay/jetty/servlet-api/2.5-20081211/servlet-api-2.5-20081211.jar
...
[ivy:resolve] ................................ (130kB)
[ivy:resolve] .. (0kB)
[ivy:resolve] 	[SUCCESSFUL ] org.mortbay.jetty#servlet-api;2.5-20081211!servlet-api.jar (199ms)
[ivy:resolve] downloading http://repo1.maven.org/maven2/org/codehaus/jackson/jackson-core-asl/1.0.1/jackson-core-asl-1.0.1.jar
...
[ivy:resolve] ............................. (132kB)
[ivy:resolve] .. (0kB)
[ivy:resolve] 	[SUCCESSFUL ] org.codehaus.jackson#jackson-core-asl;1.0.1!jackson-core-asl.jar
(110ms)

ivy-retrieve-hadoop-shim:
     [echo] Project: shims
    [javac] Compiling 13 source files to <https://builds.apache.org/job/Hive-0.9.1-SNAPSHOT-h0.21-keepgoing=false/171/artifact/hive/build/shims/classes>
    [javac] Note: <https://builds.apache.org/job/Hive-0.9.1-SNAPSHOT-h0.21-keepgoing=false/ws/hive/shims/src/common-secure/java/org/apache/hadoop/hive/shims/HadoopShimsSecure.java>
uses or overrides a deprecated API.
    [javac] Note: Recompile with -Xlint:deprecation for details.
    [javac] Note: <https://builds.apache.org/job/Hive-0.9.1-SNAPSHOT-h0.21-keepgoing=false/ws/hive/shims/src/common-secure/java/org/apache/hadoop/hive/shims/HadoopShimsSecure.java>
uses unchecked or unsafe operations.
    [javac] Note: Recompile with -Xlint:unchecked for details.
     [echo] Building shims 0.23

build_shims:
     [echo] Project: shims
     [echo] Compiling <https://builds.apache.org/job/Hive-0.9.1-SNAPSHOT-h0.21-keepgoing=false/ws/hive/shims/src/common/java;/home/jenkins/jenkins-slave/workspace/Hive-0.9.1-SNAPSHOT-h0.21-keepgoing=false/hive/shims/src/common-secure/java;/home/jenkins/jenkins-slave/workspace/Hive-0.9.1-SNAPSHOT-h0.21-keepgoing=false/hive/shims/src/0.23/java>
against hadoop 0.23.1 (<https://builds.apache.org/job/Hive-0.9.1-SNAPSHOT-h0.21-keepgoing=false/171/artifact/hive/build/hadoopcore/hadoop-0.23.1)>

ivy-init-settings:
     [echo] Project: shims

ivy-resolve-hadoop-shim:
     [echo] Project: shims
[ivy:resolve] :: loading settings :: file = <https://builds.apache.org/job/Hive-0.9.1-SNAPSHOT-h0.21-keepgoing=false/ws/hive/ivy/ivysettings.xml>
[ivy:resolve] downloading http://repo1.maven.org/maven2/org/apache/hadoop/hadoop-common/0.23.1/hadoop-common-0.23.1.jar
...
[ivy:resolve] .........................................................................................................................................................................................................................................................................................................................................................................................................................................
(1725kB)
[ivy:resolve] .. (0kB)
[ivy:resolve] 	[SUCCESSFUL ] org.apache.hadoop#hadoop-common;0.23.1!hadoop-common.jar (3266ms)
[ivy:resolve] downloading http://repo1.maven.org/maven2/org/apache/hadoop/hadoop-mapreduce-client-core/0.23.1/hadoop-mapreduce-client-core-0.23.1.jar
...
[ivy:resolve] .............................................................................................................................................................................................................................................................................................
(1314kB)
[ivy:resolve] .. (0kB)
[ivy:resolve] 	[SUCCESSFUL ] org.apache.hadoop#hadoop-mapreduce-client-core;0.23.1!hadoop-mapreduce-client-core.jar
(207ms)
[ivy:resolve] downloading http://repo1.maven.org/maven2/org/apache/hadoop/hadoop-archives/0.23.1/hadoop-archives-0.23.1.jar
...
[ivy:resolve] ..... (20kB)
[ivy:resolve] .. (0kB)
[ivy:resolve] 	[SUCCESSFUL ] org.apache.hadoop#hadoop-archives;0.23.1!hadoop-archives.jar
(195ms)
[ivy:resolve] downloading http://repo1.maven.org/maven2/org/apache/hadoop/hadoop-hdfs/0.23.1/hadoop-hdfs-0.23.1.jar
...
[ivy:resolve] .................................................................................................................................................................................................................................................................................................................
(1725kB)
[ivy:resolve] .. (0kB)
[ivy:resolve] 	[SUCCESSFUL ] org.apache.hadoop#hadoop-hdfs;0.23.1!hadoop-hdfs.jar (156ms)
[ivy:resolve] downloading http://repo1.maven.org/maven2/org/apache/hadoop/hadoop-hdfs/0.23.1/hadoop-hdfs-0.23.1-tests.jar
...
[ivy:resolve] .........................................................................................................................................................................................................
(1107kB)
[ivy:resolve] .. (0kB)
[ivy:resolve] 	[SUCCESSFUL ] org.apache.hadoop#hadoop-hdfs;0.23.1!hadoop-hdfs.jar(tests) (169ms)
[ivy:resolve] downloading http://repo1.maven.org/maven2/javax/servlet/servlet-api/2.5/servlet-api-2.5.jar
...
[ivy:resolve] .................. (102kB)
[ivy:resolve] .. (0kB)
[ivy:resolve] 	[SUCCESSFUL ] javax.servlet#servlet-api;2.5!servlet-api.jar (32ms)
[ivy:resolve] downloading http://repo1.maven.org/maven2/com/sun/jersey/jersey-core/1.8/jersey-core-1.8.jar
...
[ivy:resolve] ..................................................................... (447kB)
[ivy:resolve] .. (0kB)
[ivy:resolve] 	[SUCCESSFUL ] com.sun.jersey#jersey-core;1.8!jersey-core.jar(bundle) (91ms)
[ivy:resolve] downloading http://repo1.maven.org/maven2/com/sun/jersey/jersey-server/1.8/jersey-server-1.8.jar
...
[ivy:resolve] ..............................................................................................................................
(678kB)
[ivy:resolve] .. (0kB)
[ivy:resolve] 	[SUCCESSFUL ] com.sun.jersey#jersey-server;1.8!jersey-server.jar(bundle) (86ms)
[ivy:resolve] downloading http://repo1.maven.org/maven2/tomcat/jasper-compiler/5.5.23/jasper-compiler-5.5.23.jar
...
[ivy:resolve] ......................................................................... (398kB)
[ivy:resolve] .. (0kB)
[ivy:resolve] 	[SUCCESSFUL ] tomcat#jasper-compiler;5.5.23!jasper-compiler.jar (489ms)
[ivy:resolve] downloading http://repo1.maven.org/maven2/log4j/log4j/1.2.15/log4j-1.2.15.jar
...
[ivy:resolve] ......................................................................... (382kB)
[ivy:resolve] .. (0kB)
[ivy:resolve] 	[SUCCESSFUL ] log4j#log4j;1.2.15!log4j.jar (261ms)
[ivy:resolve] downloading http://repo1.maven.org/maven2/commons-lang/commons-lang/2.5/commons-lang-2.5.jar
...
[ivy:resolve] .......................................................... (272kB)
[ivy:resolve] .. (0kB)
[ivy:resolve] 	[SUCCESSFUL ] commons-lang#commons-lang;2.5!commons-lang.jar (96ms)
[ivy:resolve] downloading http://repo1.maven.org/maven2/org/slf4j/slf4j-api/1.6.1/slf4j-api-1.6.1.jar
...
[ivy:resolve] ... (24kB)
[ivy:resolve] .. (0kB)
[ivy:resolve] 	[SUCCESSFUL ] org.slf4j#slf4j-api;1.6.1!slf4j-api.jar (31ms)
[ivy:resolve] downloading http://repo1.maven.org/maven2/org/apache/avro/avro/1.5.3/avro-1.5.3.jar
...
[ivy:resolve] .................................................... (257kB)
[ivy:resolve] .. (0kB)
[ivy:resolve] 	[SUCCESSFUL ] org.apache.avro#avro;1.5.3!avro.jar (762ms)
[ivy:resolve] downloading http://repo1.maven.org/maven2/com/google/protobuf/protobuf-java/2.4.0a/protobuf-java-2.4.0a.jar
...
[ivy:resolve] ..............................................................................................
(439kB)
[ivy:resolve] .. (0kB)
[ivy:resolve] 	[SUCCESSFUL ] com.google.protobuf#protobuf-java;2.4.0a!protobuf-java.jar (198ms)
[ivy:resolve] downloading http://repo1.maven.org/maven2/org/codehaus/jettison/jettison/1.1/jettison-1.1.jar
...
[ivy:resolve] .............. (66kB)
[ivy:resolve] .. (0kB)
[ivy:resolve] 	[SUCCESSFUL ] org.codehaus.jettison#jettison;1.1!jettison.jar(bundle) (71ms)
[ivy:resolve] downloading http://repo1.maven.org/maven2/stax/stax-api/1.0.1/stax-api-1.0.1.jar
...
[ivy:resolve] ..... (25kB)
[ivy:resolve] .. (0kB)
[ivy:resolve] 	[SUCCESSFUL ] stax#stax-api;1.0.1!stax-api.jar (77ms)
[ivy:resolve] downloading http://repo1.maven.org/maven2/javax/activation/activation/1.1/activation-1.1.jar
...
[ivy:resolve] ............ (61kB)
[ivy:resolve] .. (0kB)
[ivy:resolve] 	[SUCCESSFUL ] javax.activation#activation;1.1!activation.jar (24ms)
[ivy:resolve] downloading http://repo1.maven.org/maven2/com/thoughtworks/paranamer/paranamer/2.3/paranamer-2.3.jar
...
[ivy:resolve] ...... (28kB)
[ivy:resolve] .. (0kB)
[ivy:resolve] 	[SUCCESSFUL ] com.thoughtworks.paranamer#paranamer;2.3!paranamer.jar (13ms)
[ivy:resolve] downloading http://repo1.maven.org/maven2/org/xerial/snappy/snappy-java/1.0.3.2/snappy-java-1.0.3.2.jar
...
[ivy:resolve] ..............................................................................................................................................................................................................
(972kB)
[ivy:resolve] .. (0kB)
[ivy:resolve] 	[SUCCESSFUL ] org.xerial.snappy#snappy-java;1.0.3.2!snappy-java.jar(bundle)
(151ms)
[ivy:resolve] downloading http://repo1.maven.org/maven2/org/apache/velocity/velocity/1.7/velocity-1.7.jar
...
[ivy:resolve] .................................................................................
(438kB)
[ivy:resolve] .. (0kB)
[ivy:resolve] 	[SUCCESSFUL ] org.apache.velocity#velocity;1.7!velocity.jar (117ms)
[ivy:resolve] downloading http://repo1.maven.org/maven2/com/cenqua/clover/clover/3.0.2/clover-3.0.2.jar
...
[ivy:resolve] ...........................................................................................................................................................................................................................................................................................................................................................................................................................................................................................................................................................................................................................................................................................................................................................................................................................................................................................................................................................................................................................................................................................................................................................................................................................................................................................................................................................................................................................................................................................................................................................................................................................................................................................................................
[ivy:resolve] .......................................................................................................................................................................................................................................................................................................................................................................................................................................................................................................................................................................................................................................................................................................................................................
(11446kB)
[ivy:resolve] .. (0kB)
[ivy:resolve] 	[SUCCESSFUL ] com.cenqua.clover#clover;3.0.2!clover.jar (2443ms)
[ivy:resolve] downloading http://repo1.maven.org/maven2/jdiff/jdiff/1.0.9/jdiff-1.0.9.jar
...
[ivy:resolve] ........... (126kB)
[ivy:resolve] .. (0kB)
[ivy:resolve] 	[SUCCESSFUL ] jdiff#jdiff;1.0.9!jdiff.jar (71ms)
[ivy:resolve] downloading http://repo1.maven.org/maven2/com/google/inject/guice/3.0/guice-3.0.jar
...
[ivy:resolve] ............................................................................
(693kB)
[ivy:resolve] .. (0kB)
[ivy:resolve] 	[SUCCESSFUL ] com.google.inject#guice;3.0!guice.jar (151ms)
[ivy:resolve] downloading http://repo1.maven.org/maven2/javax/inject/javax.inject/1/javax.inject-1.jar
...
[ivy:resolve] .. (2kB)
[ivy:resolve] .. (0kB)
[ivy:resolve] 	[SUCCESSFUL ] javax.inject#javax.inject;1!javax.inject.jar (47ms)
[ivy:resolve] downloading http://repo1.maven.org/maven2/aopalliance/aopalliance/1.0/aopalliance-1.0.jar
...
[ivy:resolve] .. (4kB)
[ivy:resolve] .. (0kB)
[ivy:resolve] 	[SUCCESSFUL ] aopalliance#aopalliance;1.0!aopalliance.jar (53ms)
[ivy:resolve] downloading http://repo1.maven.org/maven2/org/sonatype/sisu/inject/cglib/2.2.1-v20090111/cglib-2.2.1-v20090111.jar
...
[ivy:resolve] .................................................... (272kB)
[ivy:resolve] .. (0kB)
[ivy:resolve] 	[SUCCESSFUL ] org.sonatype.sisu.inject#cglib;2.2.1-v20090111!cglib.jar (114ms)
[ivy:resolve] 
[ivy:resolve] :: problems summary ::
[ivy:resolve] :::: WARNINGS
[ivy:resolve] 	problem while downloading module descriptor: http://repo1.maven.org/maven2/commons-httpclient/commons-httpclient/3.1/commons-httpclient-3.1.pom:
/home/jenkins/.ivy2/cache/commons-httpclient/commons-httpclient/ivy-3.1.xml.original.part
(No such file or directory) (52ms)
[ivy:resolve] 		module not found: commons-httpclient#commons-httpclient;3.1
[ivy:resolve] 	==== local: tried
[ivy:resolve] 	  /home/jenkins/.ivy2/local/commons-httpclient/commons-httpclient/3.1/ivys/ivy.xml
[ivy:resolve] 	  -- artifact commons-httpclient#commons-httpclient;3.1!commons-httpclient.jar:
[ivy:resolve] 	  /home/jenkins/.ivy2/local/commons-httpclient/commons-httpclient/3.1/jars/commons-httpclient.jar
[ivy:resolve] 	==== apache-snapshot: tried
[ivy:resolve] 	  https://repository.apache.org/content/repositories/snapshots/commons-httpclient/commons-httpclient/3.1/commons-httpclient-3.1.pom
[ivy:resolve] 	  -- artifact commons-httpclient#commons-httpclient;3.1!commons-httpclient.jar:
[ivy:resolve] 	  https://repository.apache.org/content/repositories/snapshots/commons-httpclient/commons-httpclient/3.1/commons-httpclient-3.1.jar
[ivy:resolve] 	==== maven2: tried
[ivy:resolve] 	  http://repo1.maven.org/maven2/commons-httpclient/commons-httpclient/3.1/commons-httpclient-3.1.pom
[ivy:resolve] 	==== datanucleus-repo: tried
[ivy:resolve] 	  -- artifact commons-httpclient#commons-httpclient;3.1!commons-httpclient.jar:
[ivy:resolve] 	  http://www.datanucleus.org/downloads/maven2/commons-httpclient/commons-httpclient/3.1/commons-httpclient-3.1.jar
[ivy:resolve] 	==== hadoop-source: tried
[ivy:resolve] 	  -- artifact commons-httpclient#commons-httpclient;3.1!commons-httpclient.jar:
[ivy:resolve] 	  http://mirror.facebook.net/facebook/hive-deps/hadoop/core/commons-httpclient-3.1/commons-httpclient-3.1.jar
[ivy:resolve] 	==== hadoop-source2: tried
[ivy:resolve] 	  -- artifact commons-httpclient#commons-httpclient;3.1!commons-httpclient.jar:
[ivy:resolve] 	  http://archive.cloudera.com/hive-deps/hadoop/core/commons-httpclient-3.1/commons-httpclient-3.1.jar
[ivy:resolve] 	problem while downloading module descriptor: http://repo1.maven.org/maven2/net/java/dev/jets3t/jets3t/0.6.1/jets3t-0.6.1.pom:
/home/jenkins/.ivy2/cache/net.java.dev.jets3t/jets3t/ivy-0.6.1.xml.original.part (No such
file or directory) (56ms)
[ivy:resolve] 		module not found: net.java.dev.jets3t#jets3t;0.6.1
[ivy:resolve] 	==== local: tried
[ivy:resolve] 	  /home/jenkins/.ivy2/local/net.java.dev.jets3t/jets3t/0.6.1/ivys/ivy.xml
[ivy:resolve] 	  -- artifact net.java.dev.jets3t#jets3t;0.6.1!jets3t.jar:
[ivy:resolve] 	  /home/jenkins/.ivy2/local/net.java.dev.jets3t/jets3t/0.6.1/jars/jets3t.jar
[ivy:resolve] 	==== apache-snapshot: tried
[ivy:resolve] 	  https://repository.apache.org/content/repositories/snapshots/net/java/dev/jets3t/jets3t/0.6.1/jets3t-0.6.1.pom
[ivy:resolve] 	  -- artifact net.java.dev.jets3t#jets3t;0.6.1!jets3t.jar:
[ivy:resolve] 	  https://repository.apache.org/content/repositories/snapshots/net/java/dev/jets3t/jets3t/0.6.1/jets3t-0.6.1.jar
[ivy:resolve] 	==== maven2: tried
[ivy:resolve] 	  http://repo1.maven.org/maven2/net/java/dev/jets3t/jets3t/0.6.1/jets3t-0.6.1.pom
[ivy:resolve] 	==== datanucleus-repo: tried
[ivy:resolve] 	  -- artifact net.java.dev.jets3t#jets3t;0.6.1!jets3t.jar:
[ivy:resolve] 	  http://www.datanucleus.org/downloads/maven2/net/java/dev/jets3t/jets3t/0.6.1/jets3t-0.6.1.jar
[ivy:resolve] 	==== hadoop-source: tried
[ivy:resolve] 	  -- artifact net.java.dev.jets3t#jets3t;0.6.1!jets3t.jar:
[ivy:resolve] 	  http://mirror.facebook.net/facebook/hive-deps/hadoop/core/jets3t-0.6.1/jets3t-0.6.1.jar
[ivy:resolve] 	==== hadoop-source2: tried
[ivy:resolve] 	  -- artifact net.java.dev.jets3t#jets3t;0.6.1!jets3t.jar:
[ivy:resolve] 	  http://archive.cloudera.com/hive-deps/hadoop/core/jets3t-0.6.1/jets3t-0.6.1.jar
[ivy:resolve] 	impossible to put metadata file in cache: http://repo1.maven.org/maven2/org/slf4j/slf4j-parent/1.6.1/slf4j-parent-1.6.1.pom
(1.6.1). java.io.FileNotFoundException: /home/jenkins/.ivy2/cache/org.slf4j/slf4j-parent/ivy-1.6.1.xml.original
(No such file or directory)
[ivy:resolve] 	impossible to put metadata file in cache: http://repo1.maven.org/maven2/org/apache/avro/avro-parent/1.5.3/avro-parent-1.5.3.pom
(1.5.3). java.io.FileNotFoundException: /home/jenkins/.ivy2/cache/org.apache.avro/avro-parent/ivy-1.5.3.xml.original
(No such file or directory)
[ivy:resolve] 	problem while downloading module descriptor: http://repo1.maven.org/maven2/com/googlecode/json-simple/json-simple/1.1/json-simple-1.1.pom:
/home/jenkins/.ivy2/cache/com.googlecode.json-simple/json-simple/ivy-1.1.xml.original.part
(No such file or directory) (18ms)
[ivy:resolve] 		module not found: com.googlecode.json-simple#json-simple;1.1
[ivy:resolve] 	==== local: tried
[ivy:resolve] 	  /home/jenkins/.ivy2/local/com.googlecode.json-simple/json-simple/1.1/ivys/ivy.xml
[ivy:resolve] 	  -- artifact com.googlecode.json-simple#json-simple;1.1!json-simple.jar:
[ivy:resolve] 	  /home/jenkins/.ivy2/local/com.googlecode.json-simple/json-simple/1.1/jars/json-simple.jar
[ivy:resolve] 	==== apache-snapshot: tried
[ivy:resolve] 	  https://repository.apache.org/content/repositories/snapshots/com/googlecode/json-simple/json-simple/1.1/json-simple-1.1.pom
[ivy:resolve] 	  -- artifact com.googlecode.json-simple#json-simple;1.1!json-simple.jar:
[ivy:resolve] 	  https://repository.apache.org/content/repositories/snapshots/com/googlecode/json-simple/json-simple/1.1/json-simple-1.1.jar
[ivy:resolve] 	==== maven2: tried
[ivy:resolve] 	  http://repo1.maven.org/maven2/com/googlecode/json-simple/json-simple/1.1/json-simple-1.1.pom
[ivy:resolve] 	==== datanucleus-repo: tried
[ivy:resolve] 	  -- artifact com.googlecode.json-simple#json-simple;1.1!json-simple.jar:
[ivy:resolve] 	  http://www.datanucleus.org/downloads/maven2/com/googlecode/json-simple/json-simple/1.1/json-simple-1.1.jar
[ivy:resolve] 	==== hadoop-source: tried
[ivy:resolve] 	  -- artifact com.googlecode.json-simple#json-simple;1.1!json-simple.jar:
[ivy:resolve] 	  http://mirror.facebook.net/facebook/hive-deps/hadoop/core/json-simple-1.1/json-simple-1.1.jar
[ivy:resolve] 	==== hadoop-source2: tried
[ivy:resolve] 	  -- artifact com.googlecode.json-simple#json-simple;1.1!json-simple.jar:
[ivy:resolve] 	  http://archive.cloudera.com/hive-deps/hadoop/core/json-simple-1.1/json-simple-1.1.jar
[ivy:resolve] 	problem while downloading module descriptor: http://repo1.maven.org/maven2/org/apache/hadoop/hadoop-yarn-common/0.23.1/hadoop-yarn-common-0.23.1.pom:
Downloaded file size doesn't match expected Content Length for http://repo1.maven.org/maven2/org/apache/hadoop/hadoop-yarn-common/0.23.1/hadoop-yarn-common-0.23.1.pom.
Please retry. (19ms)
[ivy:resolve] 		module not found: org.apache.hadoop#hadoop-yarn-common;0.23.1
[ivy:resolve] 	==== local: tried
[ivy:resolve] 	  /home/jenkins/.ivy2/local/org.apache.hadoop/hadoop-yarn-common/0.23.1/ivys/ivy.xml
[ivy:resolve] 	  -- artifact org.apache.hadoop#hadoop-yarn-common;0.23.1!hadoop-yarn-common.jar:
[ivy:resolve] 	  /home/jenkins/.ivy2/local/org.apache.hadoop/hadoop-yarn-common/0.23.1/jars/hadoop-yarn-common.jar
[ivy:resolve] 	==== apache-snapshot: tried
[ivy:resolve] 	  https://repository.apache.org/content/repositories/snapshots/org/apache/hadoop/hadoop-yarn-common/0.23.1/hadoop-yarn-common-0.23.1.pom
[ivy:resolve] 	  -- artifact org.apache.hadoop#hadoop-yarn-common;0.23.1!hadoop-yarn-common.jar:
[ivy:resolve] 	  https://repository.apache.org/content/repositories/snapshots/org/apache/hadoop/hadoop-yarn-common/0.23.1/hadoop-yarn-common-0.23.1.jar
[ivy:resolve] 	==== maven2: tried
[ivy:resolve] 	  http://repo1.maven.org/maven2/org/apache/hadoop/hadoop-yarn-common/0.23.1/hadoop-yarn-common-0.23.1.pom
[ivy:resolve] 	==== datanucleus-repo: tried
[ivy:resolve] 	  -- artifact org.apache.hadoop#hadoop-yarn-common;0.23.1!hadoop-yarn-common.jar:
[ivy:resolve] 	  http://www.datanucleus.org/downloads/maven2/org/apache/hadoop/hadoop-yarn-common/0.23.1/hadoop-yarn-common-0.23.1.jar
[ivy:resolve] 	==== hadoop-source: tried
[ivy:resolve] 	  -- artifact org.apache.hadoop#hadoop-yarn-common;0.23.1!hadoop-yarn-common.jar:
[ivy:resolve] 	  http://mirror.facebook.net/facebook/hive-deps/hadoop/core/hadoop-yarn-common-0.23.1/hadoop-yarn-common-0.23.1.jar
[ivy:resolve] 	==== hadoop-source2: tried
[ivy:resolve] 	  -- artifact org.apache.hadoop#hadoop-yarn-common;0.23.1!hadoop-yarn-common.jar:
[ivy:resolve] 	  http://archive.cloudera.com/hive-deps/hadoop/core/hadoop-yarn-common-0.23.1/hadoop-yarn-common-0.23.1.jar
[ivy:resolve] 		::::::::::::::::::::::::::::::::::::::::::::::
[ivy:resolve] 		::          UNRESOLVED DEPENDENCIES         ::
[ivy:resolve] 		::::::::::::::::::::::::::::::::::::::::::::::
[ivy:resolve] 		:: commons-httpclient#commons-httpclient;3.1: not found
[ivy:resolve] 		:: net.java.dev.jets3t#jets3t;0.6.1: not found
[ivy:resolve] 		:: com.googlecode.json-simple#json-simple;1.1: not found
[ivy:resolve] 		:: org.apache.hadoop#hadoop-yarn-common;0.23.1: not found
[ivy:resolve] 		::::::::::::::::::::::::::::::::::::::::::::::
[ivy:resolve] 
[ivy:resolve] :: USE VERBOSE OR DEBUG MESSAGE LEVEL FOR MORE DETAILS

BUILD FAILED
<https://builds.apache.org/job/Hive-0.9.1-SNAPSHOT-h0.21-keepgoing=false/ws/hive/build.xml>:302:
The following error occurred while executing this line:
<https://builds.apache.org/job/Hive-0.9.1-SNAPSHOT-h0.21-keepgoing=false/ws/hive/build.xml>:152:
The following error occurred while executing this line:
<https://builds.apache.org/job/Hive-0.9.1-SNAPSHOT-h0.21-keepgoing=false/ws/hive/shims/build.xml>:85:
The following error occurred while executing this line:
<https://builds.apache.org/job/Hive-0.9.1-SNAPSHOT-h0.21-keepgoing=false/ws/hive/shims/build.xml>:88:
The following error occurred while executing this line:
<https://builds.apache.org/job/Hive-0.9.1-SNAPSHOT-h0.21-keepgoing=false/ws/hive/shims/build.xml>:60:
The following error occurred while executing this line:
<https://builds.apache.org/job/Hive-0.9.1-SNAPSHOT-h0.21-keepgoing=false/ws/hive/build-common.xml>:164:
impossible to resolve dependencies:
	resolve failed - see output for details

Total time: 2 minutes 33 seconds
Build step 'Invoke Ant' marked build as failure
Archiving artifacts
Recording test results

Mime
View raw message