hive-dev mailing list archives

Site index · List index
Message view « Date » · « Thread »
Top « Date » · « Thread »
From Apache Jenkins Server <jenk...@builds.apache.org>
Subject Build failed in Jenkins: Hive-0.9.1-SNAPSHOT-h0.21-keepgoing=false #157
Date Wed, 03 Oct 2012 16:02:46 GMT
See <https://builds.apache.org/job/Hive-0.9.1-SNAPSHOT-h0.21-keepgoing=false/157/>

------------------------------------------
[...truncated 5071 lines...]
A         ql/src/gen/thrift/gen-javabean/org/apache/hadoop/hive/ql
A         ql/src/gen/thrift/gen-javabean/org/apache/hadoop/hive/ql/plan
A         ql/src/gen/thrift/gen-javabean/org/apache/hadoop/hive/ql/plan/api
A         ql/src/gen/thrift/gen-javabean/org/apache/hadoop/hive/ql/plan/api/QueryPlan.java
A         ql/src/gen/thrift/gen-javabean/org/apache/hadoop/hive/ql/plan/api/Adjacency.java
A         ql/src/gen/thrift/gen-javabean/org/apache/hadoop/hive/ql/plan/api/Graph.java
A         ql/src/gen/thrift/gen-javabean/org/apache/hadoop/hive/ql/plan/api/Task.java
A         ql/src/gen/thrift/gen-javabean/org/apache/hadoop/hive/ql/plan/api/AdjacencyType.java
A         ql/src/gen/thrift/gen-javabean/org/apache/hadoop/hive/ql/plan/api/Stage.java
A         ql/src/gen/thrift/gen-javabean/org/apache/hadoop/hive/ql/plan/api/TaskType.java
A         ql/src/gen/thrift/gen-javabean/org/apache/hadoop/hive/ql/plan/api/Query.java
A         ql/src/gen/thrift/gen-javabean/org/apache/hadoop/hive/ql/plan/api/StageType.java
A         ql/src/gen/thrift/gen-javabean/org/apache/hadoop/hive/ql/plan/api/NodeType.java
A         ql/src/gen/thrift/gen-javabean/org/apache/hadoop/hive/ql/plan/api/Operator.java
A         ql/src/gen/thrift/gen-javabean/org/apache/hadoop/hive/ql/plan/api/OperatorType.java
A         ql/src/gen/thrift/gen-php
A         ql/src/gen/thrift/gen-php/queryplan
A         ql/src/gen/thrift/gen-php/queryplan/queryplan_types.php
A         ql/src/gen-javabean
A         ql/src/gen-javabean/org
A         ql/src/gen-javabean/org/apache
A         ql/src/gen-javabean/org/apache/hadoop
A         ql/src/gen-javabean/org/apache/hadoop/hive
A         ql/src/gen-javabean/org/apache/hadoop/hive/ql
A         ql/src/gen-javabean/org/apache/hadoop/hive/ql/plan
A         ql/src/gen-javabean/org/apache/hadoop/hive/ql/plan/api
A         ql/src/gen-php
A         ql/build.xml
A         ql/if
A         ql/if/queryplan.thrift
A         pdk
A         pdk/ivy.xml
A         pdk/scripts
A         pdk/scripts/class-registration.xsl
A         pdk/scripts/build-plugin.xml
A         pdk/scripts/README
A         pdk/src
A         pdk/src/java
A         pdk/src/java/org
A         pdk/src/java/org/apache
A         pdk/src/java/org/apache/hive
A         pdk/src/java/org/apache/hive/pdk
A         pdk/src/java/org/apache/hive/pdk/FunctionExtractor.java
A         pdk/src/java/org/apache/hive/pdk/HivePdkUnitTest.java
A         pdk/src/java/org/apache/hive/pdk/HivePdkUnitTests.java
A         pdk/src/java/org/apache/hive/pdk/PluginTest.java
A         pdk/test-plugin
A         pdk/test-plugin/test
A         pdk/test-plugin/test/cleanup.sql
A         pdk/test-plugin/test/onerow.txt
A         pdk/test-plugin/test/setup.sql
A         pdk/test-plugin/src
A         pdk/test-plugin/src/org
A         pdk/test-plugin/src/org/apache
A         pdk/test-plugin/src/org/apache/hive
A         pdk/test-plugin/src/org/apache/hive/pdktest
A         pdk/test-plugin/src/org/apache/hive/pdktest/Rot13.java
A         pdk/test-plugin/build.xml
A         pdk/build.xml
A         build-offline.xml
 U        .
At revision 1393573
no change for http://svn.apache.org/repos/asf/hive/branches/branch-0.9 since the previous
build
[hive] $ /home/hudson/tools/ant/apache-ant-1.8.1/bin/ant -Dversion=0.9.1-SNAPSHOT very-clean
tar binary
Buildfile: /x1/jenkins/jenkins-slave/workspace/Hive-0.9.1-SNAPSHOT-h0.21-keepgoing=false/hive/build.xml

ivy-init-dirs:
     [echo] Project: hive
    [mkdir] Created dir: /x1/jenkins/jenkins-slave/workspace/Hive-0.9.1-SNAPSHOT-h0.21-keepgoing=false/hive/build/ivy
    [mkdir] Created dir: /x1/jenkins/jenkins-slave/workspace/Hive-0.9.1-SNAPSHOT-h0.21-keepgoing=false/hive/build/ivy/lib
    [mkdir] Created dir: /x1/jenkins/jenkins-slave/workspace/Hive-0.9.1-SNAPSHOT-h0.21-keepgoing=false/hive/build/ivy/report
    [mkdir] Created dir: /x1/jenkins/jenkins-slave/workspace/Hive-0.9.1-SNAPSHOT-h0.21-keepgoing=false/hive/build/ivy/maven

ivy-download:
     [echo] Project: hive
      [get] Getting: http://repo2.maven.org/maven2/org/apache/ivy/ivy/2.1.0/ivy-2.1.0.jar
      [get] To: /x1/jenkins/jenkins-slave/workspace/Hive-0.9.1-SNAPSHOT-h0.21-keepgoing=false/hive/build/ivy/lib/ivy-2.1.0.jar

ivy-probe-antlib:
     [echo] Project: hive

ivy-init-antlib:
     [echo] Project: hive

ivy-clean-cache:
[ivy:cleancache] :: Ivy 2.1.0 - 20090925235825 :: http://ant.apache.org/ivy/ ::
[ivy:cleancache] :: loading settings :: url = jar:file:/x1/jenkins/jenkins-slave/workspace/Hive-0.9.1-SNAPSHOT-h0.21-keepgoing=false/hive/build/ivy/lib/ivy-2.1.0.jar!/org/apache/ivy/core/settings/ivysettings.xml

clean:
     [echo] Project: hive

clean:
     [echo] Project: anttasks

clean:
     [echo] Project: shims

clean:
     [echo] Project: common

clean:
     [echo] Project: serde

clean:
     [echo] Project: metastore

clean:
     [echo] Project: ql

clean:
     [echo] Project: contrib

clean:
     [echo] Project: service

clean:
     [echo] Project: cli

clean:
     [echo] Project: jdbc

clean:
     [echo] Project: hwi

clean:
     [echo] Project: hbase-handler

clean:
     [echo] Project: pdk

clean:
     [echo] Project: builtins

clean:

clean:
     [echo] Project: odbc
     [exec] rm -rf /x1/jenkins/jenkins-slave/workspace/Hive-0.9.1-SNAPSHOT-h0.21-keepgoing=false/hive/build/odbc
/x1/jenkins/jenkins-slave/workspace/Hive-0.9.1-SNAPSHOT-h0.21-keepgoing=false/hive/build/service/objs
/x1/jenkins/jenkins-slave/workspace/Hive-0.9.1-SNAPSHOT-h0.21-keepgoing=false/hive/build/ql/objs
/x1/jenkins/jenkins-slave/workspace/Hive-0.9.1-SNAPSHOT-h0.21-keepgoing=false/hive/build/metastore/objs

clean-online:
     [echo] Project: hive
   [delete] Deleting directory /x1/jenkins/jenkins-slave/workspace/Hive-0.9.1-SNAPSHOT-h0.21-keepgoing=false/hive/build

clean-offline:

very-clean:

ivy-init-dirs:
     [echo] Project: hive
    [mkdir] Created dir: /x1/jenkins/jenkins-slave/workspace/Hive-0.9.1-SNAPSHOT-h0.21-keepgoing=false/hive/build/ivy
    [mkdir] Created dir: /x1/jenkins/jenkins-slave/workspace/Hive-0.9.1-SNAPSHOT-h0.21-keepgoing=false/hive/build/ivy/lib
    [mkdir] Created dir: /x1/jenkins/jenkins-slave/workspace/Hive-0.9.1-SNAPSHOT-h0.21-keepgoing=false/hive/build/ivy/report
    [mkdir] Created dir: /x1/jenkins/jenkins-slave/workspace/Hive-0.9.1-SNAPSHOT-h0.21-keepgoing=false/hive/build/ivy/maven

ivy-download:
     [echo] Project: hive
      [get] Getting: http://repo2.maven.org/maven2/org/apache/ivy/ivy/2.1.0/ivy-2.1.0.jar
      [get] To: /x1/jenkins/jenkins-slave/workspace/Hive-0.9.1-SNAPSHOT-h0.21-keepgoing=false/hive/build/ivy/lib/ivy-2.1.0.jar

ivy-probe-antlib:
     [echo] Project: hive

ivy-init-antlib:

compile-ant-tasks:
     [echo] Project: hive

create-dirs:
     [echo] Project: anttasks
    [mkdir] Created dir: /x1/jenkins/jenkins-slave/workspace/Hive-0.9.1-SNAPSHOT-h0.21-keepgoing=false/hive/build/anttasks
    [mkdir] Created dir: /x1/jenkins/jenkins-slave/workspace/Hive-0.9.1-SNAPSHOT-h0.21-keepgoing=false/hive/build/anttasks/classes
    [mkdir] Created dir: /x1/jenkins/jenkins-slave/workspace/Hive-0.9.1-SNAPSHOT-h0.21-keepgoing=false/hive/build/jexl/classes
    [mkdir] Created dir: /x1/jenkins/jenkins-slave/workspace/Hive-0.9.1-SNAPSHOT-h0.21-keepgoing=false/hive/build/hadoopcore
    [mkdir] Created dir: /x1/jenkins/jenkins-slave/workspace/Hive-0.9.1-SNAPSHOT-h0.21-keepgoing=false/hive/build/anttasks/test
    [mkdir] Created dir: /x1/jenkins/jenkins-slave/workspace/Hive-0.9.1-SNAPSHOT-h0.21-keepgoing=false/hive/build/anttasks/test/src
    [mkdir] Created dir: /x1/jenkins/jenkins-slave/workspace/Hive-0.9.1-SNAPSHOT-h0.21-keepgoing=false/hive/build/anttasks/test/classes
    [mkdir] Created dir: /x1/jenkins/jenkins-slave/workspace/Hive-0.9.1-SNAPSHOT-h0.21-keepgoing=false/hive/build/anttasks/test/resources
     [copy] Warning: /x1/jenkins/jenkins-slave/workspace/Hive-0.9.1-SNAPSHOT-h0.21-keepgoing=false/hive/ant/src/test/resources
does not exist.

init:
     [echo] Project: anttasks

ivy-init-settings:
     [echo] Project: anttasks

ivy-resolve:
     [echo] Project: anttasks
[ivy:resolve] :: loading settings :: file = /x1/jenkins/jenkins-slave/workspace/Hive-0.9.1-SNAPSHOT-h0.21-keepgoing=false/hive/ivy/ivysettings.xml
[ivy:resolve] downloading http://repo1.maven.org/maven2/commons-lang/commons-lang/2.4/commons-lang-2.4.jar
...
[ivy:resolve] ............................. (255kB)
[ivy:resolve] .. (0kB)
[ivy:resolve] 	[SUCCESSFUL ] commons-lang#commons-lang;2.4!commons-lang.jar (67ms)
[ivy:resolve] downloading http://repo1.maven.org/maven2/velocity/velocity/1.5/velocity-1.5.jar
...
[ivy:resolve] ....................................... (382kB)
[ivy:resolve] .. (0kB)
[ivy:resolve] 	[SUCCESSFUL ] velocity#velocity;1.5!velocity.jar (56ms)
[ivy:report] Processing /x1/jenkins/jenkins-slave/workspace/Hive-0.9.1-SNAPSHOT-h0.21-keepgoing=false/hive/build/ivy/resolution-cache/org.apache.hive-hive-anttasks-default.xml
to /x1/jenkins/jenkins-slave/workspace/Hive-0.9.1-SNAPSHOT-h0.21-keepgoing=false/hive/build/ivy/report/org.apache.hive-hive-anttasks-default.html

ivy-retrieve:
     [echo] Project: anttasks

BUILD FAILED
/x1/jenkins/jenkins-slave/workspace/Hive-0.9.1-SNAPSHOT-h0.21-keepgoing=false/hive/build.xml:256:
The following error occurred while executing this line:
/x1/jenkins/jenkins-slave/workspace/Hive-0.9.1-SNAPSHOT-h0.21-keepgoing=false/hive/build-common.xml:135:
impossible to ivy retrieve: java.lang.RuntimeException: problem during retrieve of org.apache.hive#hive-anttasks:
java.io.FileNotFoundException: /home/jenkins/.ivy2/cache/commons-lang/commons-lang/jars/commons-lang-2.4.jar
(No such file or directory)
	at org.apache.ivy.core.retrieve.RetrieveEngine.retrieve(RetrieveEngine.java:206)
	at org.apache.ivy.Ivy.retrieve(Ivy.java:540)
	at org.apache.ivy.ant.IvyRetrieve.doExecute(IvyRetrieve.java:59)
	at org.apache.ivy.ant.IvyTask.execute(IvyTask.java:277)
	at org.apache.tools.ant.UnknownElement.execute(UnknownElement.java:291)
	at sun.reflect.GeneratedMethodAccessor4.invoke(Unknown Source)
	at sun.reflect.DelegatingMethodAccessorImpl.invoke(DelegatingMethodAccessorImpl.java:25)
	at java.lang.reflect.Method.invoke(Method.java:597)
	at org.apache.tools.ant.dispatch.DispatchUtils.execute(DispatchUtils.java:106)
	at org.apache.tools.ant.Task.perform(Task.java:348)
	at org.apache.tools.ant.Target.execute(Target.java:390)
	at org.apache.tools.ant.Target.performTasks(Target.java:411)
	at org.apache.tools.ant.Project.executeSortedTargets(Project.java:1399)
	at org.apache.tools.ant.helper.SingleCheckExecutor.executeTargets(SingleCheckExecutor.java:38)
	at org.apache.tools.ant.Project.executeTargets(Project.java:1251)
	at org.apache.tools.ant.taskdefs.Ant.execute(Ant.java:442)
	at org.apache.tools.ant.taskdefs.SubAnt.execute(SubAnt.java:302)
	at org.apache.tools.ant.taskdefs.SubAnt.execute(SubAnt.java:221)
	at org.apache.tools.ant.UnknownElement.execute(UnknownElement.java:291)
	at sun.reflect.GeneratedMethodAccessor4.invoke(Unknown Source)
	at sun.reflect.DelegatingMethodAccessorImpl.invoke(DelegatingMethodAccessorImpl.java:25)
	at java.lang.reflect.Method.invoke(Method.java:597)
	at org.apache.tools.ant.dispatch.DispatchUtils.execute(DispatchUtils.java:106)
	at org.apache.tools.ant.Task.perform(Task.java:348)
	at org.apache.tools.ant.Target.execute(Target.java:390)
	at org.apache.tools.ant.Target.performTasks(Target.java:411)
	at org.apache.tools.ant.Project.executeSortedTargets(Project.java:1399)
	at org.apache.tools.ant.Project.executeTarget(Project.java:1368)
	at org.apache.tools.ant.helper.DefaultExecutor.executeTargets(DefaultExecutor.java:41)
	at org.apache.tools.ant.Project.executeTargets(Project.java:1251)
	at org.apache.tools.ant.Main.runBuild(Main.java:809)
	at org.apache.tools.ant.Main.startAnt(Main.java:217)
	at org.apache.tools.ant.launch.Launcher.run(Launcher.java:280)
	at org.apache.tools.ant.launch.Launcher.main(Launcher.java:109)
Caused by: java.io.FileNotFoundException: /home/jenkins/.ivy2/cache/commons-lang/commons-lang/jars/commons-lang-2.4.jar
(No such file or directory)
	at java.io.FileInputStream.open(Native Method)
	at java.io.FileInputStream.<init>(FileInputStream.java:120)
	at org.apache.ivy.util.FileUtil.copy(FileUtil.java:122)
	at org.apache.ivy.core.retrieve.RetrieveEngine.retrieve(RetrieveEngine.java:140)
	... 33 more

Total time: 10 seconds
Build step 'Invoke Ant' marked build as failure
Archiving artifacts
Recording test results

Mime
View raw message