hive-dev mailing list archives

Site index · List index
Message view « Date » · « Thread »
Top « Date » · « Thread »
From Apache Jenkins Server <jenk...@builds.apache.org>
Subject Build failed in Jenkins: Hive-0.9.1-SNAPSHOT-h0.21-keepgoing=false #184
Date Wed, 31 Oct 2012 16:05:05 GMT
See <https://builds.apache.org/job/Hive-0.9.1-SNAPSHOT-h0.21-keepgoing=false/184/>

------------------------------------------
[...truncated 5386 lines...]

init:
     [echo] Project: ql

create-dirs:
     [echo] Project: contrib
    [mkdir] Created dir: <https://builds.apache.org/job/Hive-0.9.1-SNAPSHOT-h0.21-keepgoing=false/184/artifact/hive/build/contrib>
    [mkdir] Created dir: <https://builds.apache.org/job/Hive-0.9.1-SNAPSHOT-h0.21-keepgoing=false/184/artifact/hive/build/contrib/classes>
    [mkdir] Created dir: <https://builds.apache.org/job/Hive-0.9.1-SNAPSHOT-h0.21-keepgoing=false/184/artifact/hive/build/contrib/test>
    [mkdir] Created dir: <https://builds.apache.org/job/Hive-0.9.1-SNAPSHOT-h0.21-keepgoing=false/184/artifact/hive/build/contrib/test/src>
    [mkdir] Created dir: <https://builds.apache.org/job/Hive-0.9.1-SNAPSHOT-h0.21-keepgoing=false/184/artifact/hive/build/contrib/test/classes>
    [mkdir] Created dir: <https://builds.apache.org/job/Hive-0.9.1-SNAPSHOT-h0.21-keepgoing=false/184/artifact/hive/build/contrib/test/resources>
     [copy] Warning: <https://builds.apache.org/job/Hive-0.9.1-SNAPSHOT-h0.21-keepgoing=false/ws/hive/contrib/src/test/resources>
does not exist.

init:
     [echo] Project: contrib

create-dirs:
     [echo] Project: service
    [mkdir] Created dir: <https://builds.apache.org/job/Hive-0.9.1-SNAPSHOT-h0.21-keepgoing=false/184/artifact/hive/build/service>
    [mkdir] Created dir: <https://builds.apache.org/job/Hive-0.9.1-SNAPSHOT-h0.21-keepgoing=false/184/artifact/hive/build/service/classes>
    [mkdir] Created dir: <https://builds.apache.org/job/Hive-0.9.1-SNAPSHOT-h0.21-keepgoing=false/184/artifact/hive/build/service/test>
    [mkdir] Created dir: <https://builds.apache.org/job/Hive-0.9.1-SNAPSHOT-h0.21-keepgoing=false/184/artifact/hive/build/service/test/src>
    [mkdir] Created dir: <https://builds.apache.org/job/Hive-0.9.1-SNAPSHOT-h0.21-keepgoing=false/184/artifact/hive/build/service/test/classes>
    [mkdir] Created dir: <https://builds.apache.org/job/Hive-0.9.1-SNAPSHOT-h0.21-keepgoing=false/184/artifact/hive/build/service/test/resources>
     [copy] Warning: <https://builds.apache.org/job/Hive-0.9.1-SNAPSHOT-h0.21-keepgoing=false/ws/hive/service/src/test/resources>
does not exist.

init:
     [echo] Project: service

create-dirs:
     [echo] Project: cli
    [mkdir] Created dir: <https://builds.apache.org/job/Hive-0.9.1-SNAPSHOT-h0.21-keepgoing=false/184/artifact/hive/build/cli>
    [mkdir] Created dir: <https://builds.apache.org/job/Hive-0.9.1-SNAPSHOT-h0.21-keepgoing=false/184/artifact/hive/build/cli/classes>
    [mkdir] Created dir: <https://builds.apache.org/job/Hive-0.9.1-SNAPSHOT-h0.21-keepgoing=false/184/artifact/hive/build/cli/test>
    [mkdir] Created dir: <https://builds.apache.org/job/Hive-0.9.1-SNAPSHOT-h0.21-keepgoing=false/184/artifact/hive/build/cli/test/src>
    [mkdir] Created dir: <https://builds.apache.org/job/Hive-0.9.1-SNAPSHOT-h0.21-keepgoing=false/184/artifact/hive/build/cli/test/classes>
    [mkdir] Created dir: <https://builds.apache.org/job/Hive-0.9.1-SNAPSHOT-h0.21-keepgoing=false/184/artifact/hive/build/cli/test/resources>
     [copy] Warning: <https://builds.apache.org/job/Hive-0.9.1-SNAPSHOT-h0.21-keepgoing=false/ws/hive/cli/src/test/resources>
does not exist.

init:
     [echo] Project: cli

create-dirs:
     [echo] Project: jdbc
    [mkdir] Created dir: <https://builds.apache.org/job/Hive-0.9.1-SNAPSHOT-h0.21-keepgoing=false/184/artifact/hive/build/jdbc>
    [mkdir] Created dir: <https://builds.apache.org/job/Hive-0.9.1-SNAPSHOT-h0.21-keepgoing=false/184/artifact/hive/build/jdbc/classes>
    [mkdir] Created dir: <https://builds.apache.org/job/Hive-0.9.1-SNAPSHOT-h0.21-keepgoing=false/184/artifact/hive/build/jdbc/test>
    [mkdir] Created dir: <https://builds.apache.org/job/Hive-0.9.1-SNAPSHOT-h0.21-keepgoing=false/184/artifact/hive/build/jdbc/test/src>
    [mkdir] Created dir: <https://builds.apache.org/job/Hive-0.9.1-SNAPSHOT-h0.21-keepgoing=false/184/artifact/hive/build/jdbc/test/classes>
    [mkdir] Created dir: <https://builds.apache.org/job/Hive-0.9.1-SNAPSHOT-h0.21-keepgoing=false/184/artifact/hive/build/jdbc/test/resources>
     [copy] Warning: <https://builds.apache.org/job/Hive-0.9.1-SNAPSHOT-h0.21-keepgoing=false/ws/hive/jdbc/src/test/resources>
does not exist.

init:
     [echo] Project: jdbc

create-dirs:
     [echo] Project: hwi
    [mkdir] Created dir: <https://builds.apache.org/job/Hive-0.9.1-SNAPSHOT-h0.21-keepgoing=false/184/artifact/hive/build/hwi>
    [mkdir] Created dir: <https://builds.apache.org/job/Hive-0.9.1-SNAPSHOT-h0.21-keepgoing=false/184/artifact/hive/build/hwi/classes>
    [mkdir] Created dir: <https://builds.apache.org/job/Hive-0.9.1-SNAPSHOT-h0.21-keepgoing=false/184/artifact/hive/build/hwi/test>
    [mkdir] Created dir: <https://builds.apache.org/job/Hive-0.9.1-SNAPSHOT-h0.21-keepgoing=false/184/artifact/hive/build/hwi/test/src>
    [mkdir] Created dir: <https://builds.apache.org/job/Hive-0.9.1-SNAPSHOT-h0.21-keepgoing=false/184/artifact/hive/build/hwi/test/classes>
    [mkdir] Created dir: <https://builds.apache.org/job/Hive-0.9.1-SNAPSHOT-h0.21-keepgoing=false/184/artifact/hive/build/hwi/test/resources>
     [copy] Warning: <https://builds.apache.org/job/Hive-0.9.1-SNAPSHOT-h0.21-keepgoing=false/ws/hive/hwi/src/test/resources>
does not exist.

init:
     [echo] Project: hwi

create-dirs:
     [echo] Project: hbase-handler
    [mkdir] Created dir: <https://builds.apache.org/job/Hive-0.9.1-SNAPSHOT-h0.21-keepgoing=false/184/artifact/hive/build/hbase-handler>
    [mkdir] Created dir: <https://builds.apache.org/job/Hive-0.9.1-SNAPSHOT-h0.21-keepgoing=false/184/artifact/hive/build/hbase-handler/classes>
    [mkdir] Created dir: <https://builds.apache.org/job/Hive-0.9.1-SNAPSHOT-h0.21-keepgoing=false/184/artifact/hive/build/hbase-handler/test>
    [mkdir] Created dir: <https://builds.apache.org/job/Hive-0.9.1-SNAPSHOT-h0.21-keepgoing=false/184/artifact/hive/build/hbase-handler/test/src>
    [mkdir] Created dir: <https://builds.apache.org/job/Hive-0.9.1-SNAPSHOT-h0.21-keepgoing=false/184/artifact/hive/build/hbase-handler/test/classes>
    [mkdir] Created dir: <https://builds.apache.org/job/Hive-0.9.1-SNAPSHOT-h0.21-keepgoing=false/184/artifact/hive/build/hbase-handler/test/resources>
     [copy] Warning: <https://builds.apache.org/job/Hive-0.9.1-SNAPSHOT-h0.21-keepgoing=false/ws/hive/hbase-handler/src/test/resources>
does not exist.

init:
     [echo] Project: hbase-handler

create-dirs:
     [echo] Project: pdk
    [mkdir] Created dir: <https://builds.apache.org/job/Hive-0.9.1-SNAPSHOT-h0.21-keepgoing=false/184/artifact/hive/build/pdk>
    [mkdir] Created dir: <https://builds.apache.org/job/Hive-0.9.1-SNAPSHOT-h0.21-keepgoing=false/184/artifact/hive/build/pdk/classes>
    [mkdir] Created dir: <https://builds.apache.org/job/Hive-0.9.1-SNAPSHOT-h0.21-keepgoing=false/184/artifact/hive/build/pdk/test>
    [mkdir] Created dir: <https://builds.apache.org/job/Hive-0.9.1-SNAPSHOT-h0.21-keepgoing=false/184/artifact/hive/build/pdk/test/src>
    [mkdir] Created dir: <https://builds.apache.org/job/Hive-0.9.1-SNAPSHOT-h0.21-keepgoing=false/184/artifact/hive/build/pdk/test/classes>
    [mkdir] Created dir: <https://builds.apache.org/job/Hive-0.9.1-SNAPSHOT-h0.21-keepgoing=false/184/artifact/hive/build/pdk/test/resources>
     [copy] Warning: <https://builds.apache.org/job/Hive-0.9.1-SNAPSHOT-h0.21-keepgoing=false/ws/hive/pdk/src/test/resources>
does not exist.

init:
     [echo] Project: pdk

create-dirs:
     [echo] Project: builtins
    [mkdir] Created dir: <https://builds.apache.org/job/Hive-0.9.1-SNAPSHOT-h0.21-keepgoing=false/184/artifact/hive/build/builtins>
    [mkdir] Created dir: <https://builds.apache.org/job/Hive-0.9.1-SNAPSHOT-h0.21-keepgoing=false/184/artifact/hive/build/builtins/classes>
    [mkdir] Created dir: <https://builds.apache.org/job/Hive-0.9.1-SNAPSHOT-h0.21-keepgoing=false/184/artifact/hive/build/builtins/test>
    [mkdir] Created dir: <https://builds.apache.org/job/Hive-0.9.1-SNAPSHOT-h0.21-keepgoing=false/184/artifact/hive/build/builtins/test/src>
    [mkdir] Created dir: <https://builds.apache.org/job/Hive-0.9.1-SNAPSHOT-h0.21-keepgoing=false/184/artifact/hive/build/builtins/test/classes>
    [mkdir] Created dir: <https://builds.apache.org/job/Hive-0.9.1-SNAPSHOT-h0.21-keepgoing=false/184/artifact/hive/build/builtins/test/resources>
     [copy] Warning: <https://builds.apache.org/job/Hive-0.9.1-SNAPSHOT-h0.21-keepgoing=false/ws/hive/builtins/src/test/resources>
does not exist.

init:
     [echo] Project: builtins

jar:
     [echo] Project: hive

create-dirs:
     [echo] Project: shims
     [copy] Warning: <https://builds.apache.org/job/Hive-0.9.1-SNAPSHOT-h0.21-keepgoing=false/ws/hive/shims/src/test/resources>
does not exist.

init:
     [echo] Project: shims

ivy-init-settings:
     [echo] Project: shims

ivy-resolve:
     [echo] Project: shims
[ivy:resolve] :: loading settings :: file = <https://builds.apache.org/job/Hive-0.9.1-SNAPSHOT-h0.21-keepgoing=false/ws/hive/ivy/ivysettings.xml>
[ivy:resolve] downloading http://repo1.maven.org/maven2/org/apache/zookeeper/zookeeper/3.4.3/zookeeper-3.4.3.jar
...
[ivy:resolve] .........................................................................................................................................
(749kB)
[ivy:resolve] .. (0kB)
[ivy:resolve] downloading http://repo1.maven.org/maven2/org/apache/thrift/libthrift/0.7.0/libthrift-0.7.0.jar
...
[ivy:resolve] ............................................................... (294kB)
[ivy:resolve] .. (0kB)
[ivy:resolve] downloading http://repo1.maven.org/maven2/commons-logging/commons-logging/1.0.4/commons-logging-1.0.4.jar
...
[ivy:resolve] ....... (37kB)
[ivy:resolve] .. (0kB)
[ivy:resolve] 	[SUCCESSFUL ] commons-logging#commons-logging;1.0.4!commons-logging.jar (12ms)
[ivy:resolve] downloading http://repo1.maven.org/maven2/commons-logging/commons-logging-api/1.0.4/commons-logging-api-1.0.4.jar
...
[ivy:resolve] ........ (25kB)
[ivy:resolve] .. (0kB)
[ivy:resolve] 	[SUCCESSFUL ] commons-logging#commons-logging-api;1.0.4!commons-logging-api.jar
(41ms)
[ivy:resolve] downloading http://repo1.maven.org/maven2/com/google/guava/guava/r09/guava-r09.jar
...
[ivy:resolve] ......................................................................................................................................................................................
(1117kB)
[ivy:resolve] .. (0kB)
[ivy:resolve] 	[SUCCESSFUL ] com.google.guava#guava;r09!guava.jar (64ms)
[ivy:resolve] downloading http://repo1.maven.org/maven2/org/codehaus/jackson/jackson-core-asl/1.8.8/jackson-core-asl-1.8.8.jar
...
[ivy:resolve] ................................................ (222kB)
[ivy:resolve] .. (0kB)
[ivy:resolve] 	[SUCCESSFUL ] org.codehaus.jackson#jackson-core-asl;1.8.8!jackson-core-asl.jar
(186ms)
[ivy:resolve] downloading http://repo1.maven.org/maven2/org/codehaus/jackson/jackson-mapper-asl/1.8.8/jackson-mapper-asl-1.8.8.jar
...
[ivy:resolve] ............................................................................................................................................................
(652kB)
[ivy:resolve] .. (0kB)
[ivy:resolve] 	[SUCCESSFUL ] org.codehaus.jackson#jackson-mapper-asl;1.8.8!jackson-mapper-asl.jar
(211ms)
[ivy:resolve] 
[ivy:resolve] :: problems summary ::
[ivy:resolve] :::: WARNINGS
[ivy:resolve] 		[FAILED     ] org.apache.zookeeper#zookeeper;3.4.3!zookeeper.jar: impossible
to move part file to definitive one: /home/jenkins/.ivy2/cache/org.apache.zookeeper/zookeeper/jars/zookeeper-3.4.3.jar.part
-> /home/jenkins/.ivy2/cache/org.apache.zookeeper/zookeeper/jars/zookeeper-3.4.3.jar (344ms)
[ivy:resolve] 		[FAILED     ] org.apache.thrift#libthrift;0.7.0!libthrift.jar: /home/jenkins/.ivy2/cache/org.apache.thrift/libthrift/jars/libthrift-0.7.0.jar.part
(No such file or directory) (230ms)
[ivy:resolve] 
[ivy:resolve] :: USE VERBOSE OR DEBUG MESSAGE LEVEL FOR MORE DETAILS
[ivy:report] Processing <https://builds.apache.org/job/Hive-0.9.1-SNAPSHOT-h0.21-keepgoing=false/184/artifact/hive/build/ivy/resolution-cache/org.apache.hive-hive-shims-default.xml>
to <https://builds.apache.org/job/Hive-0.9.1-SNAPSHOT-h0.21-keepgoing=false/184/artifact/hive/build/ivy/report/org.apache.hive-hive-shims-default.html>

ivy-retrieve:
     [echo] Project: shims

compile:
     [echo] Project: shims
     [echo] Building shims 0.20

build_shims:
     [echo] Project: shims
     [echo] Compiling <https://builds.apache.org/job/Hive-0.9.1-SNAPSHOT-h0.21-keepgoing=false/ws/hive/shims/src/common/java;/home/jenkins/jenkins-slave/workspace/Hive-0.9.1-SNAPSHOT-h0.21-keepgoing=false/hive/shims/src/0.20/java>
against hadoop 0.20.2 (<https://builds.apache.org/job/Hive-0.9.1-SNAPSHOT-h0.21-keepgoing=false/184/artifact/hive/build/hadoopcore/hadoop-0.20.2)>

ivy-init-settings:
     [echo] Project: shims

ivy-resolve-hadoop-shim:
     [echo] Project: shims
[ivy:resolve] :: loading settings :: file = <https://builds.apache.org/job/Hive-0.9.1-SNAPSHOT-h0.21-keepgoing=false/ws/hive/ivy/ivysettings.xml>
[ivy:resolve] downloading http://repo1.maven.org/maven2/org/apache/hadoop/hadoop-tools/0.20.2/hadoop-tools-0.20.2.jar
...
[ivy:resolve] .................. (68kB)
[ivy:resolve] .. (0kB)
[ivy:resolve] 	[SUCCESSFUL ] org.apache.hadoop#hadoop-tools;0.20.2!hadoop-tools.jar (66ms)
[ivy:resolve] downloading http://repo1.maven.org/maven2/org/apache/hadoop/hadoop-test/0.20.2/hadoop-test-0.20.2.jar
...
[ivy:resolve] .........................................................................................................................................................................................................................................................................................................................
(1527kB)
[ivy:resolve] .. (0kB)
[ivy:resolve] 	[SUCCESSFUL ] org.apache.hadoop#hadoop-test;0.20.2!hadoop-test.jar (143ms)
[ivy:resolve] downloading http://repo1.maven.org/maven2/org/apache/ftpserver/ftplet-api/1.0.0/ftplet-api-1.0.0.jar
...
[ivy:resolve] .... (22kB)
[ivy:resolve] .. (0kB)
[ivy:resolve] 	[SUCCESSFUL ] org.apache.ftpserver#ftplet-api;1.0.0!ftplet-api.jar(bundle)
(159ms)
[ivy:resolve] downloading http://repo1.maven.org/maven2/org/apache/mina/mina-core/2.0.0-M5/mina-core-2.0.0-M5.jar
...
[ivy:resolve] ...................................................................................................
(622kB)
[ivy:resolve] .. (0kB)
[ivy:resolve] 	[SUCCESSFUL ] org.apache.mina#mina-core;2.0.0-M5!mina-core.jar(bundle) (118ms)
[ivy:resolve] downloading http://repo1.maven.org/maven2/org/apache/ftpserver/ftpserver-core/1.0.0/ftpserver-core-1.0.0.jar
...
[ivy:resolve] ................................................. (264kB)
[ivy:resolve] .. (0kB)
[ivy:resolve] 	[SUCCESSFUL ] org.apache.ftpserver#ftpserver-core;1.0.0!ftpserver-core.jar(bundle)
(215ms)
[ivy:resolve] downloading http://repo1.maven.org/maven2/org/apache/ftpserver/ftpserver-deprecated/1.0.0-M2/ftpserver-deprecated-1.0.0-M2.jar
...
[ivy:resolve] ........ (31kB)
[ivy:resolve] .. (0kB)
[ivy:resolve] 	[SUCCESSFUL ] org.apache.ftpserver#ftpserver-deprecated;1.0.0-M2!ftpserver-deprecated.jar
(279ms)
[ivy:resolve] downloading http://repo1.maven.org/maven2/org/slf4j/slf4j-api/1.5.2/slf4j-api-1.5.2.jar
...
[ivy:resolve] .... (16kB)
[ivy:resolve] .. (0kB)
[ivy:resolve] 	[SUCCESSFUL ] org.slf4j#slf4j-api;1.5.2!slf4j-api.jar (471ms)
[ivy:resolve] 
[ivy:resolve] :: problems summary ::
[ivy:resolve] :::: WARNINGS
[ivy:resolve] 	problem while downloading module descriptor: http://repo1.maven.org/maven2/org/apache/hadoop/hadoop-core/0.20.2/hadoop-core-0.20.2.pom:
impossible to move part file to definitive one: /home/jenkins/.ivy2/cache/org.apache.hadoop/hadoop-core/ivy-0.20.2.xml.original.part
-> /home/jenkins/.ivy2/cache/org.apache.hadoop/hadoop-core/ivy-0.20.2.xml.original (47ms)
[ivy:resolve] 		module not found: org.apache.hadoop#hadoop-core;0.20.2
[ivy:resolve] 	==== local: tried
[ivy:resolve] 	  /home/jenkins/.ivy2/local/org.apache.hadoop/hadoop-core/0.20.2/ivys/ivy.xml
[ivy:resolve] 	  -- artifact org.apache.hadoop#hadoop-core;0.20.2!hadoop-core.jar:
[ivy:resolve] 	  /home/jenkins/.ivy2/local/org.apache.hadoop/hadoop-core/0.20.2/jars/hadoop-core.jar
[ivy:resolve] 	==== apache-snapshot: tried
[ivy:resolve] 	  https://repository.apache.org/content/repositories/snapshots/org/apache/hadoop/hadoop-core/0.20.2/hadoop-core-0.20.2.pom
[ivy:resolve] 	  -- artifact org.apache.hadoop#hadoop-core;0.20.2!hadoop-core.jar:
[ivy:resolve] 	  https://repository.apache.org/content/repositories/snapshots/org/apache/hadoop/hadoop-core/0.20.2/hadoop-core-0.20.2.jar
[ivy:resolve] 	==== maven2: tried
[ivy:resolve] 	  http://repo1.maven.org/maven2/org/apache/hadoop/hadoop-core/0.20.2/hadoop-core-0.20.2.pom
[ivy:resolve] 	==== datanucleus-repo: tried
[ivy:resolve] 	  -- artifact org.apache.hadoop#hadoop-core;0.20.2!hadoop-core.jar:
[ivy:resolve] 	  http://www.datanucleus.org/downloads/maven2/org/apache/hadoop/hadoop-core/0.20.2/hadoop-core-0.20.2.jar
[ivy:resolve] 	==== hadoop-source: tried
[ivy:resolve] 	  -- artifact org.apache.hadoop#hadoop-core;0.20.2!hadoop-core.jar:
[ivy:resolve] 	  http://mirror.facebook.net/facebook/hive-deps/hadoop/core/hadoop-core-0.20.2/hadoop-core-0.20.2.jar
[ivy:resolve] 	==== hadoop-source2: tried
[ivy:resolve] 	  -- artifact org.apache.hadoop#hadoop-core;0.20.2!hadoop-core.jar:
[ivy:resolve] 	  http://archive.cloudera.com/hive-deps/hadoop/core/hadoop-core-0.20.2/hadoop-core-0.20.2.jar
[ivy:resolve] 		::::::::::::::::::::::::::::::::::::::::::::::
[ivy:resolve] 		::          UNRESOLVED DEPENDENCIES         ::
[ivy:resolve] 		::::::::::::::::::::::::::::::::::::::::::::::
[ivy:resolve] 		:: org.apache.hadoop#hadoop-core;0.20.2: not found
[ivy:resolve] 		::::::::::::::::::::::::::::::::::::::::::::::
[ivy:resolve] 
[ivy:resolve] :: USE VERBOSE OR DEBUG MESSAGE LEVEL FOR MORE DETAILS

BUILD FAILED
<https://builds.apache.org/job/Hive-0.9.1-SNAPSHOT-h0.21-keepgoing=false/ws/hive/build.xml>:302:
The following error occurred while executing this line:
<https://builds.apache.org/job/Hive-0.9.1-SNAPSHOT-h0.21-keepgoing=false/ws/hive/build.xml>:152:
The following error occurred while executing this line:
<https://builds.apache.org/job/Hive-0.9.1-SNAPSHOT-h0.21-keepgoing=false/ws/hive/shims/build.xml>:85:
The following error occurred while executing this line:
<https://builds.apache.org/job/Hive-0.9.1-SNAPSHOT-h0.21-keepgoing=false/ws/hive/shims/build.xml>:88:
The following error occurred while executing this line:
<https://builds.apache.org/job/Hive-0.9.1-SNAPSHOT-h0.21-keepgoing=false/ws/hive/shims/build.xml>:60:
The following error occurred while executing this line:
<https://builds.apache.org/job/Hive-0.9.1-SNAPSHOT-h0.21-keepgoing=false/ws/hive/build-common.xml>:164:
impossible to resolve dependencies:
	resolve failed - see output for details

Total time: 31 seconds
Build step 'Invoke Ant' marked build as failure
Archiving artifacts
Recording test results

Mime
View raw message