hive-dev mailing list archives

Site index · List index
Message view « Date » · « Thread »
Top « Date » · « Thread »
From Apache Jenkins Server <jenk...@builds.apache.org>
Subject Build failed in Jenkins: Hive-0.9.1-SNAPSHOT-h0.21 #171
Date Thu, 18 Oct 2012 16:07:48 GMT
See <https://builds.apache.org/job/Hive-0.9.1-SNAPSHOT-h0.21/171/>

------------------------------------------
[...truncated 5823 lines...]
[ivy:resolve] 	==== local: tried
[ivy:resolve] 	  /home/jenkins/.ivy2/local/log4j/log4j/1.2.15/ivys/ivy.xml
[ivy:resolve] 	  -- artifact log4j#log4j;1.2.15!log4j.jar:
[ivy:resolve] 	  /home/jenkins/.ivy2/local/log4j/log4j/1.2.15/jars/log4j.jar
[ivy:resolve] 	==== apache-snapshot: tried
[ivy:resolve] 	  https://repository.apache.org/content/repositories/snapshots/log4j/log4j/1.2.15/log4j-1.2.15.pom
[ivy:resolve] 	  -- artifact log4j#log4j;1.2.15!log4j.jar:
[ivy:resolve] 	  https://repository.apache.org/content/repositories/snapshots/log4j/log4j/1.2.15/log4j-1.2.15.jar
[ivy:resolve] 	==== maven2: tried
[ivy:resolve] 	  http://repo1.maven.org/maven2/log4j/log4j/1.2.15/log4j-1.2.15.pom
[ivy:resolve] 	==== datanucleus-repo: tried
[ivy:resolve] 	  -- artifact log4j#log4j;1.2.15!log4j.jar:
[ivy:resolve] 	  http://www.datanucleus.org/downloads/maven2/log4j/log4j/1.2.15/log4j-1.2.15.jar
[ivy:resolve] 	==== hadoop-source: tried
[ivy:resolve] 	  -- artifact log4j#log4j;1.2.15!log4j.jar:
[ivy:resolve] 	  http://mirror.facebook.net/facebook/hive-deps/hadoop/core/log4j-1.2.15/log4j-1.2.15.jar
[ivy:resolve] 	==== hadoop-source2: tried
[ivy:resolve] 	  -- artifact log4j#log4j;1.2.15!log4j.jar:
[ivy:resolve] 	  http://archive.cloudera.com/hive-deps/hadoop/core/log4j-1.2.15/log4j-1.2.15.jar
[ivy:resolve] 	problem while downloading module descriptor: http://repo1.maven.org/maven2/commons-lang/commons-lang/2.5/commons-lang-2.5.pom:
/home/jenkins/.ivy2/cache/commons-lang/commons-lang/ivy-2.5.xml.original.part (No such file
or directory) (37ms)
[ivy:resolve] 		module not found: commons-lang#commons-lang;2.5
[ivy:resolve] 	==== local: tried
[ivy:resolve] 	  /home/jenkins/.ivy2/local/commons-lang/commons-lang/2.5/ivys/ivy.xml
[ivy:resolve] 	  -- artifact commons-lang#commons-lang;2.5!commons-lang.jar:
[ivy:resolve] 	  /home/jenkins/.ivy2/local/commons-lang/commons-lang/2.5/jars/commons-lang.jar
[ivy:resolve] 	==== apache-snapshot: tried
[ivy:resolve] 	  https://repository.apache.org/content/repositories/snapshots/commons-lang/commons-lang/2.5/commons-lang-2.5.pom
[ivy:resolve] 	  -- artifact commons-lang#commons-lang;2.5!commons-lang.jar:
[ivy:resolve] 	  https://repository.apache.org/content/repositories/snapshots/commons-lang/commons-lang/2.5/commons-lang-2.5.jar
[ivy:resolve] 	==== maven2: tried
[ivy:resolve] 	  http://repo1.maven.org/maven2/commons-lang/commons-lang/2.5/commons-lang-2.5.pom
[ivy:resolve] 	==== datanucleus-repo: tried
[ivy:resolve] 	  -- artifact commons-lang#commons-lang;2.5!commons-lang.jar:
[ivy:resolve] 	  http://www.datanucleus.org/downloads/maven2/commons-lang/commons-lang/2.5/commons-lang-2.5.jar
[ivy:resolve] 	==== hadoop-source: tried
[ivy:resolve] 	  -- artifact commons-lang#commons-lang;2.5!commons-lang.jar:
[ivy:resolve] 	  http://mirror.facebook.net/facebook/hive-deps/hadoop/core/commons-lang-2.5/commons-lang-2.5.jar
[ivy:resolve] 	==== hadoop-source2: tried
[ivy:resolve] 	  -- artifact commons-lang#commons-lang;2.5!commons-lang.jar:
[ivy:resolve] 	  http://archive.cloudera.com/hive-deps/hadoop/core/commons-lang-2.5/commons-lang-2.5.jar
[ivy:resolve] 	problem while downloading module descriptor: http://repo1.maven.org/maven2/org/slf4j/slf4j-api/1.6.1/slf4j-api-1.6.1.pom:
/home/jenkins/.ivy2/cache/org.slf4j/slf4j-api/ivy-1.6.1.xml.original.part (No such file or
directory) (62ms)
[ivy:resolve] 		module not found: org.slf4j#slf4j-api;1.6.1
[ivy:resolve] 	==== local: tried
[ivy:resolve] 	  /home/jenkins/.ivy2/local/org.slf4j/slf4j-api/1.6.1/ivys/ivy.xml
[ivy:resolve] 	  -- artifact org.slf4j#slf4j-api;1.6.1!slf4j-api.jar:
[ivy:resolve] 	  /home/jenkins/.ivy2/local/org.slf4j/slf4j-api/1.6.1/jars/slf4j-api.jar
[ivy:resolve] 	==== apache-snapshot: tried
[ivy:resolve] 	  https://repository.apache.org/content/repositories/snapshots/org/slf4j/slf4j-api/1.6.1/slf4j-api-1.6.1.pom
[ivy:resolve] 	  -- artifact org.slf4j#slf4j-api;1.6.1!slf4j-api.jar:
[ivy:resolve] 	  https://repository.apache.org/content/repositories/snapshots/org/slf4j/slf4j-api/1.6.1/slf4j-api-1.6.1.jar
[ivy:resolve] 	==== maven2: tried
[ivy:resolve] 	  http://repo1.maven.org/maven2/org/slf4j/slf4j-api/1.6.1/slf4j-api-1.6.1.pom
[ivy:resolve] 	==== datanucleus-repo: tried
[ivy:resolve] 	  -- artifact org.slf4j#slf4j-api;1.6.1!slf4j-api.jar:
[ivy:resolve] 	  http://www.datanucleus.org/downloads/maven2/org/slf4j/slf4j-api/1.6.1/slf4j-api-1.6.1.jar
[ivy:resolve] 	==== hadoop-source: tried
[ivy:resolve] 	  -- artifact org.slf4j#slf4j-api;1.6.1!slf4j-api.jar:
[ivy:resolve] 	  http://mirror.facebook.net/facebook/hive-deps/hadoop/core/slf4j-api-1.6.1/slf4j-api-1.6.1.jar
[ivy:resolve] 	==== hadoop-source2: tried
[ivy:resolve] 	  -- artifact org.slf4j#slf4j-api;1.6.1!slf4j-api.jar:
[ivy:resolve] 	  http://archive.cloudera.com/hive-deps/hadoop/core/slf4j-api-1.6.1/slf4j-api-1.6.1.jar
[ivy:resolve] 	problem while downloading module descriptor: http://repo1.maven.org/maven2/org/apache/avro/avro/1.5.3/avro-1.5.3.pom:
/home/jenkins/.ivy2/cache/org.apache.avro/avro/ivy-1.5.3.xml.original.part (No such file or
directory) (41ms)
[ivy:resolve] 		module not found: org.apache.avro#avro;1.5.3
[ivy:resolve] 	==== local: tried
[ivy:resolve] 	  /home/jenkins/.ivy2/local/org.apache.avro/avro/1.5.3/ivys/ivy.xml
[ivy:resolve] 	  -- artifact org.apache.avro#avro;1.5.3!avro.jar:
[ivy:resolve] 	  /home/jenkins/.ivy2/local/org.apache.avro/avro/1.5.3/jars/avro.jar
[ivy:resolve] 	==== apache-snapshot: tried
[ivy:resolve] 	  https://repository.apache.org/content/repositories/snapshots/org/apache/avro/avro/1.5.3/avro-1.5.3.pom
[ivy:resolve] 	  -- artifact org.apache.avro#avro;1.5.3!avro.jar:
[ivy:resolve] 	  https://repository.apache.org/content/repositories/snapshots/org/apache/avro/avro/1.5.3/avro-1.5.3.jar
[ivy:resolve] 	==== maven2: tried
[ivy:resolve] 	  http://repo1.maven.org/maven2/org/apache/avro/avro/1.5.3/avro-1.5.3.pom
[ivy:resolve] 	==== datanucleus-repo: tried
[ivy:resolve] 	  -- artifact org.apache.avro#avro;1.5.3!avro.jar:
[ivy:resolve] 	  http://www.datanucleus.org/downloads/maven2/org/apache/avro/avro/1.5.3/avro-1.5.3.jar
[ivy:resolve] 	==== hadoop-source: tried
[ivy:resolve] 	  -- artifact org.apache.avro#avro;1.5.3!avro.jar:
[ivy:resolve] 	  http://mirror.facebook.net/facebook/hive-deps/hadoop/core/avro-1.5.3/avro-1.5.3.jar
[ivy:resolve] 	==== hadoop-source2: tried
[ivy:resolve] 	  -- artifact org.apache.avro#avro;1.5.3!avro.jar:
[ivy:resolve] 	  http://archive.cloudera.com/hive-deps/hadoop/core/avro-1.5.3/avro-1.5.3.jar
[ivy:resolve] 	problem while downloading module descriptor: http://repo1.maven.org/maven2/org/apache/velocity/velocity/1.7/velocity-1.7.pom:
/home/jenkins/.ivy2/cache/org.apache.velocity/velocity/ivy-1.7.xml.original.part (No such
file or directory) (452ms)
[ivy:resolve] 		module not found: org.apache.velocity#velocity;1.7
[ivy:resolve] 	==== local: tried
[ivy:resolve] 	  /home/jenkins/.ivy2/local/org.apache.velocity/velocity/1.7/ivys/ivy.xml
[ivy:resolve] 	  -- artifact org.apache.velocity#velocity;1.7!velocity.jar:
[ivy:resolve] 	  /home/jenkins/.ivy2/local/org.apache.velocity/velocity/1.7/jars/velocity.jar
[ivy:resolve] 	==== apache-snapshot: tried
[ivy:resolve] 	  https://repository.apache.org/content/repositories/snapshots/org/apache/velocity/velocity/1.7/velocity-1.7.pom
[ivy:resolve] 	  -- artifact org.apache.velocity#velocity;1.7!velocity.jar:
[ivy:resolve] 	  https://repository.apache.org/content/repositories/snapshots/org/apache/velocity/velocity/1.7/velocity-1.7.jar
[ivy:resolve] 	==== maven2: tried
[ivy:resolve] 	  http://repo1.maven.org/maven2/org/apache/velocity/velocity/1.7/velocity-1.7.pom
[ivy:resolve] 	==== datanucleus-repo: tried
[ivy:resolve] 	  -- artifact org.apache.velocity#velocity;1.7!velocity.jar:
[ivy:resolve] 	  http://www.datanucleus.org/downloads/maven2/org/apache/velocity/velocity/1.7/velocity-1.7.jar
[ivy:resolve] 	==== hadoop-source: tried
[ivy:resolve] 	  -- artifact org.apache.velocity#velocity;1.7!velocity.jar:
[ivy:resolve] 	  http://mirror.facebook.net/facebook/hive-deps/hadoop/core/velocity-1.7/velocity-1.7.jar
[ivy:resolve] 	==== hadoop-source2: tried
[ivy:resolve] 	  -- artifact org.apache.velocity#velocity;1.7!velocity.jar:
[ivy:resolve] 	  http://archive.cloudera.com/hive-deps/hadoop/core/velocity-1.7/velocity-1.7.jar
[ivy:resolve] 	problem while downloading module descriptor: http://repo1.maven.org/maven2/com/google/protobuf/protobuf-java/2.4.0a/protobuf-java-2.4.0a.pom:
/home/jenkins/.ivy2/cache/com.google.protobuf/protobuf-java/ivy-2.4.0a.xml.original.part (No
such file or directory) (118ms)
[ivy:resolve] 		module not found: com.google.protobuf#protobuf-java;2.4.0a
[ivy:resolve] 	==== local: tried
[ivy:resolve] 	  /home/jenkins/.ivy2/local/com.google.protobuf/protobuf-java/2.4.0a/ivys/ivy.xml
[ivy:resolve] 	  -- artifact com.google.protobuf#protobuf-java;2.4.0a!protobuf-java.jar:
[ivy:resolve] 	  /home/jenkins/.ivy2/local/com.google.protobuf/protobuf-java/2.4.0a/jars/protobuf-java.jar
[ivy:resolve] 	==== apache-snapshot: tried
[ivy:resolve] 	  https://repository.apache.org/content/repositories/snapshots/com/google/protobuf/protobuf-java/2.4.0a/protobuf-java-2.4.0a.pom
[ivy:resolve] 	  -- artifact com.google.protobuf#protobuf-java;2.4.0a!protobuf-java.jar:
[ivy:resolve] 	  https://repository.apache.org/content/repositories/snapshots/com/google/protobuf/protobuf-java/2.4.0a/protobuf-java-2.4.0a.jar
[ivy:resolve] 	==== maven2: tried
[ivy:resolve] 	  http://repo1.maven.org/maven2/com/google/protobuf/protobuf-java/2.4.0a/protobuf-java-2.4.0a.pom
[ivy:resolve] 	==== datanucleus-repo: tried
[ivy:resolve] 	  -- artifact com.google.protobuf#protobuf-java;2.4.0a!protobuf-java.jar:
[ivy:resolve] 	  http://www.datanucleus.org/downloads/maven2/com/google/protobuf/protobuf-java/2.4.0a/protobuf-java-2.4.0a.jar
[ivy:resolve] 	==== hadoop-source: tried
[ivy:resolve] 	  -- artifact com.google.protobuf#protobuf-java;2.4.0a!protobuf-java.jar:
[ivy:resolve] 	  http://mirror.facebook.net/facebook/hive-deps/hadoop/core/protobuf-java-2.4.0a/protobuf-java-2.4.0a.jar
[ivy:resolve] 	==== hadoop-source2: tried
[ivy:resolve] 	  -- artifact com.google.protobuf#protobuf-java;2.4.0a!protobuf-java.jar:
[ivy:resolve] 	  http://archive.cloudera.com/hive-deps/hadoop/core/protobuf-java-2.4.0a/protobuf-java-2.4.0a.jar
[ivy:resolve] 	problem while downloading module descriptor: http://repo1.maven.org/maven2/org/apache/hadoop/hadoop-yarn-common/0.23.1/hadoop-yarn-common-0.23.1.pom:
Downloaded file size doesn't match expected Content Length for http://repo1.maven.org/maven2/org/apache/hadoop/hadoop-yarn-common/0.23.1/hadoop-yarn-common-0.23.1.pom.
Please retry. (20ms)
[ivy:resolve] 		module not found: org.apache.hadoop#hadoop-yarn-common;0.23.1
[ivy:resolve] 	==== local: tried
[ivy:resolve] 	  /home/jenkins/.ivy2/local/org.apache.hadoop/hadoop-yarn-common/0.23.1/ivys/ivy.xml
[ivy:resolve] 	  -- artifact org.apache.hadoop#hadoop-yarn-common;0.23.1!hadoop-yarn-common.jar:
[ivy:resolve] 	  /home/jenkins/.ivy2/local/org.apache.hadoop/hadoop-yarn-common/0.23.1/jars/hadoop-yarn-common.jar
[ivy:resolve] 	==== apache-snapshot: tried
[ivy:resolve] 	  https://repository.apache.org/content/repositories/snapshots/org/apache/hadoop/hadoop-yarn-common/0.23.1/hadoop-yarn-common-0.23.1.pom
[ivy:resolve] 	  -- artifact org.apache.hadoop#hadoop-yarn-common;0.23.1!hadoop-yarn-common.jar:
[ivy:resolve] 	  https://repository.apache.org/content/repositories/snapshots/org/apache/hadoop/hadoop-yarn-common/0.23.1/hadoop-yarn-common-0.23.1.jar
[ivy:resolve] 	==== maven2: tried
[ivy:resolve] 	  http://repo1.maven.org/maven2/org/apache/hadoop/hadoop-yarn-common/0.23.1/hadoop-yarn-common-0.23.1.pom
[ivy:resolve] 	==== datanucleus-repo: tried
[ivy:resolve] 	  -- artifact org.apache.hadoop#hadoop-yarn-common;0.23.1!hadoop-yarn-common.jar:
[ivy:resolve] 	  http://www.datanucleus.org/downloads/maven2/org/apache/hadoop/hadoop-yarn-common/0.23.1/hadoop-yarn-common-0.23.1.jar
[ivy:resolve] 	==== hadoop-source: tried
[ivy:resolve] 	  -- artifact org.apache.hadoop#hadoop-yarn-common;0.23.1!hadoop-yarn-common.jar:
[ivy:resolve] 	  http://mirror.facebook.net/facebook/hive-deps/hadoop/core/hadoop-yarn-common-0.23.1/hadoop-yarn-common-0.23.1.jar
[ivy:resolve] 	==== hadoop-source2: tried
[ivy:resolve] 	  -- artifact org.apache.hadoop#hadoop-yarn-common;0.23.1!hadoop-yarn-common.jar:
[ivy:resolve] 	  http://archive.cloudera.com/hive-deps/hadoop/core/hadoop-yarn-common-0.23.1/hadoop-yarn-common-0.23.1.jar
[ivy:resolve] 	problem while downloading module descriptor: http://repo1.maven.org/maven2/org/apache/hadoop/hadoop-hdfs/0.23.1/hadoop-hdfs-0.23.1.pom:
/home/jenkins/.ivy2/cache/org.apache.hadoop/hadoop-hdfs/ivy-0.23.1.xml.original.part (No such
file or directory) (190ms)
[ivy:resolve] 		module not found: org.apache.hadoop#hadoop-hdfs;0.23.1
[ivy:resolve] 	==== local: tried
[ivy:resolve] 	  /home/jenkins/.ivy2/local/org.apache.hadoop/hadoop-hdfs/0.23.1/ivys/ivy.xml
[ivy:resolve] 	  -- artifact org.apache.hadoop#hadoop-hdfs;0.23.1!hadoop-hdfs.jar:
[ivy:resolve] 	  /home/jenkins/.ivy2/local/org.apache.hadoop/hadoop-hdfs/0.23.1/jars/hadoop-hdfs.jar
[ivy:resolve] 	==== apache-snapshot: tried
[ivy:resolve] 	  https://repository.apache.org/content/repositories/snapshots/org/apache/hadoop/hadoop-hdfs/0.23.1/hadoop-hdfs-0.23.1.pom
[ivy:resolve] 	  -- artifact org.apache.hadoop#hadoop-hdfs;0.23.1!hadoop-hdfs.jar:
[ivy:resolve] 	  https://repository.apache.org/content/repositories/snapshots/org/apache/hadoop/hadoop-hdfs/0.23.1/hadoop-hdfs-0.23.1.jar
[ivy:resolve] 	==== maven2: tried
[ivy:resolve] 	  http://repo1.maven.org/maven2/org/apache/hadoop/hadoop-hdfs/0.23.1/hadoop-hdfs-0.23.1.pom
[ivy:resolve] 	==== datanucleus-repo: tried
[ivy:resolve] 	  -- artifact org.apache.hadoop#hadoop-hdfs;0.23.1!hadoop-hdfs.jar:
[ivy:resolve] 	  http://www.datanucleus.org/downloads/maven2/org/apache/hadoop/hadoop-hdfs/0.23.1/hadoop-hdfs-0.23.1.jar
[ivy:resolve] 	==== hadoop-source: tried
[ivy:resolve] 	  -- artifact org.apache.hadoop#hadoop-hdfs;0.23.1!hadoop-hdfs.jar:
[ivy:resolve] 	  http://mirror.facebook.net/facebook/hive-deps/hadoop/core/hadoop-hdfs-0.23.1/hadoop-hdfs-0.23.1.jar
[ivy:resolve] 	==== hadoop-source2: tried
[ivy:resolve] 	  -- artifact org.apache.hadoop#hadoop-hdfs;0.23.1!hadoop-hdfs.jar:
[ivy:resolve] 	  http://archive.cloudera.com/hive-deps/hadoop/core/hadoop-hdfs-0.23.1/hadoop-hdfs-0.23.1.jar
[ivy:resolve] 	problem while downloading module descriptor: http://repo1.maven.org/maven2/jdiff/jdiff/1.0.9/jdiff-1.0.9.pom:
/home/jenkins/.ivy2/cache/jdiff/jdiff/ivy-1.0.9.xml.original.part (No such file or directory)
(104ms)
[ivy:resolve] 		module not found: jdiff#jdiff;1.0.9
[ivy:resolve] 	==== local: tried
[ivy:resolve] 	  /home/jenkins/.ivy2/local/jdiff/jdiff/1.0.9/ivys/ivy.xml
[ivy:resolve] 	  -- artifact jdiff#jdiff;1.0.9!jdiff.jar:
[ivy:resolve] 	  /home/jenkins/.ivy2/local/jdiff/jdiff/1.0.9/jars/jdiff.jar
[ivy:resolve] 	==== apache-snapshot: tried
[ivy:resolve] 	  https://repository.apache.org/content/repositories/snapshots/jdiff/jdiff/1.0.9/jdiff-1.0.9.pom
[ivy:resolve] 	  -- artifact jdiff#jdiff;1.0.9!jdiff.jar:
[ivy:resolve] 	  https://repository.apache.org/content/repositories/snapshots/jdiff/jdiff/1.0.9/jdiff-1.0.9.jar
[ivy:resolve] 	==== maven2: tried
[ivy:resolve] 	  http://repo1.maven.org/maven2/jdiff/jdiff/1.0.9/jdiff-1.0.9.pom
[ivy:resolve] 	==== datanucleus-repo: tried
[ivy:resolve] 	  -- artifact jdiff#jdiff;1.0.9!jdiff.jar:
[ivy:resolve] 	  http://www.datanucleus.org/downloads/maven2/jdiff/jdiff/1.0.9/jdiff-1.0.9.jar
[ivy:resolve] 	==== hadoop-source: tried
[ivy:resolve] 	  -- artifact jdiff#jdiff;1.0.9!jdiff.jar:
[ivy:resolve] 	  http://mirror.facebook.net/facebook/hive-deps/hadoop/core/jdiff-1.0.9/jdiff-1.0.9.jar
[ivy:resolve] 	==== hadoop-source2: tried
[ivy:resolve] 	  -- artifact jdiff#jdiff;1.0.9!jdiff.jar:
[ivy:resolve] 	  http://archive.cloudera.com/hive-deps/hadoop/core/jdiff-1.0.9/jdiff-1.0.9.jar
[ivy:resolve] 	problem while downloading module descriptor: http://repo1.maven.org/maven2/com/google/inject/guice/3.0/guice-3.0.pom:
/home/jenkins/.ivy2/cache/com.google.inject/guice/ivy-3.0.xml.original.part (No such file
or directory) (140ms)
[ivy:resolve] 		module not found: com.google.inject#guice;3.0
[ivy:resolve] 	==== local: tried
[ivy:resolve] 	  /home/jenkins/.ivy2/local/com.google.inject/guice/3.0/ivys/ivy.xml
[ivy:resolve] 	  -- artifact com.google.inject#guice;3.0!guice.jar:
[ivy:resolve] 	  /home/jenkins/.ivy2/local/com.google.inject/guice/3.0/jars/guice.jar
[ivy:resolve] 	==== apache-snapshot: tried
[ivy:resolve] 	  https://repository.apache.org/content/repositories/snapshots/com/google/inject/guice/3.0/guice-3.0.pom
[ivy:resolve] 	  -- artifact com.google.inject#guice;3.0!guice.jar:
[ivy:resolve] 	  https://repository.apache.org/content/repositories/snapshots/com/google/inject/guice/3.0/guice-3.0.jar
[ivy:resolve] 	==== maven2: tried
[ivy:resolve] 	  http://repo1.maven.org/maven2/com/google/inject/guice/3.0/guice-3.0.pom
[ivy:resolve] 	==== datanucleus-repo: tried
[ivy:resolve] 	  -- artifact com.google.inject#guice;3.0!guice.jar:
[ivy:resolve] 	  http://www.datanucleus.org/downloads/maven2/com/google/inject/guice/3.0/guice-3.0.jar
[ivy:resolve] 	==== hadoop-source: tried
[ivy:resolve] 	  -- artifact com.google.inject#guice;3.0!guice.jar:
[ivy:resolve] 	  http://mirror.facebook.net/facebook/hive-deps/hadoop/core/guice-3.0/guice-3.0.jar
[ivy:resolve] 	==== hadoop-source2: tried
[ivy:resolve] 	  -- artifact com.google.inject#guice;3.0!guice.jar:
[ivy:resolve] 	  http://archive.cloudera.com/hive-deps/hadoop/core/guice-3.0/guice-3.0.jar
[ivy:resolve] 	impossible to put metadata file in cache: http://repo1.maven.org/maven2/com/cenqua/clover/clover/3.0.2/clover-3.0.2.pom
(3.0.2). java.io.FileNotFoundException: /home/jenkins/.ivy2/cache/com.cenqua.clover/clover/ivy-3.0.2.xml.original
(No such file or directory)
[ivy:resolve] 		[FAILED     ] org.apache.hadoop#hadoop-common;0.23.1!hadoop-common.jar: impossible
to move part file to definitive one: /home/jenkins/.ivy2/cache/org.apache.hadoop/hadoop-common/jars/hadoop-common-0.23.1.jar.part
-> /home/jenkins/.ivy2/cache/org.apache.hadoop/hadoop-common/jars/hadoop-common-0.23.1.jar
(3255ms)
[ivy:resolve] 		[FAILED     ] org.apache.hadoop#hadoop-mapreduce-client-core;0.23.1!hadoop-mapreduce-client-core.jar:
/home/jenkins/.ivy2/cache/org.apache.hadoop/hadoop-mapreduce-client-core/jars/hadoop-mapreduce-client-core-0.23.1.jar.part
(No such file or directory) (208ms)
[ivy:resolve] 		[FAILED     ] org.apache.hadoop#hadoop-archives;0.23.1!hadoop-archives.jar:
/home/jenkins/.ivy2/cache/org.apache.hadoop/hadoop-archives/jars/hadoop-archives-0.23.1.jar.part
(No such file or directory) (233ms)
[ivy:resolve] 		[FAILED     ] com.cenqua.clover#clover;3.0.2!clover.jar: impossible to move
part file to definitive one: /home/jenkins/.ivy2/cache/com.cenqua.clover/clover/jars/clover-3.0.2.jar.part
-> /home/jenkins/.ivy2/cache/com.cenqua.clover/clover/jars/clover-3.0.2.jar (2933ms)
[ivy:resolve] 		::::::::::::::::::::::::::::::::::::::::::::::
[ivy:resolve] 		::          UNRESOLVED DEPENDENCIES         ::
[ivy:resolve] 		::::::::::::::::::::::::::::::::::::::::::::::
[ivy:resolve] 		:: javax.servlet#servlet-api;2.5: not found
[ivy:resolve] 		:: com.sun.jersey#jersey-core;1.8: not found
[ivy:resolve] 		:: org.codehaus.jettison#jettison;1.1: not found
[ivy:resolve] 		:: javax.activation#activation;1.1: not found
[ivy:resolve] 		:: com.sun.jersey#jersey-server;1.8: not found
[ivy:resolve] 		:: tomcat#jasper-compiler;5.5.23: not found
[ivy:resolve] 		:: log4j#log4j;1.2.15: not found
[ivy:resolve] 		:: commons-lang#commons-lang;2.5: not found
[ivy:resolve] 		:: org.slf4j#slf4j-api;1.6.1: not found
[ivy:resolve] 		:: org.apache.avro#avro;1.5.3: not found
[ivy:resolve] 		:: org.apache.velocity#velocity;1.7: not found
[ivy:resolve] 		:: com.google.protobuf#protobuf-java;2.4.0a: not found
[ivy:resolve] 		:: org.apache.hadoop#hadoop-yarn-common;0.23.1: not found
[ivy:resolve] 		:: org.apache.hadoop#hadoop-hdfs;0.23.1: not found
[ivy:resolve] 		:: jdiff#jdiff;1.0.9: not found
[ivy:resolve] 		:: com.google.inject#guice;3.0: not found
[ivy:resolve] 		::::::::::::::::::::::::::::::::::::::::::::::
[ivy:resolve] 
[ivy:resolve] :: USE VERBOSE OR DEBUG MESSAGE LEVEL FOR MORE DETAILS

BUILD FAILED
<https://builds.apache.org/job/Hive-0.9.1-SNAPSHOT-h0.21/ws/hive/build.xml>:302: The
following error occurred while executing this line:
<https://builds.apache.org/job/Hive-0.9.1-SNAPSHOT-h0.21/ws/hive/build.xml>:152: The
following error occurred while executing this line:
<https://builds.apache.org/job/Hive-0.9.1-SNAPSHOT-h0.21/ws/hive/shims/build.xml>:85:
The following error occurred while executing this line:
<https://builds.apache.org/job/Hive-0.9.1-SNAPSHOT-h0.21/ws/hive/shims/build.xml>:88:
The following error occurred while executing this line:
<https://builds.apache.org/job/Hive-0.9.1-SNAPSHOT-h0.21/ws/hive/shims/build.xml>:60:
The following error occurred while executing this line:
<https://builds.apache.org/job/Hive-0.9.1-SNAPSHOT-h0.21/ws/hive/build-common.xml>:164:
impossible to resolve dependencies:
	resolve failed - see output for details

Total time: 1 minute 58 seconds
Build step 'Invoke Ant' marked build as failure
Archiving artifacts
Recording test results

Mime
View raw message