hive-dev mailing list archives

Site index · List index
Message view « Date » · « Thread »
Top « Date » · « Thread »
From Apache Jenkins Server <jenk...@builds.apache.org>
Subject Build failed in Jenkins: Hive-0.9.1-SNAPSHOT-h0.21-keepgoing=false #155
Date Mon, 01 Oct 2012 16:05:17 GMT
See <https://builds.apache.org/job/Hive-0.9.1-SNAPSHOT-h0.21-keepgoing=false/155/>

------------------------------------------
[...truncated 5981 lines...]
[ivy:resolve] .. (0kB)
[ivy:resolve] 	[SUCCESSFUL ] com.google.inject#guice;3.0!guice.jar (243ms)
[ivy:resolve] downloading http://repo1.maven.org/maven2/com/sun/jersey/jersey-test-framework/jersey-test-framework-grizzly2/1.8/jersey-test-framework-grizzly2-1.8.jar
...
[ivy:resolve] .. (12kB)
[ivy:resolve] .. (0kB)
[ivy:resolve] 	[SUCCESSFUL ] com.sun.jersey.jersey-test-framework#jersey-test-framework-grizzly2;1.8!jersey-test-framework-grizzly2.jar
(92ms)
[ivy:resolve] downloading http://repo1.maven.org/maven2/com/sun/jersey/contribs/jersey-guice/1.8/jersey-guice-1.8.jar
...
[ivy:resolve] ... (14kB)
[ivy:resolve] .. (0kB)
[ivy:resolve] 	[SUCCESSFUL ] com.sun.jersey.contribs#jersey-guice;1.8!jersey-guice.jar (66ms)
[ivy:resolve] downloading http://repo1.maven.org/maven2/jdiff/jdiff/1.0.9/jdiff-1.0.9.jar
...
[ivy:resolve] ................ (126kB)
[ivy:resolve] .. (0kB)
[ivy:resolve] 	[SUCCESSFUL ] jdiff#jdiff;1.0.9!jdiff.jar (183ms)
[ivy:resolve] downloading http://repo1.maven.org/maven2/javax/inject/javax.inject/1/javax.inject-1.jar
...
[ivy:resolve] .. (2kB)
[ivy:resolve] .. (0kB)
[ivy:resolve] 	[SUCCESSFUL ] javax.inject#javax.inject;1!javax.inject.jar (114ms)
[ivy:resolve] downloading http://repo1.maven.org/maven2/aopalliance/aopalliance/1.0/aopalliance-1.0.jar
...
[ivy:resolve] ... (4kB)
[ivy:resolve] .. (0kB)
[ivy:resolve] 	[SUCCESSFUL ] aopalliance#aopalliance;1.0!aopalliance.jar (30ms)
[ivy:resolve] downloading http://repo1.maven.org/maven2/org/sonatype/sisu/inject/cglib/2.2.1-v20090111/cglib-2.2.1-v20090111.jar
...
[ivy:resolve] .................................... (272kB)
[ivy:resolve] .. (0kB)
[ivy:resolve] 	[SUCCESSFUL ] org.sonatype.sisu.inject#cglib;2.2.1-v20090111!cglib.jar (179ms)
[ivy:resolve] 
[ivy:resolve] :: problems summary ::
[ivy:resolve] :::: WARNINGS
[ivy:resolve] 	impossible to put metadata file in cache: http://repo1.maven.org/maven2/tomcat/jasper-compiler/5.5.23/jasper-compiler-5.5.23.pom
(5.5.23). java.io.FileNotFoundException: /home/jenkins/.ivy2/cache/tomcat/jasper-compiler/ivy-5.5.23.xml.original
(No such file or directory)
[ivy:resolve] 
[ivy:resolve] :: USE VERBOSE OR DEBUG MESSAGE LEVEL FOR MORE DETAILS

ivy-retrieve-hadoop-shim:
     [echo] Project: shims
    [javac] Compiling 2 source files to /x1/jenkins/jenkins-slave/workspace/Hive-0.9.1-SNAPSHOT-h0.21-keepgoing=false/hive/build/shims/classes

jar:
     [echo] Project: shims
      [jar] Building jar: /x1/jenkins/jenkins-slave/workspace/Hive-0.9.1-SNAPSHOT-h0.21-keepgoing=false/hive/build/shims/hive-shims-0.9.1-SNAPSHOT.jar
:: delivering :: org.apache.hive#hive-shims;0.9.1-SNAPSHOT :: 0.9.1-SNAPSHOT :: integration
:: Mon Oct 01 16:05:00 UTC 2012
	delivering ivy file to /x1/jenkins/jenkins-slave/workspace/Hive-0.9.1-SNAPSHOT-h0.21-keepgoing=false/hive/build/shims/ivy-0.9.1-SNAPSHOT.xml
:: publishing :: org.apache.hive#hive-shims
	published hive-shims to /home/jenkins/.ivy2/local/org.apache.hive/hive-shims/0.9.1-SNAPSHOT/jars/hive-shims.jar
	published ivy to /home/jenkins/.ivy2/local/org.apache.hive/hive-shims/0.9.1-SNAPSHOT/ivys/ivy.xml

create-dirs:
     [echo] Project: common

init:
     [echo] Project: common

setup:
     [echo] Project: common

ivy-init-settings:
     [echo] Project: common

ivy-resolve:
     [echo] Project: common
[ivy:resolve] :: loading settings :: file = /x1/jenkins/jenkins-slave/workspace/Hive-0.9.1-SNAPSHOT-h0.21-keepgoing=false/hive/ivy/ivysettings.xml
[ivy:resolve] downloading /home/jenkins/.ivy2/local/org.apache.hive/hive-shims/0.9.1-SNAPSHOT/jars/hive-shims.jar
...
[ivy:resolve] ... (112kB)
[ivy:resolve] .. (0kB)
[ivy:resolve] 	[SUCCESSFUL ] org.apache.hive#hive-shims;0.9.1-SNAPSHOT!hive-shims.jar (2ms)
[ivy:resolve] downloading http://repo1.maven.org/maven2/log4j/log4j/1.2.16/log4j-1.2.16.jar
...
[ivy:resolve] ...........................................................................................................................................................................................................................................................................
(470kB)
[ivy:resolve] .. (0kB)
[ivy:resolve] 	[SUCCESSFUL ] log4j#log4j;1.2.16!log4j.jar(bundle) (56ms)
[ivy:report] Processing /x1/jenkins/jenkins-slave/workspace/Hive-0.9.1-SNAPSHOT-h0.21-keepgoing=false/hive/build/ivy/resolution-cache/org.apache.hive-hive-common-default.xml
to /x1/jenkins/jenkins-slave/workspace/Hive-0.9.1-SNAPSHOT-h0.21-keepgoing=false/hive/build/ivy/report/org.apache.hive-hive-common-default.html

ivy-retrieve:
     [echo] Project: common

compile:
     [echo] Project: common
    [javac] Compiling 16 source files to /x1/jenkins/jenkins-slave/workspace/Hive-0.9.1-SNAPSHOT-h0.21-keepgoing=false/hive/build/common/classes
    [javac] Note: /x1/jenkins/jenkins-slave/workspace/Hive-0.9.1-SNAPSHOT-h0.21-keepgoing=false/hive/common/src/java/org/apache/hadoop/hive/conf/HiveConf.java
uses or overrides a deprecated API.
    [javac] Note: Recompile with -Xlint:deprecation for details.
     [copy] Copying 1 file to /x1/jenkins/jenkins-slave/workspace/Hive-0.9.1-SNAPSHOT-h0.21-keepgoing=false/hive/build/common/classes

jar:
     [echo] Project: common
      [jar] Building jar: /x1/jenkins/jenkins-slave/workspace/Hive-0.9.1-SNAPSHOT-h0.21-keepgoing=false/hive/build/common/hive-common-0.9.1-SNAPSHOT.jar
:: delivering :: org.apache.hive#hive-common;0.9.1-SNAPSHOT :: 0.9.1-SNAPSHOT :: integration
:: Mon Oct 01 16:05:00 UTC 2012
	delivering ivy file to /x1/jenkins/jenkins-slave/workspace/Hive-0.9.1-SNAPSHOT-h0.21-keepgoing=false/hive/build/common/ivy-0.9.1-SNAPSHOT.xml
:: publishing :: org.apache.hive#hive-common
	published hive-common to /home/jenkins/.ivy2/local/org.apache.hive/hive-common/0.9.1-SNAPSHOT/jars/hive-common.jar
	published ivy to /home/jenkins/.ivy2/local/org.apache.hive/hive-common/0.9.1-SNAPSHOT/ivys/ivy.xml

create-dirs:
     [echo] Project: serde
     [copy] Warning: /x1/jenkins/jenkins-slave/workspace/Hive-0.9.1-SNAPSHOT-h0.21-keepgoing=false/hive/serde/src/test/resources
does not exist.

init:
     [echo] Project: serde

ivy-init-settings:
     [echo] Project: serde

ivy-resolve:
     [echo] Project: serde
[ivy:resolve] :: loading settings :: file = /x1/jenkins/jenkins-slave/workspace/Hive-0.9.1-SNAPSHOT-h0.21-keepgoing=false/hive/ivy/ivysettings.xml
[ivy:resolve] downloading /home/jenkins/.ivy2/local/org.apache.hive/hive-common/0.9.1-SNAPSHOT/jars/hive-common.jar
...
[ivy:resolve] .. (57kB)
[ivy:resolve] .. (0kB)
[ivy:resolve] 	[SUCCESSFUL ] org.apache.hive#hive-common;0.9.1-SNAPSHOT!hive-common.jar (2ms)
[ivy:resolve] downloading http://repo1.maven.org/maven2/org/mockito/mockito-all/1.8.2/mockito-all-1.8.2.jar
...
[ivy:resolve] .........................................................................................................................................................................................
(1315kB)
[ivy:resolve] .. (0kB)
[ivy:resolve] 	[SUCCESSFUL ] org.mockito#mockito-all;1.8.2!mockito-all.jar (130ms)
[ivy:resolve] downloading http://repo1.maven.org/maven2/org/apache/thrift/libfb303/0.7.0/libfb303-0.7.0.jar
...
[ivy:resolve] .................. (171kB)
[ivy:resolve] .. (0kB)
[ivy:resolve] 	[SUCCESSFUL ] org.apache.thrift#libfb303;0.7.0!libfb303.jar (59ms)
[ivy:report] Processing /x1/jenkins/jenkins-slave/workspace/Hive-0.9.1-SNAPSHOT-h0.21-keepgoing=false/hive/build/ivy/resolution-cache/org.apache.hive-hive-serde-default.xml
to /x1/jenkins/jenkins-slave/workspace/Hive-0.9.1-SNAPSHOT-h0.21-keepgoing=false/hive/build/ivy/report/org.apache.hive-hive-serde-default.html

ivy-retrieve:
     [echo] Project: serde

dynamic-serde:

compile:
     [echo] Project: serde
    [javac] Compiling 280 source files to /x1/jenkins/jenkins-slave/workspace/Hive-0.9.1-SNAPSHOT-h0.21-keepgoing=false/hive/build/serde/classes
    [javac] Note: Some input files use unchecked or unsafe operations.
    [javac] Note: Recompile with -Xlint:unchecked for details.
    [javac] Creating empty /x1/jenkins/jenkins-slave/workspace/Hive-0.9.1-SNAPSHOT-h0.21-keepgoing=false/hive/build/serde/classes/org/apache/hadoop/hive/serde2/typeinfo/package-info.class

jar:
     [echo] Project: serde
      [jar] Building jar: /x1/jenkins/jenkins-slave/workspace/Hive-0.9.1-SNAPSHOT-h0.21-keepgoing=false/hive/build/serde/hive-serde-0.9.1-SNAPSHOT.jar
:: delivering :: org.apache.hive#hive-serde;0.9.1-SNAPSHOT :: 0.9.1-SNAPSHOT :: integration
:: Mon Oct 01 16:05:05 UTC 2012
	delivering ivy file to /x1/jenkins/jenkins-slave/workspace/Hive-0.9.1-SNAPSHOT-h0.21-keepgoing=false/hive/build/serde/ivy-0.9.1-SNAPSHOT.xml
:: publishing :: org.apache.hive#hive-serde
	published hive-serde to /home/jenkins/.ivy2/local/org.apache.hive/hive-serde/0.9.1-SNAPSHOT/jars/hive-serde.jar
	published ivy to /home/jenkins/.ivy2/local/org.apache.hive/hive-serde/0.9.1-SNAPSHOT/ivys/ivy.xml

create-dirs:
     [echo] Project: metastore
     [copy] Warning: /x1/jenkins/jenkins-slave/workspace/Hive-0.9.1-SNAPSHOT-h0.21-keepgoing=false/hive/metastore/src/test/resources
does not exist.

init:
     [echo] Project: metastore

metastore-init:
     [echo] Project: metastore
    [mkdir] Created dir: /x1/jenkins/jenkins-slave/workspace/Hive-0.9.1-SNAPSHOT-h0.21-keepgoing=false/hive/build/metastore/gen/antlr/gen-java/org/apache/hadoop/hive/metastore/parser

ivy-init-settings:
     [echo] Project: metastore

ivy-resolve:
     [echo] Project: metastore
[ivy:resolve] :: loading settings :: file = /x1/jenkins/jenkins-slave/workspace/Hive-0.9.1-SNAPSHOT-h0.21-keepgoing=false/hive/ivy/ivysettings.xml
[ivy:resolve] downloading /home/jenkins/.ivy2/local/org.apache.hive/hive-serde/0.9.1-SNAPSHOT/jars/hive-serde.jar
...
[ivy:resolve] ......... (507kB)
[ivy:resolve] .. (0kB)
[ivy:resolve] 	[SUCCESSFUL ] org.apache.hive#hive-serde;0.9.1-SNAPSHOT!hive-serde.jar (9ms)
[ivy:resolve] downloading http://repo1.maven.org/maven2/org/antlr/antlr/3.0.1/antlr-3.0.1.jar
...
[ivy:resolve] ....................................................................... (549kB)
[ivy:resolve] .. (0kB)
[ivy:resolve] 	[SUCCESSFUL ] org.antlr#antlr;3.0.1!antlr.jar (262ms)
[ivy:resolve] downloading http://repo1.maven.org/maven2/org/antlr/antlr-runtime/3.0.1/antlr-runtime-3.0.1.jar
...
[ivy:resolve] ............... (102kB)
[ivy:resolve] .. (0kB)
[ivy:resolve] 	[SUCCESSFUL ] org.antlr#antlr-runtime;3.0.1!antlr-runtime.jar (94ms)
[ivy:resolve] downloading http://repo1.maven.org/maven2/commons-dbcp/commons-dbcp/1.4/commons-dbcp-1.4.jar
...
[ivy:resolve] .................. (156kB)
[ivy:resolve] .. (0kB)
[ivy:resolve] 	[SUCCESSFUL ] commons-dbcp#commons-dbcp;1.4!commons-dbcp.jar (45ms)
[ivy:resolve] downloading http://repo1.maven.org/maven2/commons-pool/commons-pool/1.5.4/commons-pool-1.5.4.jar
...
[ivy:resolve] ........ (93kB)
[ivy:resolve] .. (0kB)
[ivy:resolve] 	[SUCCESSFUL ] commons-pool#commons-pool;1.5.4!commons-pool.jar (128ms)
[ivy:resolve] downloading http://repo1.maven.org/maven2/org/datanucleus/datanucleus-connectionpool/2.0.3/datanucleus-connectionpool-2.0.3.jar
...
[ivy:resolve] .. (16kB)
[ivy:resolve] .. (0kB)
[ivy:resolve] 	[SUCCESSFUL ] org.datanucleus#datanucleus-connectionpool;2.0.3!datanucleus-connectionpool.jar
(247ms)
[ivy:resolve] downloading http://repo1.maven.org/maven2/org/datanucleus/datanucleus-core/2.0.3/datanucleus-core-2.0.3.jar
...
[ivy:resolve] .............................................................................................................................................................................................................................................
(1955kB)
[ivy:resolve] .. (0kB)
[ivy:resolve] 	[SUCCESSFUL ] org.datanucleus#datanucleus-core;2.0.3!datanucleus-core.jar (289ms)
[ivy:resolve] downloading http://repo1.maven.org/maven2/org/datanucleus/datanucleus-enhancer/2.0.3/datanucleus-enhancer-2.0.3.jar
...
[ivy:resolve] ................... (183kB)
[ivy:resolve] .. (0kB)
[ivy:resolve] 	[SUCCESSFUL ] org.datanucleus#datanucleus-enhancer;2.0.3!datanucleus-enhancer.jar
(234ms)
[ivy:resolve] downloading http://repo1.maven.org/maven2/org/datanucleus/datanucleus-rdbms/2.0.3/datanucleus-rdbms-2.0.3.jar
...
[ivy:resolve] ....................................................................................................................................
(1196kB)
[ivy:resolve] .. (0kB)
[ivy:resolve] downloading http://www.datanucleus.org/downloads/maven2/javax/jdo/jdo2-api/2.3-ec/jdo2-api-2.3-ec.jar
...
[ivy:resolve] .................................................................................................................................
(193kB)
[ivy:resolve] .. (0kB)
[ivy:resolve] downloading http://repo1.maven.org/maven2/org/apache/derby/derby/10.4.2.0/derby-10.4.2.0.jar
...
[ivy:resolve] ................................................................................................................................................................................................................................................................................
(2389kB)
[ivy:resolve] .. (0kB)
[ivy:resolve] downloading http://repo1.maven.org/maven2/org/antlr/stringtemplate/3.1-b1/stringtemplate-3.1-b1.jar
...
[ivy:resolve] ...................... (224kB)
[ivy:resolve] .. (0kB)
[ivy:resolve] 	[SUCCESSFUL ] org.antlr#stringtemplate;3.1-b1!stringtemplate.jar (80ms)
[ivy:resolve] downloading http://repo1.maven.org/maven2/antlr/antlr/2.7.7/antlr-2.7.7.jar
...
[ivy:resolve] .............................................. (434kB)
[ivy:resolve] .. (0kB)
[ivy:resolve] 	[SUCCESSFUL ] antlr#antlr;2.7.7!antlr.jar (38ms)
[ivy:resolve] 
[ivy:resolve] :: problems summary ::
[ivy:resolve] :::: WARNINGS
[ivy:resolve] 	problem while downloading module descriptor: http://repo1.maven.org/maven2/asm/asm/3.1/asm-3.1.pom:
/home/jenkins/.ivy2/cache/asm/asm/ivy-3.1.xml.original.part (No such file or directory) (30ms)
[ivy:resolve] 		module not found: asm#asm;3.1
[ivy:resolve] 	==== local: tried
[ivy:resolve] 	  /home/jenkins/.ivy2/local/asm/asm/3.1/ivys/ivy.xml
[ivy:resolve] 	  -- artifact asm#asm;3.1!asm.jar:
[ivy:resolve] 	  /home/jenkins/.ivy2/local/asm/asm/3.1/jars/asm.jar
[ivy:resolve] 	==== apache-snapshot: tried
[ivy:resolve] 	  https://repository.apache.org/content/repositories/snapshots/asm/asm/3.1/asm-3.1.pom
[ivy:resolve] 	  -- artifact asm#asm;3.1!asm.jar:
[ivy:resolve] 	  https://repository.apache.org/content/repositories/snapshots/asm/asm/3.1/asm-3.1.jar
[ivy:resolve] 	==== maven2: tried
[ivy:resolve] 	  http://repo1.maven.org/maven2/asm/asm/3.1/asm-3.1.pom
[ivy:resolve] 	==== datanucleus-repo: tried
[ivy:resolve] 	  -- artifact asm#asm;3.1!asm.jar:
[ivy:resolve] 	  http://www.datanucleus.org/downloads/maven2/asm/asm/3.1/asm-3.1.jar
[ivy:resolve] 	==== hadoop-source: tried
[ivy:resolve] 	  -- artifact asm#asm;3.1!asm.jar:
[ivy:resolve] 	  http://mirror.facebook.net/facebook/hive-deps/hadoop/core/asm-3.1/asm-3.1.jar
[ivy:resolve] 	==== hadoop-source2: tried
[ivy:resolve] 	  -- artifact asm#asm;3.1!asm.jar:
[ivy:resolve] 	  http://archive.cloudera.com/hive-deps/hadoop/core/asm-3.1/asm-3.1.jar
[ivy:resolve] 		[FAILED     ] org.datanucleus#datanucleus-rdbms;2.0.3!datanucleus-rdbms.jar:
impossible to move part file to definitive one: /home/jenkins/.ivy2/cache/org.datanucleus/datanucleus-rdbms/jars/datanucleus-rdbms-2.0.3.jar.part
-> /home/jenkins/.ivy2/cache/org.datanucleus/datanucleus-rdbms/jars/datanucleus-rdbms-2.0.3.jar
(311ms)
[ivy:resolve] 		[FAILED     ] javax.jdo#jdo2-api;2.3-ec!jdo2-api.jar: /home/jenkins/.ivy2/cache/javax.jdo/jdo2-api/jars/jdo2-api-2.3-ec.jar.part
(No such file or directory) (2072ms)
[ivy:resolve] 		[FAILED     ] org.apache.derby#derby;10.4.2.0!derby.jar: impossible to move
part file to definitive one: /home/jenkins/.ivy2/cache/org.apache.derby/derby/jars/derby-10.4.2.0.jar.part
-> /home/jenkins/.ivy2/cache/org.apache.derby/derby/jars/derby-10.4.2.0.jar (231ms)
[ivy:resolve] 		::::::::::::::::::::::::::::::::::::::::::::::
[ivy:resolve] 		::          UNRESOLVED DEPENDENCIES         ::
[ivy:resolve] 		::::::::::::::::::::::::::::::::::::::::::::::
[ivy:resolve] 		:: asm#asm;3.1: not found
[ivy:resolve] 		::::::::::::::::::::::::::::::::::::::::::::::
[ivy:resolve] 
[ivy:resolve] :: USE VERBOSE OR DEBUG MESSAGE LEVEL FOR MORE DETAILS

BUILD FAILED
/x1/jenkins/jenkins-slave/workspace/Hive-0.9.1-SNAPSHOT-h0.21-keepgoing=false/hive/build.xml:302:
The following error occurred while executing this line:
/x1/jenkins/jenkins-slave/workspace/Hive-0.9.1-SNAPSHOT-h0.21-keepgoing=false/hive/build.xml:152:
The following error occurred while executing this line:
/x1/jenkins/jenkins-slave/workspace/Hive-0.9.1-SNAPSHOT-h0.21-keepgoing=false/hive/build-common.xml:125:
impossible to resolve dependencies:
	resolve failed - see output for details

Total time: 2 minutes 9 seconds
Build step 'Invoke Ant' marked build as failure
Archiving artifacts
Recording test results

Mime
View raw message