hive-dev mailing list archives

Site index · List index
Message view « Date » · « Thread »
Top « Date » · « Thread »
From Apache Jenkins Server <jenk...@builds.apache.org>
Subject Hive-trunk-h0.21 - Build # 1651 - Still Failing
Date Thu, 06 Sep 2012 20:15:54 GMT
Changes for Build #1638
[namit] HIVE-3393 get_json_object and json_tuple should use Jackson library
(Kevin Wilfong via namit)


Changes for Build #1639

Changes for Build #1640
[ecapriolo] HIVE-3068 Export table metadata as JSON on table drop (Andrew Chalfant via egc)


Changes for Build #1641

Changes for Build #1642
[hashutosh] HIVE-3338 : Archives broken for hadoop 1.0 (Vikram Dixit via Ashutosh Chauhan)


Changes for Build #1643

Changes for Build #1644

Changes for Build #1645
[cws] HIVE-3413. Fix pdk.PluginTest on hadoop23 (Zhenxiao Luo via cws)


Changes for Build #1646
[cws] HIVE-3056. Ability to bulk update location field in Db/Table/Partition records (Shreepadma
Venugopalan via cws)

[cws] HIVE-3416 [jira] Fix TestAvroSerdeUtils.determineSchemaCanReadSchemaFromHDFS when running
Hive on hadoop23
(Zhenxiao Luo via Carl Steinbach)

Summary:
HIVE-3416: Fix TestAvroSerdeUtils.determineSchemaCanReadSchemaFromHDFS when running Hive on
hadoop23

TestAvroSerdeUtils determinSchemaCanReadSchemaFromHDFS is failing when running hive on hadoop23:

$ant very-clean package -Dhadoop.version=0.23.1 -Dhadoop-0.23.version=0.23.1 -Dhadoop.mr.rev=23

$ant test -Dhadoop.version=0.23.1 -Dhadoop-0.23.version=0.23.1 -Dhadoop.mr.rev=23 -Dtestcase=TestAvroSerdeUtils

 <testcase classname="org.apache.hadoop.hive.serde2.avro.TestAvroSerdeUtils" name="determineSchemaCanReadSchemaFromHDFS"
time="0.21">
    <error message="org/apache/hadoop/net/StaticMapping" type="java.lang.NoClassDefFoundError">java.lang.NoClassDefFoundError:
org/apache/hadoop/net/StaticMapping
    at org.apache.hadoop.hdfs.MiniDFSCluster.initMiniDFSCluster(MiniDFSCluster.java:534)
    at org.apache.hadoop.hdfs.MiniDFSCluster.<init>(MiniDFSCluster.java:489)
    at org.apache.hadoop.hdfs.MiniDFSCluster.<init>(MiniDFSCluster.java:360)
    at org.apache.hadoop.hive.serde2.avro.TestAvroSerdeUtils.determineSchemaCanReadSchemaFromHDFS(TestAvroSerdeUtils.java:187)
    at sun.reflect.NativeMethodAccessorImpl.invoke0(Native Method)
    at sun.reflect.NativeMethodAccessorImpl.invoke(NativeMethodAccessorImpl.java:57)
    at sun.reflect.DelegatingMethodAccessorImpl.invoke(DelegatingMethodAccessorImpl.java:43)
    at java.lang.reflect.Method.invoke(Method.java:616)
    at org.junit.runners.model.FrameworkMethod$1.runReflectiveCall(FrameworkMethod.java:44)
    at org.junit.internal.runners.model.ReflectiveCallable.run(ReflectiveCallable.java:15)
    at org.junit.runners.model.FrameworkMethod.invokeExplosively(FrameworkMethod.java:41)
    at org.junit.internal.runners.statements.InvokeMethod.evaluate(InvokeMethod.java:20)
    at org.junit.runners.BlockJUnit4ClassRunner.runNotIgnored(BlockJUnit4ClassRunner.java:79)
    at org.junit.runners.BlockJUnit4ClassRunner.runChild(BlockJUnit4ClassRunner.java:71)
    at org.junit.runners.BlockJUnit4ClassRunner.runChild(BlockJUnit4ClassRunner.java:49)
    at org.junit.runners.ParentRunner$3.run(ParentRunner.java:193)
    at org.junit.runners.ParentRunner$1.schedule(ParentRunner.java:52)
    at org.junit.runners.ParentRunner.runChildren(ParentRunner.java:191)
    at org.junit.runners.ParentRunner.access$000(ParentRunner.java:42)
    at org.junit.runners.ParentRunner$2.evaluate(ParentRunner.java:184)
    at org.junit.runners.ParentRunner.run(ParentRunner.java:236)
    at junit.framework.JUnit4TestAdapter.run(JUnit4TestAdapter.java:39)
    at org.apache.tools.ant.taskdefs.optional.junit.JUnitTestRunner.run(JUnitTestRunner.java:420)
    at org.apache.tools.ant.taskdefs.optional.junit.JUnitTestRunner.launch(JUnitTestRunner.java:911)
    at org.apache.tools.ant.taskdefs.optional.junit.JUnitTestRunner.main(JUnitTestRunner.java:768)
Caused by: java.lang.ClassNotFoundException: org.apache.hadoop.net.StaticMapping
    at java.net.URLClassLoader$1.run(URLClassLoader.java:217)
    at java.security.AccessController.doPrivileged(Native Method)
    at java.net.URLClassLoader.findClass(URLClassLoader.java:205)
    at java.lang.ClassLoader.loadClass(ClassLoader.java:321)
    at sun.misc.Launcher$AppClassLoader.loadClass(Launcher.java:294)
    at java.lang.ClassLoader.loadClass(ClassLoader.java:266)
    ... 25 more
</error>
  </testcase>

Test Plan: EMPTY

Reviewers: JIRA

Differential Revision: https://reviews.facebook.net/D5025

[cws] HIVE-3424. Error by upgrading a Hive 0.7.0 database to 0.8.0 (008-HIVE-2246.mysql.sql)
(Alexander Alten-Lorenz via cws)

[cws] HIVE-3412. Fix TestCliDriver.repair on Hadoop 0.23.3, 3.0.0, and 2.2.0-alpha (Zhenxiao
Luo via cws)


Changes for Build #1647

Changes for Build #1648
[namit] HIVE-3429 Bucket map join involving table with more than 1 partition column causes

FileNotFoundException (Kevin Wilfong via namit)


Changes for Build #1649
[hashutosh] HIVE-3075 : Improve HiveMetaStore logging (Travis Crawford via Ashutosh Chauhan)


Changes for Build #1650
[hashutosh] HIVE-3340 : shims unit test failures fails further test progress (Giridharan Kesavan
via Ashutosh Chauhan)


Changes for Build #1651
[hashutosh] HIVE-3436 :  Difference in exception string from native method causes script_pipe.q
to fail on windows (Thejas Nair via Ashutosh Chauhan)




2 tests failed.
REGRESSION:  org.apache.hadoop.hive.cli.TestNegativeCliDriver.testNegativeCliDriver_stats_aggregator_error_1

Error Message:
Forked Java VM exited abnormally. Please note the time in the report does not reflect the
time until the VM exit.

Stack Trace:
junit.framework.AssertionFailedError: Forked Java VM exited abnormally. Please note the time
in the report does not reflect the time until the VM exit.
	at net.sf.antcontrib.logic.ForTask.doSequentialIteration(ForTask.java:259)
	at net.sf.antcontrib.logic.ForTask.doToken(ForTask.java:268)
	at net.sf.antcontrib.logic.ForTask.doTheTasks(ForTask.java:324)
	at net.sf.antcontrib.logic.ForTask.execute(ForTask.java:244)


FAILED:  org.apache.hadoop.hive.cli.TestCliDriver.testCliDriver_metadata_export_drop

Error Message:
Unexpected exception See build/ql/tmp/hive.log, or try "ant test ... -Dtest.silent=false"
to get more logs.

Stack Trace:
junit.framework.AssertionFailedError: Unexpected exception
See build/ql/tmp/hive.log, or try "ant test ... -Dtest.silent=false" to get more logs.
	at junit.framework.Assert.fail(Assert.java:47)
	at org.apache.hadoop.hive.cli.TestCliDriver.testCliDriver_metadata_export_drop(TestCliDriver.java:26634)
	at sun.reflect.NativeMethodAccessorImpl.invoke0(Native Method)
	at sun.reflect.NativeMethodAccessorImpl.invoke(NativeMethodAccessorImpl.java:39)
	at sun.reflect.DelegatingMethodAccessorImpl.invoke(DelegatingMethodAccessorImpl.java:25)
	at java.lang.reflect.Method.invoke(Method.java:597)
	at junit.framework.TestCase.runTest(TestCase.java:168)
	at junit.framework.TestCase.runBare(TestCase.java:134)
	at junit.framework.TestResult$1.protect(TestResult.java:110)
	at junit.framework.TestResult.runProtected(TestResult.java:128)
	at junit.framework.TestResult.run(TestResult.java:113)
	at junit.framework.TestCase.run(TestCase.java:124)
	at junit.framework.TestSuite.runTest(TestSuite.java:232)
	at junit.framework.TestSuite.run(TestSuite.java:227)
	at org.apache.tools.ant.taskdefs.optional.junit.JUnitTestRunner.run(JUnitTestRunner.java:422)
	at org.apache.tools.ant.taskdefs.optional.junit.JUnitTestRunner.launch(JUnitTestRunner.java:931)
	at org.apache.tools.ant.taskdefs.optional.junit.JUnitTestRunner.main(JUnitTestRunner.java:785)




The Apache Jenkins build system has built Hive-trunk-h0.21 (build #1651)

Status: Still Failing

Check console output at https://builds.apache.org/job/Hive-trunk-h0.21/1651/ to view the results.
Mime
  • Unnamed multipart/mixed (inline, None, 0 bytes)
View raw message