hive-dev mailing list archives

Site index · List index
Message view « Date » · « Thread »
Top « Date » · « Thread »
From Apache Jenkins Server <jenk...@builds.apache.org>
Subject Build failed in Jenkins: Hive-0.9.1-SNAPSHOT-h0.21-keepgoing=false #125
Date Mon, 03 Sep 2012 16:04:05 GMT
See <https://builds.apache.org/job/Hive-0.9.1-SNAPSHOT-h0.21-keepgoing=false/125/>

------------------------------------------
[...truncated 5832 lines...]
[ivy:resolve] 	==== local: tried
[ivy:resolve] 	  /home/hudson/.ivy2/local/javax.servlet/servlet-api/2.5/ivys/ivy.xml
[ivy:resolve] 	  -- artifact javax.servlet#servlet-api;2.5!servlet-api.jar:
[ivy:resolve] 	  /home/hudson/.ivy2/local/javax.servlet/servlet-api/2.5/jars/servlet-api.jar
[ivy:resolve] 	==== apache-snapshot: tried
[ivy:resolve] 	  https://repository.apache.org/content/repositories/snapshots/javax/servlet/servlet-api/2.5/servlet-api-2.5.pom
[ivy:resolve] 	  -- artifact javax.servlet#servlet-api;2.5!servlet-api.jar:
[ivy:resolve] 	  https://repository.apache.org/content/repositories/snapshots/javax/servlet/servlet-api/2.5/servlet-api-2.5.jar
[ivy:resolve] 	==== maven2: tried
[ivy:resolve] 	  http://repo1.maven.org/maven2/javax/servlet/servlet-api/2.5/servlet-api-2.5.pom
[ivy:resolve] 	==== datanucleus-repo: tried
[ivy:resolve] 	  -- artifact javax.servlet#servlet-api;2.5!servlet-api.jar:
[ivy:resolve] 	  http://www.datanucleus.org/downloads/maven2/javax/servlet/servlet-api/2.5/servlet-api-2.5.jar
[ivy:resolve] 	==== hadoop-source: tried
[ivy:resolve] 	  -- artifact javax.servlet#servlet-api;2.5!servlet-api.jar:
[ivy:resolve] 	  http://mirror.facebook.net/facebook/hive-deps/hadoop/core/servlet-api-2.5/servlet-api-2.5.jar
[ivy:resolve] 	==== hadoop-source2: tried
[ivy:resolve] 	  -- artifact javax.servlet#servlet-api;2.5!servlet-api.jar:
[ivy:resolve] 	  http://archive.cloudera.com/hive-deps/hadoop/core/servlet-api-2.5/servlet-api-2.5.jar
[ivy:resolve] 	problem while downloading module descriptor: http://repo1.maven.org/maven2/com/sun/xml/bind/jaxb-impl/2.2.3-1/jaxb-impl-2.2.3-1.pom:
/home/hudson/.ivy2/cache/com.sun.xml.bind/jaxb-impl/ivy-2.2.3-1.xml.original.part (No such
file or directory) (14ms)
[ivy:resolve] 		module not found: com.sun.xml.bind#jaxb-impl;2.2.3-1
[ivy:resolve] 	==== local: tried
[ivy:resolve] 	  /home/hudson/.ivy2/local/com.sun.xml.bind/jaxb-impl/2.2.3-1/ivys/ivy.xml
[ivy:resolve] 	  -- artifact com.sun.xml.bind#jaxb-impl;2.2.3-1!jaxb-impl.jar:
[ivy:resolve] 	  /home/hudson/.ivy2/local/com.sun.xml.bind/jaxb-impl/2.2.3-1/jars/jaxb-impl.jar
[ivy:resolve] 	==== apache-snapshot: tried
[ivy:resolve] 	  https://repository.apache.org/content/repositories/snapshots/com/sun/xml/bind/jaxb-impl/2.2.3-1/jaxb-impl-2.2.3-1.pom
[ivy:resolve] 	  -- artifact com.sun.xml.bind#jaxb-impl;2.2.3-1!jaxb-impl.jar:
[ivy:resolve] 	  https://repository.apache.org/content/repositories/snapshots/com/sun/xml/bind/jaxb-impl/2.2.3-1/jaxb-impl-2.2.3-1.jar
[ivy:resolve] 	==== maven2: tried
[ivy:resolve] 	  http://repo1.maven.org/maven2/com/sun/xml/bind/jaxb-impl/2.2.3-1/jaxb-impl-2.2.3-1.pom
[ivy:resolve] 	==== datanucleus-repo: tried
[ivy:resolve] 	  -- artifact com.sun.xml.bind#jaxb-impl;2.2.3-1!jaxb-impl.jar:
[ivy:resolve] 	  http://www.datanucleus.org/downloads/maven2/com/sun/xml/bind/jaxb-impl/2.2.3-1/jaxb-impl-2.2.3-1.jar
[ivy:resolve] 	==== hadoop-source: tried
[ivy:resolve] 	  -- artifact com.sun.xml.bind#jaxb-impl;2.2.3-1!jaxb-impl.jar:
[ivy:resolve] 	  http://mirror.facebook.net/facebook/hive-deps/hadoop/core/jaxb-impl-2.2.3-1/jaxb-impl-2.2.3-1.jar
[ivy:resolve] 	==== hadoop-source2: tried
[ivy:resolve] 	  -- artifact com.sun.xml.bind#jaxb-impl;2.2.3-1!jaxb-impl.jar:
[ivy:resolve] 	  http://archive.cloudera.com/hive-deps/hadoop/core/jaxb-impl-2.2.3-1/jaxb-impl-2.2.3-1.jar
[ivy:resolve] 	problem while downloading module descriptor: http://repo1.maven.org/maven2/org/codehaus/jackson/jackson-xc/1.7.1/jackson-xc-1.7.1.pom:
/home/hudson/.ivy2/cache/org.codehaus.jackson/jackson-xc/ivy-1.7.1.xml.original.part (No such
file or directory) (132ms)
[ivy:resolve] 		module not found: org.codehaus.jackson#jackson-xc;1.7.1
[ivy:resolve] 	==== local: tried
[ivy:resolve] 	  /home/hudson/.ivy2/local/org.codehaus.jackson/jackson-xc/1.7.1/ivys/ivy.xml
[ivy:resolve] 	  -- artifact org.codehaus.jackson#jackson-xc;1.7.1!jackson-xc.jar:
[ivy:resolve] 	  /home/hudson/.ivy2/local/org.codehaus.jackson/jackson-xc/1.7.1/jars/jackson-xc.jar
[ivy:resolve] 	==== apache-snapshot: tried
[ivy:resolve] 	  https://repository.apache.org/content/repositories/snapshots/org/codehaus/jackson/jackson-xc/1.7.1/jackson-xc-1.7.1.pom
[ivy:resolve] 	  -- artifact org.codehaus.jackson#jackson-xc;1.7.1!jackson-xc.jar:
[ivy:resolve] 	  https://repository.apache.org/content/repositories/snapshots/org/codehaus/jackson/jackson-xc/1.7.1/jackson-xc-1.7.1.jar
[ivy:resolve] 	==== maven2: tried
[ivy:resolve] 	  http://repo1.maven.org/maven2/org/codehaus/jackson/jackson-xc/1.7.1/jackson-xc-1.7.1.pom
[ivy:resolve] 	==== datanucleus-repo: tried
[ivy:resolve] 	  -- artifact org.codehaus.jackson#jackson-xc;1.7.1!jackson-xc.jar:
[ivy:resolve] 	  http://www.datanucleus.org/downloads/maven2/org/codehaus/jackson/jackson-xc/1.7.1/jackson-xc-1.7.1.jar
[ivy:resolve] 	==== hadoop-source: tried
[ivy:resolve] 	  -- artifact org.codehaus.jackson#jackson-xc;1.7.1!jackson-xc.jar:
[ivy:resolve] 	  http://mirror.facebook.net/facebook/hive-deps/hadoop/core/jackson-xc-1.7.1/jackson-xc-1.7.1.jar
[ivy:resolve] 	==== hadoop-source2: tried
[ivy:resolve] 	  -- artifact org.codehaus.jackson#jackson-xc;1.7.1!jackson-xc.jar:
[ivy:resolve] 	  http://archive.cloudera.com/hive-deps/hadoop/core/jackson-xc-1.7.1/jackson-xc-1.7.1.jar
[ivy:resolve] 	problem while downloading module descriptor: http://repo1.maven.org/maven2/tomcat/jasper-runtime/5.5.23/jasper-runtime-5.5.23.pom:
/home/hudson/.ivy2/cache/tomcat/jasper-runtime/ivy-5.5.23.xml.original.part (No such file
or directory) (13ms)
[ivy:resolve] 		module not found: tomcat#jasper-runtime;5.5.23
[ivy:resolve] 	==== local: tried
[ivy:resolve] 	  /home/hudson/.ivy2/local/tomcat/jasper-runtime/5.5.23/ivys/ivy.xml
[ivy:resolve] 	  -- artifact tomcat#jasper-runtime;5.5.23!jasper-runtime.jar:
[ivy:resolve] 	  /home/hudson/.ivy2/local/tomcat/jasper-runtime/5.5.23/jars/jasper-runtime.jar
[ivy:resolve] 	==== apache-snapshot: tried
[ivy:resolve] 	  https://repository.apache.org/content/repositories/snapshots/tomcat/jasper-runtime/5.5.23/jasper-runtime-5.5.23.pom
[ivy:resolve] 	  -- artifact tomcat#jasper-runtime;5.5.23!jasper-runtime.jar:
[ivy:resolve] 	  https://repository.apache.org/content/repositories/snapshots/tomcat/jasper-runtime/5.5.23/jasper-runtime-5.5.23.jar
[ivy:resolve] 	==== maven2: tried
[ivy:resolve] 	  http://repo1.maven.org/maven2/tomcat/jasper-runtime/5.5.23/jasper-runtime-5.5.23.pom
[ivy:resolve] 	==== datanucleus-repo: tried
[ivy:resolve] 	  -- artifact tomcat#jasper-runtime;5.5.23!jasper-runtime.jar:
[ivy:resolve] 	  http://www.datanucleus.org/downloads/maven2/tomcat/jasper-runtime/5.5.23/jasper-runtime-5.5.23.jar
[ivy:resolve] 	==== hadoop-source: tried
[ivy:resolve] 	  -- artifact tomcat#jasper-runtime;5.5.23!jasper-runtime.jar:
[ivy:resolve] 	  http://mirror.facebook.net/facebook/hive-deps/hadoop/core/jasper-runtime-5.5.23/jasper-runtime-5.5.23.jar
[ivy:resolve] 	==== hadoop-source2: tried
[ivy:resolve] 	  -- artifact tomcat#jasper-runtime;5.5.23!jasper-runtime.jar:
[ivy:resolve] 	  http://archive.cloudera.com/hive-deps/hadoop/core/jasper-runtime-5.5.23/jasper-runtime-5.5.23.jar
[ivy:resolve] 	problem while downloading module descriptor: http://repo1.maven.org/maven2/log4j/log4j/1.2.15/log4j-1.2.15.pom:
/home/hudson/.ivy2/cache/log4j/log4j/ivy-1.2.15.xml.original.part (No such file or directory)
(69ms)
[ivy:resolve] 		module not found: log4j#log4j;1.2.15
[ivy:resolve] 	==== local: tried
[ivy:resolve] 	  /home/hudson/.ivy2/local/log4j/log4j/1.2.15/ivys/ivy.xml
[ivy:resolve] 	  -- artifact log4j#log4j;1.2.15!log4j.jar:
[ivy:resolve] 	  /home/hudson/.ivy2/local/log4j/log4j/1.2.15/jars/log4j.jar
[ivy:resolve] 	==== apache-snapshot: tried
[ivy:resolve] 	  https://repository.apache.org/content/repositories/snapshots/log4j/log4j/1.2.15/log4j-1.2.15.pom
[ivy:resolve] 	  -- artifact log4j#log4j;1.2.15!log4j.jar:
[ivy:resolve] 	  https://repository.apache.org/content/repositories/snapshots/log4j/log4j/1.2.15/log4j-1.2.15.jar
[ivy:resolve] 	==== maven2: tried
[ivy:resolve] 	  http://repo1.maven.org/maven2/log4j/log4j/1.2.15/log4j-1.2.15.pom
[ivy:resolve] 	==== datanucleus-repo: tried
[ivy:resolve] 	  -- artifact log4j#log4j;1.2.15!log4j.jar:
[ivy:resolve] 	  http://www.datanucleus.org/downloads/maven2/log4j/log4j/1.2.15/log4j-1.2.15.jar
[ivy:resolve] 	==== hadoop-source: tried
[ivy:resolve] 	  -- artifact log4j#log4j;1.2.15!log4j.jar:
[ivy:resolve] 	  http://mirror.facebook.net/facebook/hive-deps/hadoop/core/log4j-1.2.15/log4j-1.2.15.jar
[ivy:resolve] 	==== hadoop-source2: tried
[ivy:resolve] 	  -- artifact log4j#log4j;1.2.15!log4j.jar:
[ivy:resolve] 	  http://archive.cloudera.com/hive-deps/hadoop/core/log4j-1.2.15/log4j-1.2.15.jar
[ivy:resolve] 	problem while downloading module descriptor: http://repo1.maven.org/maven2/org/slf4j/slf4j-log4j12/1.6.1/slf4j-log4j12-1.6.1.pom:
/home/hudson/.ivy2/cache/org.slf4j/slf4j-log4j12/ivy-1.6.1.xml.original.part (No such file
or directory) (11ms)
[ivy:resolve] 		module not found: org.slf4j#slf4j-log4j12;1.6.1
[ivy:resolve] 	==== local: tried
[ivy:resolve] 	  /home/hudson/.ivy2/local/org.slf4j/slf4j-log4j12/1.6.1/ivys/ivy.xml
[ivy:resolve] 	  -- artifact org.slf4j#slf4j-log4j12;1.6.1!slf4j-log4j12.jar:
[ivy:resolve] 	  /home/hudson/.ivy2/local/org.slf4j/slf4j-log4j12/1.6.1/jars/slf4j-log4j12.jar
[ivy:resolve] 	==== apache-snapshot: tried
[ivy:resolve] 	  https://repository.apache.org/content/repositories/snapshots/org/slf4j/slf4j-log4j12/1.6.1/slf4j-log4j12-1.6.1.pom
[ivy:resolve] 	  -- artifact org.slf4j#slf4j-log4j12;1.6.1!slf4j-log4j12.jar:
[ivy:resolve] 	  https://repository.apache.org/content/repositories/snapshots/org/slf4j/slf4j-log4j12/1.6.1/slf4j-log4j12-1.6.1.jar
[ivy:resolve] 	==== maven2: tried
[ivy:resolve] 	  http://repo1.maven.org/maven2/org/slf4j/slf4j-log4j12/1.6.1/slf4j-log4j12-1.6.1.pom
[ivy:resolve] 	==== datanucleus-repo: tried
[ivy:resolve] 	  -- artifact org.slf4j#slf4j-log4j12;1.6.1!slf4j-log4j12.jar:
[ivy:resolve] 	  http://www.datanucleus.org/downloads/maven2/org/slf4j/slf4j-log4j12/1.6.1/slf4j-log4j12-1.6.1.jar
[ivy:resolve] 	==== hadoop-source: tried
[ivy:resolve] 	  -- artifact org.slf4j#slf4j-log4j12;1.6.1!slf4j-log4j12.jar:
[ivy:resolve] 	  http://mirror.facebook.net/facebook/hive-deps/hadoop/core/slf4j-log4j12-1.6.1/slf4j-log4j12-1.6.1.jar
[ivy:resolve] 	==== hadoop-source2: tried
[ivy:resolve] 	  -- artifact org.slf4j#slf4j-log4j12;1.6.1!slf4j-log4j12.jar:
[ivy:resolve] 	  http://archive.cloudera.com/hive-deps/hadoop/core/slf4j-log4j12-1.6.1/slf4j-log4j12-1.6.1.jar
[ivy:resolve] 	problem while downloading module descriptor: http://repo1.maven.org/maven2/org/apache/avro/avro-parent/1.5.3/avro-parent-1.5.3.pom:
/home/hudson/.ivy2/cache/org.apache.avro/avro-parent/ivy-1.5.3.xml.original.part (No such
file or directory) (25ms)
[ivy:resolve] 	io problem while parsing ivy file: http://repo1.maven.org/maven2/org/apache/avro/avro/1.5.3/avro-1.5.3.pom:
Impossible to load parent for file:/home/hudson/.ivy2/cache/org.apache.avro/avro/ivy-1.5.3.xml.original.
Parent=org.apache.avro#avro-parent;1.5.3
[ivy:resolve] 		module not found: org.apache.avro#avro;1.5.3
[ivy:resolve] 	==== local: tried
[ivy:resolve] 	  /home/hudson/.ivy2/local/org.apache.avro/avro-parent/1.5.3/ivys/ivy.xml
[ivy:resolve] 	  -- artifact org.apache.avro#avro-parent;1.5.3!avro-parent.jar:
[ivy:resolve] 	  /home/hudson/.ivy2/local/org.apache.avro/avro-parent/1.5.3/jars/avro-parent.jar
[ivy:resolve] 	==== apache-snapshot: tried
[ivy:resolve] 	  https://repository.apache.org/content/repositories/snapshots/org/apache/avro/avro-parent/1.5.3/avro-parent-1.5.3.pom
[ivy:resolve] 	  -- artifact org.apache.avro#avro-parent;1.5.3!avro-parent.jar:
[ivy:resolve] 	  https://repository.apache.org/content/repositories/snapshots/org/apache/avro/avro-parent/1.5.3/avro-parent-1.5.3.jar
[ivy:resolve] 	==== maven2: tried
[ivy:resolve] 	  http://repo1.maven.org/maven2/org/apache/avro/avro-parent/1.5.3/avro-parent-1.5.3.pom
[ivy:resolve] 	==== datanucleus-repo: tried
[ivy:resolve] 	  -- artifact org.apache.avro#avro;1.5.3!avro.jar:
[ivy:resolve] 	  http://www.datanucleus.org/downloads/maven2/org/apache/avro/avro/1.5.3/avro-1.5.3.jar
[ivy:resolve] 	==== hadoop-source: tried
[ivy:resolve] 	  -- artifact org.apache.avro#avro;1.5.3!avro.jar:
[ivy:resolve] 	  http://mirror.facebook.net/facebook/hive-deps/hadoop/core/avro-1.5.3/avro-1.5.3.jar
[ivy:resolve] 	==== hadoop-source2: tried
[ivy:resolve] 	  -- artifact org.apache.avro#avro;1.5.3!avro.jar:
[ivy:resolve] 	  http://archive.cloudera.com/hive-deps/hadoop/core/avro-1.5.3/avro-1.5.3.jar
[ivy:resolve] 	problem while downloading module descriptor: http://repo1.maven.org/maven2/jdiff/jdiff/1.0.9/jdiff-1.0.9.pom:
impossible to move part file to definitive one: /home/hudson/.ivy2/cache/jdiff/jdiff/ivy-1.0.9.xml.original.part
-> /home/hudson/.ivy2/cache/jdiff/jdiff/ivy-1.0.9.xml.original (23ms)
[ivy:resolve] 		module not found: jdiff#jdiff;1.0.9
[ivy:resolve] 	==== local: tried
[ivy:resolve] 	  /home/hudson/.ivy2/local/jdiff/jdiff/1.0.9/ivys/ivy.xml
[ivy:resolve] 	  -- artifact jdiff#jdiff;1.0.9!jdiff.jar:
[ivy:resolve] 	  /home/hudson/.ivy2/local/jdiff/jdiff/1.0.9/jars/jdiff.jar
[ivy:resolve] 	==== apache-snapshot: tried
[ivy:resolve] 	  https://repository.apache.org/content/repositories/snapshots/jdiff/jdiff/1.0.9/jdiff-1.0.9.pom
[ivy:resolve] 	  -- artifact jdiff#jdiff;1.0.9!jdiff.jar:
[ivy:resolve] 	  https://repository.apache.org/content/repositories/snapshots/jdiff/jdiff/1.0.9/jdiff-1.0.9.jar
[ivy:resolve] 	==== maven2: tried
[ivy:resolve] 	  http://repo1.maven.org/maven2/jdiff/jdiff/1.0.9/jdiff-1.0.9.pom
[ivy:resolve] 	==== datanucleus-repo: tried
[ivy:resolve] 	  -- artifact jdiff#jdiff;1.0.9!jdiff.jar:
[ivy:resolve] 	  http://www.datanucleus.org/downloads/maven2/jdiff/jdiff/1.0.9/jdiff-1.0.9.jar
[ivy:resolve] 	==== hadoop-source: tried
[ivy:resolve] 	  -- artifact jdiff#jdiff;1.0.9!jdiff.jar:
[ivy:resolve] 	  http://mirror.facebook.net/facebook/hive-deps/hadoop/core/jdiff-1.0.9/jdiff-1.0.9.jar
[ivy:resolve] 	==== hadoop-source2: tried
[ivy:resolve] 	  -- artifact jdiff#jdiff;1.0.9!jdiff.jar:
[ivy:resolve] 	  http://archive.cloudera.com/hive-deps/hadoop/core/jdiff-1.0.9/jdiff-1.0.9.jar
[ivy:resolve] 	problem while downloading module descriptor: http://repo1.maven.org/maven2/com/sun/jersey/contribs/jersey-guice/1.8/jersey-guice-1.8.pom:
/home/hudson/.ivy2/cache/com.sun.jersey.contribs/jersey-guice/ivy-1.8.xml.original.part (No
such file or directory) (35ms)
[ivy:resolve] 		module not found: com.sun.jersey.contribs#jersey-guice;1.8
[ivy:resolve] 	==== local: tried
[ivy:resolve] 	  /home/hudson/.ivy2/local/com.sun.jersey.contribs/jersey-guice/1.8/ivys/ivy.xml
[ivy:resolve] 	  -- artifact com.sun.jersey.contribs#jersey-guice;1.8!jersey-guice.jar:
[ivy:resolve] 	  /home/hudson/.ivy2/local/com.sun.jersey.contribs/jersey-guice/1.8/jars/jersey-guice.jar
[ivy:resolve] 	==== apache-snapshot: tried
[ivy:resolve] 	  https://repository.apache.org/content/repositories/snapshots/com/sun/jersey/contribs/jersey-guice/1.8/jersey-guice-1.8.pom
[ivy:resolve] 	  -- artifact com.sun.jersey.contribs#jersey-guice;1.8!jersey-guice.jar:
[ivy:resolve] 	  https://repository.apache.org/content/repositories/snapshots/com/sun/jersey/contribs/jersey-guice/1.8/jersey-guice-1.8.jar
[ivy:resolve] 	==== maven2: tried
[ivy:resolve] 	  http://repo1.maven.org/maven2/com/sun/jersey/contribs/jersey-guice/1.8/jersey-guice-1.8.pom
[ivy:resolve] 	==== datanucleus-repo: tried
[ivy:resolve] 	  -- artifact com.sun.jersey.contribs#jersey-guice;1.8!jersey-guice.jar:
[ivy:resolve] 	  http://www.datanucleus.org/downloads/maven2/com/sun/jersey/contribs/jersey-guice/1.8/jersey-guice-1.8.jar
[ivy:resolve] 	==== hadoop-source: tried
[ivy:resolve] 	  -- artifact com.sun.jersey.contribs#jersey-guice;1.8!jersey-guice.jar:
[ivy:resolve] 	  http://mirror.facebook.net/facebook/hive-deps/hadoop/core/jersey-guice-1.8/jersey-guice-1.8.jar
[ivy:resolve] 	==== hadoop-source2: tried
[ivy:resolve] 	  -- artifact com.sun.jersey.contribs#jersey-guice;1.8!jersey-guice.jar:
[ivy:resolve] 	  http://archive.cloudera.com/hive-deps/hadoop/core/jersey-guice-1.8/jersey-guice-1.8.jar
[ivy:resolve] 	impossible to put metadata file in cache: http://repo1.maven.org/maven2/junit/junit/4.8.2/junit-4.8.2.pom
(4.8.2). java.io.FileNotFoundException: /home/hudson/.ivy2/cache/junit/junit/ivy-4.8.2.xml.original
(No such file or directory)
[ivy:resolve] 		[FAILED     ] commons-httpclient#commons-httpclient;3.1!commons-httpclient.jar:
impossible to move part file to definitive one: /home/hudson/.ivy2/cache/commons-httpclient/commons-httpclient/jars/commons-httpclient-3.1.jar.part
-> /home/hudson/.ivy2/cache/commons-httpclient/commons-httpclient/jars/commons-httpclient-3.1.jar
(34ms)
[ivy:resolve] 		[FAILED     ] com.sun.jersey#jersey-server;1.8!jersey-server.jar(bundle):
/home/hudson/.ivy2/cache/com.sun.jersey/jersey-server/bundles/jersey-server-1.8.jar.part (No
such file or directory) (30ms)
[ivy:resolve] 		[FAILED     ] tomcat#jasper-compiler;5.5.23!jasper-compiler.jar: impossible
to move part file to definitive one: /home/hudson/.ivy2/cache/tomcat/jasper-compiler/jars/jasper-compiler-5.5.23.jar.part
-> /home/hudson/.ivy2/cache/tomcat/jasper-compiler/jars/jasper-compiler-5.5.23.jar (145ms)
[ivy:resolve] 		[FAILED     ] hsqldb#hsqldb;1.8.0.7!hsqldb.jar: /home/hudson/.ivy2/cache/hsqldb/hsqldb/jars/hsqldb-1.8.0.7.jar.part
(No such file or directory) (24ms)
[ivy:resolve] 		[FAILED     ] org.slf4j#slf4j-api;1.6.1!slf4j-api.jar: /home/hudson/.ivy2/cache/org.slf4j/slf4j-api/jars/slf4j-api-1.6.1.jar.part
(No such file or directory) (13ms)
[ivy:resolve] 		[FAILED     ] org.aspectj#aspectjrt;1.6.5!aspectjrt.jar: impossible to move
part file to definitive one: /home/hudson/.ivy2/cache/org.aspectj/aspectjrt/jars/aspectjrt-1.6.5.jar.part
-> /home/hudson/.ivy2/cache/org.aspectj/aspectjrt/jars/aspectjrt-1.6.5.jar (32ms)
[ivy:resolve] 		[FAILED     ] com.google.protobuf#protobuf-java;2.4.0a!protobuf-java.jar:
impossible to move part file to definitive one: /home/hudson/.ivy2/cache/com.google.protobuf/protobuf-java/jars/protobuf-java-2.4.0a.jar.part
-> /home/hudson/.ivy2/cache/com.google.protobuf/protobuf-java/jars/protobuf-java-2.4.0a.jar
(167ms)
[ivy:resolve] 		[FAILED     ] org.apache.hadoop#hadoop-annotations;0.23.1!hadoop-annotations.jar:
/home/hudson/.ivy2/cache/org.apache.hadoop/hadoop-annotations/jars/hadoop-annotations-0.23.1.jar.part
(No such file or directory) (229ms)
[ivy:resolve] 		[FAILED     ] com.cenqua.clover#clover;3.0.2!clover.jar: impossible to move
part file to definitive one: /home/hudson/.ivy2/cache/com.cenqua.clover/clover/jars/clover-3.0.2.jar.part
-> /home/hudson/.ivy2/cache/com.cenqua.clover/clover/jars/clover-3.0.2.jar (468ms)
[ivy:resolve] 		[FAILED     ] org.apache.hadoop#hadoop-yarn-api;0.23.1!hadoop-yarn-api.jar:
impossible to move part file to definitive one: /home/hudson/.ivy2/cache/org.apache.hadoop/hadoop-yarn-api/jars/hadoop-yarn-api-0.23.1.jar.part
-> /home/hudson/.ivy2/cache/org.apache.hadoop/hadoop-yarn-api/jars/hadoop-yarn-api-0.23.1.jar
(62ms)
[ivy:resolve] 		[FAILED     ] commons-io#commons-io;2.1!commons-io.jar: impossible to move
part file to definitive one: /home/hudson/.ivy2/cache/commons-io/commons-io/jars/commons-io-2.1.jar.part
-> /home/hudson/.ivy2/cache/commons-io/commons-io/jars/commons-io-2.1.jar (41ms)
[ivy:resolve] 		[FAILED     ] com.sun.jersey.jersey-test-framework#jersey-test-framework-grizzly2;1.8!jersey-test-framework-grizzly2.jar:
Downloaded file size doesn't match expected Content Length for http://repo1.maven.org/maven2/com/sun/jersey/jersey-test-framework/jersey-test-framework-grizzly2/1.8/jersey-test-framework-grizzly2-1.8.jar.
Please retry. (19ms)
[ivy:resolve] 		[FAILED     ] com.sun.jersey.jersey-test-framework#jersey-test-framework-grizzly2;1.8!jersey-test-framework-grizzly2.jar:
 (0ms)
[ivy:resolve] 	==== local: tried
[ivy:resolve] 	  /home/hudson/.ivy2/local/com.sun.jersey.jersey-test-framework/jersey-test-framework-grizzly2/1.8/jars/jersey-test-framework-grizzly2.jar
[ivy:resolve] 	==== apache-snapshot: tried
[ivy:resolve] 	  https://repository.apache.org/content/repositories/snapshots/com/sun/jersey/jersey-test-framework/jersey-test-framework-grizzly2/1.8/jersey-test-framework-grizzly2-1.8.jar
[ivy:resolve] 	==== maven2: tried
[ivy:resolve] 	  http://repo1.maven.org/maven2/com/sun/jersey/jersey-test-framework/jersey-test-framework-grizzly2/1.8/jersey-test-framework-grizzly2-1.8.jar
[ivy:resolve] 	==== datanucleus-repo: tried
[ivy:resolve] 	  http://www.datanucleus.org/downloads/maven2/com/sun/jersey/jersey-test-framework/jersey-test-framework-grizzly2/1.8/jersey-test-framework-grizzly2-1.8.jar
[ivy:resolve] 	==== hadoop-source: tried
[ivy:resolve] 	  http://mirror.facebook.net/facebook/hive-deps/hadoop/core/jersey-test-framework-grizzly2-1.8/jersey-test-framework-grizzly2-1.8.jar
[ivy:resolve] 	==== hadoop-source2: tried
[ivy:resolve] 	  http://archive.cloudera.com/hive-deps/hadoop/core/jersey-test-framework-grizzly2-1.8/jersey-test-framework-grizzly2-1.8.jar
[ivy:resolve] 		::::::::::::::::::::::::::::::::::::::::::::::
[ivy:resolve] 		::          UNRESOLVED DEPENDENCIES         ::
[ivy:resolve] 		::::::::::::::::::::::::::::::::::::::::::::::
[ivy:resolve] 		:: javax.servlet#servlet-api;2.5: not found
[ivy:resolve] 		:: com.sun.xml.bind#jaxb-impl;2.2.3-1: not found
[ivy:resolve] 		:: org.codehaus.jackson#jackson-xc;1.7.1: not found
[ivy:resolve] 		:: tomcat#jasper-runtime;5.5.23: not found
[ivy:resolve] 		:: log4j#log4j;1.2.15: not found
[ivy:resolve] 		:: org.slf4j#slf4j-log4j12;1.6.1: not found
[ivy:resolve] 		:: org.apache.avro#avro;1.5.3: not found
[ivy:resolve] 		:: jdiff#jdiff;1.0.9: not found
[ivy:resolve] 		:: com.sun.jersey.contribs#jersey-guice;1.8: not found
[ivy:resolve] 		::::::::::::::::::::::::::::::::::::::::::::::
[ivy:resolve] 		::::::::::::::::::::::::::::::::::::::::::::::
[ivy:resolve] 		::              FAILED DOWNLOADS            ::
[ivy:resolve] 		:: ^ see resolution messages for details  ^ ::
[ivy:resolve] 		::::::::::::::::::::::::::::::::::::::::::::::
[ivy:resolve] 		:: com.sun.jersey.jersey-test-framework#jersey-test-framework-grizzly2;1.8!jersey-test-framework-grizzly2.jar
[ivy:resolve] 		::::::::::::::::::::::::::::::::::::::::::::::
[ivy:resolve] 
[ivy:resolve] :: USE VERBOSE OR DEBUG MESSAGE LEVEL FOR MORE DETAILS

BUILD FAILED
<https://builds.apache.org/job/Hive-0.9.1-SNAPSHOT-h0.21-keepgoing=false/ws/hive/build.xml>:302:
The following error occurred while executing this line:
<https://builds.apache.org/job/Hive-0.9.1-SNAPSHOT-h0.21-keepgoing=false/ws/hive/build.xml>:152:
The following error occurred while executing this line:
<https://builds.apache.org/job/Hive-0.9.1-SNAPSHOT-h0.21-keepgoing=false/ws/hive/shims/build.xml>:85:
The following error occurred while executing this line:
<https://builds.apache.org/job/Hive-0.9.1-SNAPSHOT-h0.21-keepgoing=false/ws/hive/shims/build.xml>:88:
The following error occurred while executing this line:
<https://builds.apache.org/job/Hive-0.9.1-SNAPSHOT-h0.21-keepgoing=false/ws/hive/shims/build.xml>:60:
The following error occurred while executing this line:
<https://builds.apache.org/job/Hive-0.9.1-SNAPSHOT-h0.21-keepgoing=false/ws/hive/build-common.xml>:164:
impossible to resolve dependencies:
	resolve failed - see output for details

Total time: 1 minute 3 seconds
Build step 'Invoke Ant' marked build as failure
Archiving artifacts
Recording test results

Mime
View raw message