hive-dev mailing list archives

Site index · List index
Message view « Date » · « Thread »
Top « Date » · « Thread »
From Apache Jenkins Server <jenk...@builds.apache.org>
Subject Build failed in Jenkins: Hive-0.9.1-SNAPSHOT-h0.21-keepgoing=false #135
Date Wed, 12 Sep 2012 16:12:26 GMT
See <https://builds.apache.org/job/Hive-0.9.1-SNAPSHOT-h0.21-keepgoing=false/135/>

------------------------------------------
[...truncated 7697 lines...]
ivy-resolve-hadoop-shim:
     [echo] Project: shims
[ivy:resolve] :: loading settings :: file = <https://builds.apache.org/job/Hive-0.9.1-SNAPSHOT-h0.21-keepgoing=false/ws/hive/ivy/ivysettings.xml>

ivy-retrieve-hadoop-shim:
     [echo] Project: shims
     [echo] Building shims 0.23

build_shims:
     [echo] Project: shims
     [echo] Compiling <https://builds.apache.org/job/Hive-0.9.1-SNAPSHOT-h0.21-keepgoing=false/ws/hive/shims/src/common/java;/home/jenkins/jenkins-slave/workspace/Hive-0.9.1-SNAPSHOT-h0.21-keepgoing=false/hive/shims/src/common-secure/java;/home/jenkins/jenkins-slave/workspace/Hive-0.9.1-SNAPSHOT-h0.21-keepgoing=false/hive/shims/src/0.23/java>
against hadoop 0.23.1 (<https://builds.apache.org/job/Hive-0.9.1-SNAPSHOT-h0.21-keepgoing=false/135/artifact/hive/build/hadoopcore/hadoop-0.23.1)>

ivy-init-settings:
     [echo] Project: shims

ivy-resolve-hadoop-shim:
     [echo] Project: shims
[ivy:resolve] :: loading settings :: file = <https://builds.apache.org/job/Hive-0.9.1-SNAPSHOT-h0.21-keepgoing=false/ws/hive/ivy/ivysettings.xml>
[ivy:resolve] downloading http://repo1.maven.org/maven2/org/apache/hadoop/hadoop-common/0.23.1/hadoop-common-0.23.1.jar
...
[ivy:resolve] ................................................................................................................................................................................................
(1725kB)
[ivy:resolve] .. (0kB)
[ivy:resolve] 	[SUCCESSFUL ] org.apache.hadoop#hadoop-common;0.23.1!hadoop-common.jar (79ms)
[ivy:resolve] downloading http://repo1.maven.org/maven2/org/apache/hadoop/hadoop-mapreduce-client-core/0.23.1/hadoop-mapreduce-client-core-0.23.1.jar
...
[ivy:resolve] ...................................................................................................................................................................................
(1314kB)
[ivy:resolve] .. (0kB)
[ivy:resolve] 	[SUCCESSFUL ] org.apache.hadoop#hadoop-mapreduce-client-core;0.23.1!hadoop-mapreduce-client-core.jar
(43ms)
[ivy:resolve] downloading http://repo1.maven.org/maven2/org/apache/hadoop/hadoop-archives/0.23.1/hadoop-archives-0.23.1.jar
...
[ivy:resolve] .... (20kB)
[ivy:resolve] .. (0kB)
[ivy:resolve] 	[SUCCESSFUL ] org.apache.hadoop#hadoop-archives;0.23.1!hadoop-archives.jar
(31ms)
[ivy:resolve] downloading http://repo1.maven.org/maven2/org/apache/hadoop/hadoop-hdfs/0.23.1/hadoop-hdfs-0.23.1.jar
...
[ivy:resolve] ..................................................................................................................................................................................................................................
(1725kB)
[ivy:resolve] .. (0kB)
[ivy:resolve] 	[SUCCESSFUL ] org.apache.hadoop#hadoop-hdfs;0.23.1!hadoop-hdfs.jar (193ms)
[ivy:resolve] downloading http://repo1.maven.org/maven2/org/apache/hadoop/hadoop-hdfs/0.23.1/hadoop-hdfs-0.23.1-tests.jar
...
[ivy:resolve] .................................................................................................................
(1107kB)
[ivy:resolve] .. (0kB)
[ivy:resolve] 	[SUCCESSFUL ] org.apache.hadoop#hadoop-hdfs;0.23.1!hadoop-hdfs.jar(tests) (49ms)
[ivy:resolve] downloading http://repo1.maven.org/maven2/hsqldb/hsqldb/1.8.0.7/hsqldb-1.8.0.7.jar
...
[ivy:resolve] ...........................................................................................
(628kB)
[ivy:resolve] .. (0kB)
[ivy:resolve] 	[SUCCESSFUL ] hsqldb#hsqldb;1.8.0.7!hsqldb.jar (25ms)
[ivy:resolve] downloading http://repo1.maven.org/maven2/org/apache/avro/avro-ipc/1.5.3/avro-ipc-1.5.3.jar
...
[ivy:resolve] ....................... (164kB)
[ivy:resolve] .. (0kB)
[ivy:resolve] 	[SUCCESSFUL ] org.apache.avro#avro-ipc;1.5.3!avro-ipc.jar (19ms)
[ivy:resolve] downloading http://repo1.maven.org/maven2/org/apache/hadoop/hadoop-auth/0.23.1/hadoop-auth-0.23.1.jar
...
[ivy:resolve] ..... (41kB)
[ivy:resolve] .. (0kB)
[ivy:resolve] 	[SUCCESSFUL ] org.apache.hadoop#hadoop-auth;0.23.1!hadoop-auth.jar (45ms)
[ivy:resolve] downloading http://repo1.maven.org/maven2/org/codehaus/jackson/jackson-core-asl/1.7.1/jackson-core-asl-1.7.1.jar
...
[ivy:resolve] ................................ (202kB)
[ivy:resolve] .. (0kB)
[ivy:resolve] 	[SUCCESSFUL ] org.codehaus.jackson#jackson-core-asl;1.7.1!jackson-core-asl.jar
(21ms)
[ivy:resolve] downloading http://repo1.maven.org/maven2/org/codehaus/jackson/jackson-jaxrs/1.7.1/jackson-jaxrs-1.7.1.jar
...
[ivy:resolve] .. (17kB)
[ivy:resolve] .. (0kB)
[ivy:resolve] 	[SUCCESSFUL ] org.codehaus.jackson#jackson-jaxrs;1.7.1!jackson-jaxrs.jar (97ms)
[ivy:resolve] downloading http://repo1.maven.org/maven2/org/codehaus/jackson/jackson-xc/1.7.1/jackson-xc-1.7.1.jar
...
[ivy:resolve] .... (30kB)
[ivy:resolve] .. (0kB)
[ivy:resolve] 	[SUCCESSFUL ] org.codehaus.jackson#jackson-xc;1.7.1!jackson-xc.jar (12ms)
[ivy:resolve] downloading http://repo1.maven.org/maven2/org/apache/velocity/velocity/1.7/velocity-1.7.jar
...
[ivy:resolve] ....................................................... (438kB)
[ivy:resolve] .. (0kB)
[ivy:resolve] 	[SUCCESSFUL ] org.apache.velocity#velocity;1.7!velocity.jar (23ms)
[ivy:resolve] downloading http://repo1.maven.org/maven2/org/apache/hadoop/hadoop-yarn-common/0.23.1/hadoop-yarn-common-0.23.1.jar
...
[ivy:resolve] .................................................................................................................
(1056kB)
[ivy:resolve] .. (0kB)
[ivy:resolve] 	[SUCCESSFUL ] org.apache.hadoop#hadoop-yarn-common;0.23.1!hadoop-yarn-common.jar
(41ms)
[ivy:resolve] downloading http://repo1.maven.org/maven2/org/apache/hadoop/hadoop-annotations/0.23.1/hadoop-annotations-0.23.1.jar
...
[ivy:resolve] ... (16kB)
[ivy:resolve] .. (0kB)
[ivy:resolve] 	[SUCCESSFUL ] org.apache.hadoop#hadoop-annotations;0.23.1!hadoop-annotations.jar
(19ms)
[ivy:resolve] downloading http://repo1.maven.org/maven2/junit/junit/4.8.2/junit-4.8.2.jar
...
[ivy:resolve] ..................................... (231kB)
[ivy:resolve] .. (0kB)
[ivy:resolve] 	[SUCCESSFUL ] junit#junit;4.8.2!junit.jar (19ms)
[ivy:resolve] downloading http://repo1.maven.org/maven2/com/cenqua/clover/clover/3.0.2/clover-3.0.2.jar
...
[ivy:resolve] ..............................................................................................................................................................................................................................................................................................................................................................................................................................................................................................................................................................................................................................................................................................................................................................................................................................................................................................................................................................................................................................................................................................................................................................................................................................................................................................................................................................................................................................................................................................................................................................................................
(11446kB)
[ivy:resolve] .. (0kB)
[ivy:resolve] 	[SUCCESSFUL ] com.cenqua.clover#clover;3.0.2!clover.jar (382ms)
[ivy:resolve] downloading http://repo1.maven.org/maven2/org/apache/hadoop/hadoop-yarn-api/0.23.1/hadoop-yarn-api-0.23.1.jar
...
[ivy:resolve] ...........................................................................................................................
(870kB)
[ivy:resolve] .. (0kB)
[ivy:resolve] 	[SUCCESSFUL ] org.apache.hadoop#hadoop-yarn-api;0.23.1!hadoop-yarn-api.jar
(30ms)

ivy-retrieve-hadoop-shim:
     [echo] Project: shims

jar:
     [echo] Project: shims
[ivy:publish] :: publishing :: org.apache.hive#hive-shims
[ivy:publish] 	published hive-shims to /home/jenkins/.ivy2/local/org.apache.hive/hive-shims/0.9.1-SNAPSHOT/jars/hive-shims.jar
[ivy:publish] 	published ivy to /home/jenkins/.ivy2/local/org.apache.hive/hive-shims/0.9.1-SNAPSHOT/ivys/ivy.xml

create-dirs:
     [echo] Project: common

init:
     [echo] Project: common

setup:
     [echo] Project: common

ivy-init-settings:
     [echo] Project: common

ivy-resolve:
     [echo] Project: common
[ivy:resolve] :: loading settings :: file = <https://builds.apache.org/job/Hive-0.9.1-SNAPSHOT-h0.21-keepgoing=false/ws/hive/ivy/ivysettings.xml>
[ivy:resolve] downloading /home/jenkins/.ivy2/local/org.apache.hive/hive-shims/0.9.1-SNAPSHOT/jars/hive-shims.jar
...
[ivy:resolve] ... (111kB)
[ivy:resolve] .. (0kB)
[ivy:resolve] 	[SUCCESSFUL ] org.apache.hive#hive-shims;0.9.1-SNAPSHOT!hive-shims.jar (2ms)
[ivy:report] Processing <https://builds.apache.org/job/Hive-0.9.1-SNAPSHOT-h0.21-keepgoing=false/135/artifact/hive/build/ivy/resolution-cache/org.apache.hive-hive-common-default.xml>
to <https://builds.apache.org/job/Hive-0.9.1-SNAPSHOT-h0.21-keepgoing=false/135/artifact/hive/build/ivy/report/org.apache.hive-hive-common-default.html>

ivy-retrieve:
     [echo] Project: common

compile:
     [echo] Project: common

jar:
     [echo] Project: common
[ivy:publish] :: publishing :: org.apache.hive#hive-common
[ivy:publish] 	published hive-common to /home/jenkins/.ivy2/local/org.apache.hive/hive-common/0.9.1-SNAPSHOT/jars/hive-common.jar
[ivy:publish] 	published ivy to /home/jenkins/.ivy2/local/org.apache.hive/hive-common/0.9.1-SNAPSHOT/ivys/ivy.xml

create-dirs:
     [echo] Project: serde
     [copy] Warning: <https://builds.apache.org/job/Hive-0.9.1-SNAPSHOT-h0.21-keepgoing=false/ws/hive/serde/src/test/resources>
does not exist.

init:
     [echo] Project: serde

ivy-init-settings:
     [echo] Project: serde

ivy-resolve:
     [echo] Project: serde
[ivy:resolve] :: loading settings :: file = <https://builds.apache.org/job/Hive-0.9.1-SNAPSHOT-h0.21-keepgoing=false/ws/hive/ivy/ivysettings.xml>
[ivy:resolve] downloading /home/jenkins/.ivy2/local/org.apache.hive/hive-common/0.9.1-SNAPSHOT/jars/hive-common.jar
...
[ivy:resolve] .. (57kB)
[ivy:resolve] .. (0kB)
[ivy:resolve] 	[SUCCESSFUL ] org.apache.hive#hive-common;0.9.1-SNAPSHOT!hive-common.jar (22ms)
[ivy:report] Processing <https://builds.apache.org/job/Hive-0.9.1-SNAPSHOT-h0.21-keepgoing=false/135/artifact/hive/build/ivy/resolution-cache/org.apache.hive-hive-serde-default.xml>
to <https://builds.apache.org/job/Hive-0.9.1-SNAPSHOT-h0.21-keepgoing=false/135/artifact/hive/build/ivy/report/org.apache.hive-hive-serde-default.html>

ivy-retrieve:
     [echo] Project: serde

dynamic-serde:

compile:
     [echo] Project: serde

jar:
     [echo] Project: serde
[ivy:publish] :: publishing :: org.apache.hive#hive-serde
[ivy:publish] 	published hive-serde to /home/jenkins/.ivy2/local/org.apache.hive/hive-serde/0.9.1-SNAPSHOT/jars/hive-serde.jar
[ivy:publish] 	published ivy to /home/jenkins/.ivy2/local/org.apache.hive/hive-serde/0.9.1-SNAPSHOT/ivys/ivy.xml

create-dirs:
     [echo] Project: metastore
     [copy] Warning: <https://builds.apache.org/job/Hive-0.9.1-SNAPSHOT-h0.21-keepgoing=false/ws/hive/metastore/src/test/resources>
does not exist.

init:
     [echo] Project: metastore

metastore-init:
     [echo] Project: metastore

ivy-init-settings:
     [echo] Project: metastore

ivy-resolve:
     [echo] Project: metastore
[ivy:resolve] :: loading settings :: file = <https://builds.apache.org/job/Hive-0.9.1-SNAPSHOT-h0.21-keepgoing=false/ws/hive/ivy/ivysettings.xml>
[ivy:resolve] downloading /home/jenkins/.ivy2/local/org.apache.hive/hive-serde/0.9.1-SNAPSHOT/jars/hive-serde.jar
...
[ivy:resolve] ......... (507kB)
[ivy:resolve] .. (0kB)
[ivy:resolve] 	[SUCCESSFUL ] org.apache.hive#hive-serde;0.9.1-SNAPSHOT!hive-serde.jar (8ms)
[ivy:resolve] downloading http://www.datanucleus.org/downloads/maven2/javax/jdo/jdo2-api/2.3-ec/jdo2-api-2.3-ec.jar
...
[ivy:resolve] .............. (193kB)
[ivy:resolve] downloading http://repo1.maven.org/maven2/org/apache/derby/derby/10.4.2.0/derby-10.4.2.0.jar
...
[ivy:resolve] ................................................................................................................................................................................................................................................................................................................................................
(2389kB)
[ivy:resolve] downloading http://repo1.maven.org/maven2/asm/asm/3.1/asm-3.1.jar ...
[ivy:resolve] ...... (42kB)
[ivy:resolve] .. (0kB)
[ivy:resolve] 	[SUCCESSFUL ] asm#asm;3.1!asm.jar (19ms)
[ivy:resolve] downloading http://repo1.maven.org/maven2/org/antlr/stringtemplate/3.1-b1/stringtemplate-3.1-b1.jar
...
[ivy:resolve] ............................ (224kB)
[ivy:resolve] .. (0kB)
[ivy:resolve] 	[SUCCESSFUL ] org.antlr#stringtemplate;3.1-b1!stringtemplate.jar (20ms)
[ivy:resolve] downloading http://repo1.maven.org/maven2/antlr/antlr/2.7.7/antlr-2.7.7.jar
...
[ivy:resolve] ................................................................. (434kB)
[ivy:resolve] .. (0kB)
[ivy:resolve] 	[SUCCESSFUL ] antlr#antlr;2.7.7!antlr.jar (26ms)
[ivy:resolve] 
[ivy:resolve] :: problems summary ::
[ivy:resolve] :::: WARNINGS
[ivy:resolve] 		[FAILED     ] javax.jdo#jdo2-api;2.3-ec!jdo2-api.jar: Downloaded file size
doesn't match expected Content Length for http://www.datanucleus.org/downloads/maven2/javax/jdo/jdo2-api/2.3-ec/jdo2-api-2.3-ec.jar.
Please retry. (1556ms)
[ivy:resolve] 		[FAILED     ] javax.jdo#jdo2-api;2.3-ec!jdo2-api.jar:  (0ms)
[ivy:resolve] 	==== local: tried
[ivy:resolve] 	  /home/jenkins/.ivy2/local/javax.jdo/jdo2-api/2.3-ec/jars/jdo2-api.jar
[ivy:resolve] 	==== apache-snapshot: tried
[ivy:resolve] 	  https://repository.apache.org/content/repositories/snapshots/javax/jdo/jdo2-api/2.3-ec/jdo2-api-2.3-ec.jar
[ivy:resolve] 	==== maven2: tried
[ivy:resolve] 	  http://repo1.maven.org/maven2/javax/jdo/jdo2-api/2.3-ec/jdo2-api-2.3-ec.jar
[ivy:resolve] 	==== datanucleus-repo: tried
[ivy:resolve] 	  http://www.datanucleus.org/downloads/maven2/javax/jdo/jdo2-api/2.3-ec/jdo2-api-2.3-ec.jar
[ivy:resolve] 	==== hadoop-source: tried
[ivy:resolve] 	  http://mirror.facebook.net/facebook/hive-deps/hadoop/core/jdo2-api-2.3-ec/jdo2-api-2.3-ec.jar
[ivy:resolve] 	==== hadoop-source2: tried
[ivy:resolve] 	  http://archive.cloudera.com/hive-deps/hadoop/core/jdo2-api-2.3-ec/jdo2-api-2.3-ec.jar
[ivy:resolve] 		[FAILED     ] org.apache.derby#derby;10.4.2.0!derby.jar: Downloaded file size
doesn't match expected Content Length for http://repo1.maven.org/maven2/org/apache/derby/derby/10.4.2.0/derby-10.4.2.0.jar.
Please retry. (39ms)
[ivy:resolve] 		[FAILED     ] org.apache.derby#derby;10.4.2.0!derby.jar:  (0ms)
[ivy:resolve] 	==== local: tried
[ivy:resolve] 	  /home/jenkins/.ivy2/local/org.apache.derby/derby/10.4.2.0/jars/derby.jar
[ivy:resolve] 	==== apache-snapshot: tried
[ivy:resolve] 	  https://repository.apache.org/content/repositories/snapshots/org/apache/derby/derby/10.4.2.0/derby-10.4.2.0.jar
[ivy:resolve] 	==== maven2: tried
[ivy:resolve] 	  http://repo1.maven.org/maven2/org/apache/derby/derby/10.4.2.0/derby-10.4.2.0.jar
[ivy:resolve] 	==== datanucleus-repo: tried
[ivy:resolve] 	  http://www.datanucleus.org/downloads/maven2/org/apache/derby/derby/10.4.2.0/derby-10.4.2.0.jar
[ivy:resolve] 	==== hadoop-source: tried
[ivy:resolve] 	  http://mirror.facebook.net/facebook/hive-deps/hadoop/core/derby-10.4.2.0/derby-10.4.2.0.jar
[ivy:resolve] 	==== hadoop-source2: tried
[ivy:resolve] 	  http://archive.cloudera.com/hive-deps/hadoop/core/derby-10.4.2.0/derby-10.4.2.0.jar
[ivy:resolve] 		::::::::::::::::::::::::::::::::::::::::::::::
[ivy:resolve] 		::              FAILED DOWNLOADS            ::
[ivy:resolve] 		:: ^ see resolution messages for details  ^ ::
[ivy:resolve] 		::::::::::::::::::::::::::::::::::::::::::::::
[ivy:resolve] 		:: javax.jdo#jdo2-api;2.3-ec!jdo2-api.jar
[ivy:resolve] 		:: org.apache.derby#derby;10.4.2.0!derby.jar
[ivy:resolve] 		::::::::::::::::::::::::::::::::::::::::::::::
[ivy:resolve] 
[ivy:resolve] :: USE VERBOSE OR DEBUG MESSAGE LEVEL FOR MORE DETAILS

BUILD FAILED
<https://builds.apache.org/job/Hive-0.9.1-SNAPSHOT-h0.21-keepgoing=false/ws/hive/build.xml>:302:
The following error occurred while executing this line:
<https://builds.apache.org/job/Hive-0.9.1-SNAPSHOT-h0.21-keepgoing=false/ws/hive/build.xml>:152:
The following error occurred while executing this line:
<https://builds.apache.org/job/Hive-0.9.1-SNAPSHOT-h0.21-keepgoing=false/ws/hive/build-common.xml>:125:
impossible to resolve dependencies:
	resolve failed - see output for details

Total time: 7 minutes 0 seconds
Build step 'Invoke Ant' marked build as failure
Archiving artifacts
Recording test results

Mime
View raw message