hive-dev mailing list archives

Site index · List index
Message view « Date » · « Thread »
Top « Date » · « Thread »
From Apache Jenkins Server <jenk...@builds.apache.org>
Subject Build failed in Jenkins: Hive-0.9.1-SNAPSHOT-h0.21-keepgoing=false #141
Date Mon, 17 Sep 2012 16:03:16 GMT
See <https://builds.apache.org/job/Hive-0.9.1-SNAPSHOT-h0.21-keepgoing=false/141/>

------------------------------------------
[...truncated 5494 lines...]

init:
     [echo] Project: shims

ivy-init-settings:
     [echo] Project: shims

ivy-resolve:
     [echo] Project: shims
[ivy:resolve] :: loading settings :: file = <https://builds.apache.org/job/Hive-0.9.1-SNAPSHOT-h0.21-keepgoing=false/ws/hive/ivy/ivysettings.xml>
[ivy:resolve] downloading http://repo1.maven.org/maven2/org/apache/zookeeper/zookeeper/3.4.3/zookeeper-3.4.3.jar
...
[ivy:resolve] ...............................................................................
(749kB)
[ivy:resolve] .. (0kB)
[ivy:resolve] 	[SUCCESSFUL ] org.apache.zookeeper#zookeeper;3.4.3!zookeeper.jar (129ms)
[ivy:resolve] downloading http://repo1.maven.org/maven2/org/apache/thrift/libthrift/0.7.0/libthrift-0.7.0.jar
...
[ivy:resolve] .................................... (294kB)
[ivy:resolve] .. (0kB)
[ivy:resolve] 	[SUCCESSFUL ] org.apache.thrift#libthrift;0.7.0!libthrift.jar (563ms)
[ivy:resolve] downloading http://repo1.maven.org/maven2/commons-logging/commons-logging/1.0.4/commons-logging-1.0.4.jar
...
[ivy:resolve] .... (37kB)
[ivy:resolve] .. (0kB)
[ivy:resolve] 	[SUCCESSFUL ] commons-logging#commons-logging;1.0.4!commons-logging.jar (18ms)
[ivy:resolve] downloading http://repo1.maven.org/maven2/commons-logging/commons-logging-api/1.0.4/commons-logging-api-1.0.4.jar
...
[ivy:resolve] .... (25kB)
[ivy:resolve] .. (0kB)
[ivy:resolve] 	[SUCCESSFUL ] commons-logging#commons-logging-api;1.0.4!commons-logging-api.jar
(13ms)
[ivy:resolve] downloading http://repo1.maven.org/maven2/com/google/guava/guava/r09/guava-r09.jar
...
[ivy:resolve] ..........................................................................................................................................
(1117kB)
[ivy:resolve] .. (0kB)
[ivy:resolve] 	[SUCCESSFUL ] com.google.guava#guava;r09!guava.jar (45ms)
[ivy:resolve] downloading http://repo1.maven.org/maven2/org/codehaus/jackson/jackson-core-asl/1.8.8/jackson-core-asl-1.8.8.jar
...
[ivy:resolve] ............................. (222kB)
[ivy:resolve] .. (0kB)
[ivy:resolve] 	[SUCCESSFUL ] org.codehaus.jackson#jackson-core-asl;1.8.8!jackson-core-asl.jar
(494ms)
[ivy:resolve] downloading http://repo1.maven.org/maven2/org/codehaus/jackson/jackson-mapper-asl/1.8.8/jackson-mapper-asl-1.8.8.jar
...
[ivy:resolve] ................................................................................
(652kB)
[ivy:resolve] .. (0kB)
[ivy:resolve] 	[SUCCESSFUL ] org.codehaus.jackson#jackson-mapper-asl;1.8.8!jackson-mapper-asl.jar
(1099ms)
[ivy:report] Processing <https://builds.apache.org/job/Hive-0.9.1-SNAPSHOT-h0.21-keepgoing=false/141/artifact/hive/build/ivy/resolution-cache/org.apache.hive-hive-shims-default.xml>
to <https://builds.apache.org/job/Hive-0.9.1-SNAPSHOT-h0.21-keepgoing=false/141/artifact/hive/build/ivy/report/org.apache.hive-hive-shims-default.html>

ivy-retrieve:
     [echo] Project: shims

compile:
     [echo] Project: shims
     [echo] Building shims 0.20

build_shims:
     [echo] Project: shims
     [echo] Compiling <https://builds.apache.org/job/Hive-0.9.1-SNAPSHOT-h0.21-keepgoing=false/ws/hive/shims/src/common/java;/home/jenkins/jenkins-slave/workspace/Hive-0.9.1-SNAPSHOT-h0.21-keepgoing=false/hive/shims/src/0.20/java>
against hadoop 0.20.2 (<https://builds.apache.org/job/Hive-0.9.1-SNAPSHOT-h0.21-keepgoing=false/141/artifact/hive/build/hadoopcore/hadoop-0.20.2)>

ivy-init-settings:
     [echo] Project: shims

ivy-resolve-hadoop-shim:
     [echo] Project: shims
[ivy:resolve] :: loading settings :: file = <https://builds.apache.org/job/Hive-0.9.1-SNAPSHOT-h0.21-keepgoing=false/ws/hive/ivy/ivysettings.xml>
[ivy:resolve] downloading http://repo1.maven.org/maven2/org/apache/hadoop/hadoop-core/0.20.2/hadoop-core-0.20.2.jar
...
[ivy:resolve] .....................................................................................................................................
(2624kB)
[ivy:resolve] .. (0kB)
[ivy:resolve] downloading http://repo1.maven.org/maven2/org/apache/hadoop/hadoop-tools/0.20.2/hadoop-tools-0.20.2.jar
...
[ivy:resolve] ....... (68kB)
[ivy:resolve] .. (0kB)
[ivy:resolve] 	[SUCCESSFUL ] org.apache.hadoop#hadoop-tools;0.20.2!hadoop-tools.jar (75ms)
[ivy:resolve] downloading http://repo1.maven.org/maven2/org/apache/hadoop/hadoop-test/0.20.2/hadoop-test-0.20.2.jar
...
[ivy:resolve] ..............................................................................................................................................................................................
(1527kB)
[ivy:resolve] .. (0kB)
[ivy:resolve] downloading http://repo1.maven.org/maven2/commons-cli/commons-cli/1.2/commons-cli-1.2.jar
...
[ivy:resolve] .... (40kB)
[ivy:resolve] .. (0kB)
[ivy:resolve] downloading http://repo1.maven.org/maven2/xmlenc/xmlenc/0.52/xmlenc-0.52.jar
...
[ivy:resolve] .. (14kB)
[ivy:resolve] .. (0kB)
[ivy:resolve] 	[SUCCESSFUL ] xmlenc#xmlenc;0.52!xmlenc.jar (108ms)
[ivy:resolve] downloading http://repo1.maven.org/maven2/commons-httpclient/commons-httpclient/3.0.1/commons-httpclient-3.0.1.jar
...
[ivy:resolve] ................................. (273kB)
[ivy:resolve] .. (0kB)
[ivy:resolve] downloading http://repo1.maven.org/maven2/commons-codec/commons-codec/1.3/commons-codec-1.3.jar
...
[ivy:resolve] .... (45kB)
[ivy:resolve] .. (0kB)
[ivy:resolve] 	[SUCCESSFUL ] commons-codec#commons-codec;1.3!commons-codec.jar (14ms)
[ivy:resolve] downloading http://repo1.maven.org/maven2/commons-net/commons-net/1.4.1/commons-net-1.4.1.jar
...
[ivy:resolve] ........................... (176kB)
[ivy:resolve] .. (0kB)
[ivy:resolve] 	[SUCCESSFUL ] commons-net#commons-net;1.4.1!commons-net.jar (68ms)
[ivy:resolve] downloading http://repo1.maven.org/maven2/org/mortbay/jetty/jetty/6.1.14/jetty-6.1.14.jar
...
[ivy:resolve] ...............................................................................
(504kB)
[ivy:resolve] .. (0kB)
[ivy:resolve] 	[SUCCESSFUL ] org.mortbay.jetty#jetty;6.1.14!jetty.jar (93ms)
[ivy:resolve] downloading http://repo1.maven.org/maven2/org/mortbay/jetty/jetty-util/6.1.14/jetty-util-6.1.14.jar
...
[ivy:resolve] ........................ (159kB)
[ivy:resolve] .. (0kB)
[ivy:resolve] 	[SUCCESSFUL ] org.mortbay.jetty#jetty-util;6.1.14!jetty-util.jar (78ms)
[ivy:resolve] downloading http://repo1.maven.org/maven2/tomcat/jasper-runtime/5.5.12/jasper-runtime-5.5.12.jar
...
[ivy:resolve] .......... (74kB)
[ivy:resolve] .. (0kB)
[ivy:resolve] 	[SUCCESSFUL ] tomcat#jasper-runtime;5.5.12!jasper-runtime.jar (68ms)
[ivy:resolve] downloading http://repo1.maven.org/maven2/tomcat/jasper-compiler/5.5.12/jasper-compiler-5.5.12.jar
...
[ivy:resolve] ............................................ (395kB)
[ivy:resolve] .. (0kB)
[ivy:resolve] 	[SUCCESSFUL ] tomcat#jasper-compiler;5.5.12!jasper-compiler.jar (135ms)
[ivy:resolve] downloading http://repo1.maven.org/maven2/org/mortbay/jetty/jsp-api-2.1/6.1.14/jsp-api-2.1-6.1.14.jar
...
[ivy:resolve] ......... (131kB)
[ivy:resolve] .. (0kB)
[ivy:resolve] 	[SUCCESSFUL ] org.mortbay.jetty#jsp-api-2.1;6.1.14!jsp-api-2.1.jar (340ms)
[ivy:resolve] downloading http://repo1.maven.org/maven2/org/mortbay/jetty/jsp-2.1/6.1.14/jsp-2.1-6.1.14.jar
...
[ivy:resolve] ...................................................................................................................................................
(1000kB)
[ivy:resolve] .. (0kB)
[ivy:resolve] downloading http://repo1.maven.org/maven2/commons-el/commons-el/1.0/commons-el-1.0.jar
...
[ivy:resolve] ....... (109kB)
[ivy:resolve] .. (0kB)
[ivy:resolve] 	[SUCCESSFUL ] commons-el#commons-el;1.0!commons-el.jar (15ms)
[ivy:resolve] downloading http://repo1.maven.org/maven2/net/java/dev/jets3t/jets3t/0.7.1/jets3t-0.7.1.jar
...
[ivy:resolve] ..................................................... (368kB)
[ivy:resolve] .. (0kB)
[ivy:resolve] downloading http://repo1.maven.org/maven2/org/mortbay/jetty/servlet-api-2.5/6.1.14/servlet-api-2.5-6.1.14.jar
...
[ivy:resolve] ................. (129kB)
[ivy:resolve] .. (0kB)
[ivy:resolve] 	[SUCCESSFUL ] org.mortbay.jetty#servlet-api-2.5;6.1.14!servlet-api-2.5.jar
(83ms)
[ivy:resolve] downloading http://repo1.maven.org/maven2/net/sf/kosmosfs/kfs/0.3/kfs-0.3.jar
...
[ivy:resolve] .. (11kB)
[ivy:resolve] downloading http://repo1.maven.org/maven2/junit/junit/4.5/junit-4.5.jar ...
[ivy:resolve] .......................... (194kB)
[ivy:resolve] .. (0kB)
[ivy:resolve] 	[SUCCESSFUL ] junit#junit;4.5!junit.jar (63ms)
[ivy:resolve] downloading http://repo1.maven.org/maven2/hsqldb/hsqldb/1.8.0.10/hsqldb-1.8.0.10.jar
...
[ivy:resolve] .......................................................................... (690kB)
[ivy:resolve] .. (0kB)
[ivy:resolve] 	[SUCCESSFUL ] hsqldb#hsqldb;1.8.0.10!hsqldb.jar (110ms)
[ivy:resolve] downloading http://repo1.maven.org/maven2/oro/oro/2.0.8/oro-2.0.8.jar ...
[ivy:resolve] ...... (63kB)
[ivy:resolve] .. (0kB)
[ivy:resolve] 	[SUCCESSFUL ] oro#oro;2.0.8!oro.jar (43ms)
[ivy:resolve] downloading http://repo1.maven.org/maven2/org/eclipse/jdt/core/3.1.1/core-3.1.1.jar
...
[ivy:resolve] .............................................................................................................................................................................................................................................................................................................................................................................................................................................................................................................................
(3483kB)
[ivy:resolve] .. (0kB)
[ivy:resolve] 	[SUCCESSFUL ] org.eclipse.jdt#core;3.1.1!core.jar (87ms)
[ivy:resolve] downloading http://repo1.maven.org/maven2/ant/ant/1.6.5/ant-1.6.5.jar ...
[ivy:resolve] ............................................................................................................................................
(1009kB)
[ivy:resolve] .. (0kB)
[ivy:resolve] 	[SUCCESSFUL ] ant#ant;1.6.5!ant.jar (39ms)
[ivy:resolve] downloading http://repo1.maven.org/maven2/commons-logging/commons-logging/1.1.1/commons-logging-1.1.1.jar
...
[ivy:resolve] ........ (59kB)
[ivy:resolve] .. (0kB)
[ivy:resolve] 	[SUCCESSFUL ] commons-logging#commons-logging;1.1.1!commons-logging.jar (17ms)
[ivy:resolve] downloading http://repo1.maven.org/maven2/org/apache/mina/mina-core/2.0.0-M5/mina-core-2.0.0-M5.jar
...
[ivy:resolve] .......................................................................................
(622kB)
[ivy:resolve] .. (0kB)
[ivy:resolve] 	[SUCCESSFUL ] org.apache.mina#mina-core;2.0.0-M5!mina-core.jar(bundle) (103ms)
[ivy:resolve] downloading http://repo1.maven.org/maven2/org/apache/ftpserver/ftpserver-core/1.0.0/ftpserver-core-1.0.0.jar
...
[ivy:resolve] ............................... (264kB)
[ivy:resolve] .. (0kB)
[ivy:resolve] 	[SUCCESSFUL ] org.apache.ftpserver#ftpserver-core;1.0.0!ftpserver-core.jar(bundle)
(133ms)
[ivy:resolve] downloading http://repo1.maven.org/maven2/org/apache/ftpserver/ftpserver-deprecated/1.0.0-M2/ftpserver-deprecated-1.0.0-M2.jar
...
[ivy:resolve] ... (31kB)
[ivy:resolve] .. (0kB)
[ivy:resolve] 	[SUCCESSFUL ] org.apache.ftpserver#ftpserver-deprecated;1.0.0-M2!ftpserver-deprecated.jar
(94ms)
[ivy:resolve] downloading http://repo1.maven.org/maven2/org/slf4j/slf4j-api/1.5.2/slf4j-api-1.5.2.jar
...
[ivy:resolve] ...... (16kB)
[ivy:resolve] .. (0kB)
[ivy:resolve] 	[SUCCESSFUL ] org.slf4j#slf4j-api;1.5.2!slf4j-api.jar (360ms)
[ivy:resolve] 
[ivy:resolve] :: problems summary ::
[ivy:resolve] :::: WARNINGS
[ivy:resolve] 	impossible to put metadata file in cache: http://repo1.maven.org/maven2/org/apache/commons/commons-parent/11/commons-parent-11.pom
(11). java.io.FileNotFoundException: /home/jenkins/.ivy2/cache/org.apache.commons/commons-parent/ivy-11.xml.original
(No such file or directory)
[ivy:resolve] 	impossible to put metadata file in cache: http://repo1.maven.org/maven2/commons-cli/commons-cli/1.2/commons-cli-1.2.pom
(1.2). java.io.FileNotFoundException: /home/jenkins/.ivy2/cache/commons-cli/commons-cli/ivy-1.2.xml.original
(No such file or directory)
[ivy:resolve] 	problem while downloading module descriptor: http://repo1.maven.org/maven2/org/apache/ftpserver/ftpserver-parent/1.0.0/ftpserver-parent-1.0.0.pom:
/home/jenkins/.ivy2/cache/org.apache.ftpserver/ftpserver-parent/ivy-1.0.0.xml.original.part
(No such file or directory) (131ms)
[ivy:resolve] 	io problem while parsing ivy file: http://repo1.maven.org/maven2/org/apache/ftpserver/ftplet-api/1.0.0/ftplet-api-1.0.0.pom:
Impossible to load parent for file:/home/jenkins/.ivy2/cache/org.apache.ftpserver/ftplet-api/ivy-1.0.0.xml.original.
Parent=org.apache.ftpserver#ftpserver-parent;1.0.0
[ivy:resolve] 		module not found: org.apache.ftpserver#ftplet-api;1.0.0
[ivy:resolve] 	==== local: tried
[ivy:resolve] 	  /home/jenkins/.ivy2/local/org.apache.ftpserver/ftpserver-parent/1.0.0/ivys/ivy.xml
[ivy:resolve] 	  -- artifact org.apache.ftpserver#ftpserver-parent;1.0.0!ftpserver-parent.jar:
[ivy:resolve] 	  /home/jenkins/.ivy2/local/org.apache.ftpserver/ftpserver-parent/1.0.0/jars/ftpserver-parent.jar
[ivy:resolve] 	==== apache-snapshot: tried
[ivy:resolve] 	  https://repository.apache.org/content/repositories/snapshots/org/apache/ftpserver/ftpserver-parent/1.0.0/ftpserver-parent-1.0.0.pom
[ivy:resolve] 	  -- artifact org.apache.ftpserver#ftpserver-parent;1.0.0!ftpserver-parent.jar:
[ivy:resolve] 	  https://repository.apache.org/content/repositories/snapshots/org/apache/ftpserver/ftpserver-parent/1.0.0/ftpserver-parent-1.0.0.jar
[ivy:resolve] 	==== maven2: tried
[ivy:resolve] 	  http://repo1.maven.org/maven2/org/apache/ftpserver/ftpserver-parent/1.0.0/ftpserver-parent-1.0.0.pom
[ivy:resolve] 	==== datanucleus-repo: tried
[ivy:resolve] 	  -- artifact org.apache.ftpserver#ftplet-api;1.0.0!ftplet-api.jar:
[ivy:resolve] 	  http://www.datanucleus.org/downloads/maven2/org/apache/ftpserver/ftplet-api/1.0.0/ftplet-api-1.0.0.jar
[ivy:resolve] 	==== hadoop-source: tried
[ivy:resolve] 	  -- artifact org.apache.ftpserver#ftplet-api;1.0.0!ftplet-api.jar:
[ivy:resolve] 	  http://mirror.facebook.net/facebook/hive-deps/hadoop/core/ftplet-api-1.0.0/ftplet-api-1.0.0.jar
[ivy:resolve] 	==== hadoop-source2: tried
[ivy:resolve] 	  -- artifact org.apache.ftpserver#ftplet-api;1.0.0!ftplet-api.jar:
[ivy:resolve] 	  http://archive.cloudera.com/hive-deps/hadoop/core/ftplet-api-1.0.0/ftplet-api-1.0.0.jar
[ivy:resolve] 		[FAILED     ] org.apache.hadoop#hadoop-core;0.20.2!hadoop-core.jar: /home/jenkins/.ivy2/cache/org.apache.hadoop/hadoop-core/jars/hadoop-core-0.20.2.jar.part
(No such file or directory) (116ms)
[ivy:resolve] 		[FAILED     ] org.apache.hadoop#hadoop-test;0.20.2!hadoop-test.jar: /home/jenkins/.ivy2/cache/org.apache.hadoop/hadoop-test/jars/hadoop-test-0.20.2.jar.part
(No such file or directory) (36ms)
[ivy:resolve] 		[FAILED     ] commons-cli#commons-cli;1.2!commons-cli.jar: impossible to move
part file to definitive one: /home/jenkins/.ivy2/cache/commons-cli/commons-cli/jars/commons-cli-1.2.jar.part
-> /home/jenkins/.ivy2/cache/commons-cli/commons-cli/jars/commons-cli-1.2.jar (12ms)
[ivy:resolve] 		[FAILED     ] commons-httpclient#commons-httpclient;3.0.1!commons-httpclient.jar:
invalid sha1: expected=d6364bcc1b2b2aa69d008602d36a700453648560 computed=0c8e96ddcb2e927fff37a977d2e648ee22071ab9
(44ms)
[ivy:resolve] 		[FAILED     ] commons-httpclient#commons-httpclient;3.0.1!commons-httpclient.jar:
 (0ms)
[ivy:resolve] 	==== local: tried
[ivy:resolve] 	  /home/jenkins/.ivy2/local/commons-httpclient/commons-httpclient/3.0.1/jars/commons-httpclient.jar
[ivy:resolve] 	==== apache-snapshot: tried
[ivy:resolve] 	  https://repository.apache.org/content/repositories/snapshots/commons-httpclient/commons-httpclient/3.0.1/commons-httpclient-3.0.1.jar
[ivy:resolve] 	==== maven2: tried
[ivy:resolve] 	  http://repo1.maven.org/maven2/commons-httpclient/commons-httpclient/3.0.1/commons-httpclient-3.0.1.jar
[ivy:resolve] 	==== datanucleus-repo: tried
[ivy:resolve] 	  http://www.datanucleus.org/downloads/maven2/commons-httpclient/commons-httpclient/3.0.1/commons-httpclient-3.0.1.jar
[ivy:resolve] 	==== hadoop-source: tried
[ivy:resolve] 	  http://mirror.facebook.net/facebook/hive-deps/hadoop/core/commons-httpclient-3.0.1/commons-httpclient-3.0.1.jar
[ivy:resolve] 	==== hadoop-source2: tried
[ivy:resolve] 	  http://archive.cloudera.com/hive-deps/hadoop/core/commons-httpclient-3.0.1/commons-httpclient-3.0.1.jar
[ivy:resolve] 		[FAILED     ] org.mortbay.jetty#jsp-2.1;6.1.14!jsp-2.1.jar: impossible to
move part file to definitive one: /home/jenkins/.ivy2/cache/org.mortbay.jetty/jsp-2.1/jars/jsp-2.1-6.1.14.jar.part
-> /home/jenkins/.ivy2/cache/org.mortbay.jetty/jsp-2.1/jars/jsp-2.1-6.1.14.jar (162ms)
[ivy:resolve] 		[FAILED     ] net.java.dev.jets3t#jets3t;0.7.1!jets3t.jar: impossible to move
part file to definitive one: /home/jenkins/.ivy2/cache/net.java.dev.jets3t/jets3t/jars/jets3t-0.7.1.jar.part
-> /home/jenkins/.ivy2/cache/net.java.dev.jets3t/jets3t/jars/jets3t-0.7.1.jar (78ms)
[ivy:resolve] 		[FAILED     ] net.sf.kosmosfs#kfs;0.3!kfs.jar: Downloaded file size doesn't
match expected Content Length for http://repo1.maven.org/maven2/net/sf/kosmosfs/kfs/0.3/kfs-0.3.jar.
Please retry. (31ms)
[ivy:resolve] 		[FAILED     ] net.sf.kosmosfs#kfs;0.3!kfs.jar:  (0ms)
[ivy:resolve] 	==== local: tried
[ivy:resolve] 	  /home/jenkins/.ivy2/local/net.sf.kosmosfs/kfs/0.3/jars/kfs.jar
[ivy:resolve] 	==== apache-snapshot: tried
[ivy:resolve] 	  https://repository.apache.org/content/repositories/snapshots/net/sf/kosmosfs/kfs/0.3/kfs-0.3.jar
[ivy:resolve] 	==== maven2: tried
[ivy:resolve] 	  http://repo1.maven.org/maven2/net/sf/kosmosfs/kfs/0.3/kfs-0.3.jar
[ivy:resolve] 	==== datanucleus-repo: tried
[ivy:resolve] 	  http://www.datanucleus.org/downloads/maven2/net/sf/kosmosfs/kfs/0.3/kfs-0.3.jar
[ivy:resolve] 	==== hadoop-source: tried
[ivy:resolve] 	  http://mirror.facebook.net/facebook/hive-deps/hadoop/core/kfs-0.3/kfs-0.3.jar
[ivy:resolve] 	==== hadoop-source2: tried
[ivy:resolve] 	  http://archive.cloudera.com/hive-deps/hadoop/core/kfs-0.3/kfs-0.3.jar
[ivy:resolve] 		::::::::::::::::::::::::::::::::::::::::::::::
[ivy:resolve] 		::          UNRESOLVED DEPENDENCIES         ::
[ivy:resolve] 		::::::::::::::::::::::::::::::::::::::::::::::
[ivy:resolve] 		:: org.apache.ftpserver#ftplet-api;1.0.0: not found
[ivy:resolve] 		::::::::::::::::::::::::::::::::::::::::::::::
[ivy:resolve] 		::::::::::::::::::::::::::::::::::::::::::::::
[ivy:resolve] 		::              FAILED DOWNLOADS            ::
[ivy:resolve] 		:: ^ see resolution messages for details  ^ ::
[ivy:resolve] 		::::::::::::::::::::::::::::::::::::::::::::::
[ivy:resolve] 		:: commons-httpclient#commons-httpclient;3.0.1!commons-httpclient.jar
[ivy:resolve] 		:: net.sf.kosmosfs#kfs;0.3!kfs.jar
[ivy:resolve] 		::::::::::::::::::::::::::::::::::::::::::::::
[ivy:resolve] 
[ivy:resolve] :: USE VERBOSE OR DEBUG MESSAGE LEVEL FOR MORE DETAILS

BUILD FAILED
<https://builds.apache.org/job/Hive-0.9.1-SNAPSHOT-h0.21-keepgoing=false/ws/hive/build.xml>:302:
The following error occurred while executing this line:
<https://builds.apache.org/job/Hive-0.9.1-SNAPSHOT-h0.21-keepgoing=false/ws/hive/build.xml>:152:
The following error occurred while executing this line:
<https://builds.apache.org/job/Hive-0.9.1-SNAPSHOT-h0.21-keepgoing=false/ws/hive/shims/build.xml>:85:
The following error occurred while executing this line:
<https://builds.apache.org/job/Hive-0.9.1-SNAPSHOT-h0.21-keepgoing=false/ws/hive/shims/build.xml>:88:
The following error occurred while executing this line:
<https://builds.apache.org/job/Hive-0.9.1-SNAPSHOT-h0.21-keepgoing=false/ws/hive/shims/build.xml>:60:
The following error occurred while executing this line:
<https://builds.apache.org/job/Hive-0.9.1-SNAPSHOT-h0.21-keepgoing=false/ws/hive/build-common.xml>:164:
impossible to resolve dependencies:
	resolve failed - see output for details

Total time: 1 minute 23 seconds
Build step 'Invoke Ant' marked build as failure
Archiving artifacts
Recording test results

Mime
View raw message