hive-dev mailing list archives

Site index · List index
Message view « Date » · « Thread »
Top « Date » · « Thread »
From Apache Jenkins Server <jenk...@builds.apache.org>
Subject Hive-trunk-h0.21 - Build # 1600 - Still Failing
Date Fri, 10 Aug 2012 14:06:18 GMT
Changes for Build #1598
[cws] HIVE-2789. query_properties.q contains non-deterministic queries (Zhenxiao Luo via cws)


Changes for Build #1599

Changes for Build #1600
[kevinwilfong] HIVE-3293. Load file into a table does not update table statistics. (njain
via kevinwilfong)




3 tests failed.
REGRESSION:  org.apache.hadoop.hive.cli.TestCliDriver.testCliDriver_udf_ucase

Error Message:
Timeout occurred. Please note the time in the report does not reflect the time until the timeout.

Stack Trace:
junit.framework.AssertionFailedError: Timeout occurred. Please note the time in the report
does not reflect the time until the timeout.
	at net.sf.antcontrib.logic.ForTask.doSequentialIteration(ForTask.java:259)
	at net.sf.antcontrib.logic.ForTask.doToken(ForTask.java:268)
	at net.sf.antcontrib.logic.ForTask.doTheTasks(ForTask.java:324)
	at net.sf.antcontrib.logic.ForTask.execute(ForTask.java:244)


REGRESSION:  org.apache.hadoop.hive.cli.TestNegativeCliDriver.testNegativeCliDriver_stats_aggregator_error_1

Error Message:
Forked Java VM exited abnormally. Please note the time in the report does not reflect the
time until the VM exit.

Stack Trace:
junit.framework.AssertionFailedError: Forked Java VM exited abnormally. Please note the time
in the report does not reflect the time until the VM exit.
	at net.sf.antcontrib.logic.ForTask.doSequentialIteration(ForTask.java:259)
	at net.sf.antcontrib.logic.ForTask.doToken(ForTask.java:268)
	at net.sf.antcontrib.logic.ForTask.doTheTasks(ForTask.java:324)
	at net.sf.antcontrib.logic.ForTask.execute(ForTask.java:244)


REGRESSION:  org.apache.hadoop.hive.service.TestHiveServerSessions.testSessionVars

Error Message:
java.net.ConnectException: Connection refused

Stack Trace:
org.apache.thrift.transport.TTransportException: java.net.ConnectException: Connection refused
	at org.apache.thrift.transport.TSocket.open(TSocket.java:183)
	at org.apache.hadoop.hive.service.TestHiveServerSessions.setUp(TestHiveServerSessions.java:59)
	at junit.framework.TestCase.runBare(TestCase.java:132)
	at junit.framework.TestResult$1.protect(TestResult.java:110)
	at junit.framework.TestResult.runProtected(TestResult.java:128)
	at junit.framework.TestResult.run(TestResult.java:113)
	at junit.framework.TestCase.run(TestCase.java:124)
	at junit.framework.TestSuite.runTest(TestSuite.java:243)
	at junit.framework.TestSuite.run(TestSuite.java:238)
	at org.apache.tools.ant.taskdefs.optional.junit.JUnitTestRunner.run(JUnitTestRunner.java:518)
	at org.apache.tools.ant.taskdefs.optional.junit.JUnitTestRunner.launch(JUnitTestRunner.java:1052)
	at org.apache.tools.ant.taskdefs.optional.junit.JUnitTestRunner.main(JUnitTestRunner.java:906)
Caused by: java.net.ConnectException: Connection refused
	at java.net.PlainSocketImpl.socketConnect(Native Method)
	at java.net.PlainSocketImpl.doConnect(PlainSocketImpl.java:351)
	at java.net.PlainSocketImpl.connectToAddress(PlainSocketImpl.java:213)
	at java.net.PlainSocketImpl.connect(PlainSocketImpl.java:200)
	at java.net.SocksSocketImpl.connect(SocksSocketImpl.java:366)
	at java.net.Socket.connect(Socket.java:529)
	at org.apache.thrift.transport.TSocket.open(TSocket.java:178)
	... 11 more




The Apache Jenkins build system has built Hive-trunk-h0.21 (build #1600)

Status: Still Failing

Check console output at https://builds.apache.org/job/Hive-trunk-h0.21/1600/ to view the results.
Mime
  • Unnamed multipart/mixed (inline, None, 0 bytes)
View raw message