hive-dev mailing list archives

Site index · List index
Message view « Date » · « Thread »
Top « Date » · « Thread »
From Apache Jenkins Server <jenk...@builds.apache.org>
Subject Build failed in Jenkins: Hive-0.9.1-SNAPSHOT-h0.21 #118
Date Mon, 27 Aug 2012 16:03:07 GMT
See <https://builds.apache.org/job/Hive-0.9.1-SNAPSHOT-h0.21/118/>

------------------------------------------
[...truncated 5429 lines...]
    [mkdir] Created dir: <https://builds.apache.org/job/Hive-0.9.1-SNAPSHOT-h0.21/118/artifact/hive/build/jdbc/test/classes>
    [mkdir] Created dir: <https://builds.apache.org/job/Hive-0.9.1-SNAPSHOT-h0.21/118/artifact/hive/build/jdbc/test/resources>
     [copy] Warning: <https://builds.apache.org/job/Hive-0.9.1-SNAPSHOT-h0.21/ws/hive/jdbc/src/test/resources>
does not exist.

init:
     [echo] Project: jdbc

create-dirs:
     [echo] Project: hwi
    [mkdir] Created dir: <https://builds.apache.org/job/Hive-0.9.1-SNAPSHOT-h0.21/118/artifact/hive/build/hwi>
    [mkdir] Created dir: <https://builds.apache.org/job/Hive-0.9.1-SNAPSHOT-h0.21/118/artifact/hive/build/hwi/classes>
    [mkdir] Created dir: <https://builds.apache.org/job/Hive-0.9.1-SNAPSHOT-h0.21/118/artifact/hive/build/hwi/test>
    [mkdir] Created dir: <https://builds.apache.org/job/Hive-0.9.1-SNAPSHOT-h0.21/118/artifact/hive/build/hwi/test/src>
    [mkdir] Created dir: <https://builds.apache.org/job/Hive-0.9.1-SNAPSHOT-h0.21/118/artifact/hive/build/hwi/test/classes>
    [mkdir] Created dir: <https://builds.apache.org/job/Hive-0.9.1-SNAPSHOT-h0.21/118/artifact/hive/build/hwi/test/resources>
     [copy] Warning: <https://builds.apache.org/job/Hive-0.9.1-SNAPSHOT-h0.21/ws/hive/hwi/src/test/resources>
does not exist.

init:
     [echo] Project: hwi

create-dirs:
     [echo] Project: hbase-handler
    [mkdir] Created dir: <https://builds.apache.org/job/Hive-0.9.1-SNAPSHOT-h0.21/118/artifact/hive/build/hbase-handler>
    [mkdir] Created dir: <https://builds.apache.org/job/Hive-0.9.1-SNAPSHOT-h0.21/118/artifact/hive/build/hbase-handler/classes>
    [mkdir] Created dir: <https://builds.apache.org/job/Hive-0.9.1-SNAPSHOT-h0.21/118/artifact/hive/build/hbase-handler/test>
    [mkdir] Created dir: <https://builds.apache.org/job/Hive-0.9.1-SNAPSHOT-h0.21/118/artifact/hive/build/hbase-handler/test/src>
    [mkdir] Created dir: <https://builds.apache.org/job/Hive-0.9.1-SNAPSHOT-h0.21/118/artifact/hive/build/hbase-handler/test/classes>
    [mkdir] Created dir: <https://builds.apache.org/job/Hive-0.9.1-SNAPSHOT-h0.21/118/artifact/hive/build/hbase-handler/test/resources>
     [copy] Warning: <https://builds.apache.org/job/Hive-0.9.1-SNAPSHOT-h0.21/ws/hive/hbase-handler/src/test/resources>
does not exist.

init:
     [echo] Project: hbase-handler

create-dirs:
     [echo] Project: pdk
    [mkdir] Created dir: <https://builds.apache.org/job/Hive-0.9.1-SNAPSHOT-h0.21/118/artifact/hive/build/pdk>
    [mkdir] Created dir: <https://builds.apache.org/job/Hive-0.9.1-SNAPSHOT-h0.21/118/artifact/hive/build/pdk/classes>
    [mkdir] Created dir: <https://builds.apache.org/job/Hive-0.9.1-SNAPSHOT-h0.21/118/artifact/hive/build/pdk/test>
    [mkdir] Created dir: <https://builds.apache.org/job/Hive-0.9.1-SNAPSHOT-h0.21/118/artifact/hive/build/pdk/test/src>
    [mkdir] Created dir: <https://builds.apache.org/job/Hive-0.9.1-SNAPSHOT-h0.21/118/artifact/hive/build/pdk/test/classes>
    [mkdir] Created dir: <https://builds.apache.org/job/Hive-0.9.1-SNAPSHOT-h0.21/118/artifact/hive/build/pdk/test/resources>
     [copy] Warning: <https://builds.apache.org/job/Hive-0.9.1-SNAPSHOT-h0.21/ws/hive/pdk/src/test/resources>
does not exist.

init:
     [echo] Project: pdk

create-dirs:
     [echo] Project: builtins
    [mkdir] Created dir: <https://builds.apache.org/job/Hive-0.9.1-SNAPSHOT-h0.21/118/artifact/hive/build/builtins>
    [mkdir] Created dir: <https://builds.apache.org/job/Hive-0.9.1-SNAPSHOT-h0.21/118/artifact/hive/build/builtins/classes>
    [mkdir] Created dir: <https://builds.apache.org/job/Hive-0.9.1-SNAPSHOT-h0.21/118/artifact/hive/build/builtins/test>
    [mkdir] Created dir: <https://builds.apache.org/job/Hive-0.9.1-SNAPSHOT-h0.21/118/artifact/hive/build/builtins/test/src>
    [mkdir] Created dir: <https://builds.apache.org/job/Hive-0.9.1-SNAPSHOT-h0.21/118/artifact/hive/build/builtins/test/classes>
    [mkdir] Created dir: <https://builds.apache.org/job/Hive-0.9.1-SNAPSHOT-h0.21/118/artifact/hive/build/builtins/test/resources>
     [copy] Warning: <https://builds.apache.org/job/Hive-0.9.1-SNAPSHOT-h0.21/ws/hive/builtins/src/test/resources>
does not exist.

init:
     [echo] Project: builtins

jar:
     [echo] Project: hive

create-dirs:
     [echo] Project: shims
     [copy] Warning: <https://builds.apache.org/job/Hive-0.9.1-SNAPSHOT-h0.21/ws/hive/shims/src/test/resources>
does not exist.

init:
     [echo] Project: shims

ivy-init-settings:
     [echo] Project: shims

ivy-resolve:
     [echo] Project: shims
[ivy:resolve] :: loading settings :: file = <https://builds.apache.org/job/Hive-0.9.1-SNAPSHOT-h0.21/ws/hive/ivy/ivysettings.xml>
[ivy:resolve] downloading http://repo1.maven.org/maven2/org/apache/zookeeper/zookeeper/3.4.3/zookeeper-3.4.3.jar
...
[ivy:resolve] ...........................................................................................................................
(749kB)
[ivy:resolve] .. (0kB)
[ivy:resolve] 	[SUCCESSFUL ] org.apache.zookeeper#zookeeper;3.4.3!zookeeper.jar (38ms)
[ivy:resolve] downloading http://repo1.maven.org/maven2/org/apache/thrift/libthrift/0.7.0/libthrift-0.7.0.jar
...
[ivy:resolve] .................................................... (294kB)
[ivy:resolve] .. (0kB)
[ivy:resolve] 	[SUCCESSFUL ] org.apache.thrift#libthrift;0.7.0!libthrift.jar (23ms)
[ivy:resolve] downloading http://repo1.maven.org/maven2/commons-logging/commons-logging/1.0.4/commons-logging-1.0.4.jar
...
[ivy:resolve] ..... (37kB)
[ivy:resolve] .. (0kB)
[ivy:resolve] 	[SUCCESSFUL ] commons-logging#commons-logging;1.0.4!commons-logging.jar (19ms)
[ivy:resolve] downloading http://repo1.maven.org/maven2/commons-logging/commons-logging-api/1.0.4/commons-logging-api-1.0.4.jar
...
[ivy:resolve] .... (25kB)
[ivy:resolve] .. (0kB)
[ivy:resolve] 	[SUCCESSFUL ] commons-logging#commons-logging-api;1.0.4!commons-logging-api.jar
(15ms)
[ivy:resolve] downloading http://repo1.maven.org/maven2/com/google/guava/guava/r09/guava-r09.jar
...
[ivy:resolve] .......................................................................................................
(1117kB)
[ivy:resolve] .. (0kB)
[ivy:resolve] 	[SUCCESSFUL ] com.google.guava#guava;r09!guava.jar (45ms)
[ivy:resolve] downloading http://repo1.maven.org/maven2/org/codehaus/jackson/jackson-core-asl/1.8.8/jackson-core-asl-1.8.8.jar
...
[ivy:resolve] ...................................... (222kB)
[ivy:resolve] .. (0kB)
[ivy:resolve] 	[SUCCESSFUL ] org.codehaus.jackson#jackson-core-asl;1.8.8!jackson-core-asl.jar
(32ms)
[ivy:resolve] downloading http://repo1.maven.org/maven2/org/codehaus/jackson/jackson-mapper-asl/1.8.8/jackson-mapper-asl-1.8.8.jar
...
[ivy:resolve] ........................................................................................................
(652kB)
[ivy:resolve] .. (0kB)
[ivy:resolve] 	[SUCCESSFUL ] org.codehaus.jackson#jackson-mapper-asl;1.8.8!jackson-mapper-asl.jar
(32ms)
[ivy:report] Processing <https://builds.apache.org/job/Hive-0.9.1-SNAPSHOT-h0.21/118/artifact/hive/build/ivy/resolution-cache/org.apache.hive-hive-shims-default.xml>
to <https://builds.apache.org/job/Hive-0.9.1-SNAPSHOT-h0.21/118/artifact/hive/build/ivy/report/org.apache.hive-hive-shims-default.html>

ivy-retrieve:
     [echo] Project: shims

compile:
     [echo] Project: shims
     [echo] Building shims 0.20

build_shims:
     [echo] Project: shims
     [echo] Compiling <https://builds.apache.org/job/Hive-0.9.1-SNAPSHOT-h0.21/ws/hive/shims/src/common/java;/home/hudson/hudson-slave/workspace/Hive-0.9.1-SNAPSHOT-h0.21/hive/shims/src/0.20/java>
against hadoop 0.20.2 (<https://builds.apache.org/job/Hive-0.9.1-SNAPSHOT-h0.21/118/artifact/hive/build/hadoopcore/hadoop-0.20.2)>

ivy-init-settings:
     [echo] Project: shims

ivy-resolve-hadoop-shim:
     [echo] Project: shims
[ivy:resolve] :: loading settings :: file = <https://builds.apache.org/job/Hive-0.9.1-SNAPSHOT-h0.21/ws/hive/ivy/ivysettings.xml>

ivy-retrieve-hadoop-shim:
     [echo] Project: shims
    [javac] Compiling 16 source files to <https://builds.apache.org/job/Hive-0.9.1-SNAPSHOT-h0.21/118/artifact/hive/build/shims/classes>
    [javac] Note: Some input files use or override a deprecated API.
    [javac] Note: Recompile with -Xlint:deprecation for details.
    [javac] Note: <https://builds.apache.org/job/Hive-0.9.1-SNAPSHOT-h0.21/ws/hive/shims/src/0.20/java/org/apache/hadoop/hive/shims/Hadoop20Shims.java>
uses unchecked or unsafe operations.
    [javac] Note: Recompile with -Xlint:unchecked for details.
     [echo] Building shims 0.20S

build_shims:
     [echo] Project: shims
     [echo] Compiling <https://builds.apache.org/job/Hive-0.9.1-SNAPSHOT-h0.21/ws/hive/shims/src/common/java;/home/hudson/hudson-slave/workspace/Hive-0.9.1-SNAPSHOT-h0.21/hive/shims/src/common-secure/java;/home/hudson/hudson-slave/workspace/Hive-0.9.1-SNAPSHOT-h0.21/hive/shims/src/0.20S/java>
against hadoop 1.0.0 (<https://builds.apache.org/job/Hive-0.9.1-SNAPSHOT-h0.21/118/artifact/hive/build/hadoopcore/hadoop-1.0.0)>

ivy-init-settings:
     [echo] Project: shims

ivy-resolve-hadoop-shim:
     [echo] Project: shims
[ivy:resolve] :: loading settings :: file = <https://builds.apache.org/job/Hive-0.9.1-SNAPSHOT-h0.21/ws/hive/ivy/ivysettings.xml>
[ivy:resolve] downloading http://repo1.maven.org/maven2/org/apache/hadoop/hadoop-core/1.0.0/hadoop-core-1.0.0.jar
...
[ivy:resolve] .............................................................................................................................................................................................................................................................................................................................................................................................
(3652kB)
[ivy:resolve] .. (0kB)
[ivy:resolve] downloading http://repo1.maven.org/maven2/org/apache/hadoop/hadoop-tools/1.0.0/hadoop-tools-1.0.0.jar
...
[ivy:resolve] ...... (281kB)
[ivy:resolve] .. (0kB)
[ivy:resolve] downloading http://repo1.maven.org/maven2/org/apache/hadoop/hadoop-test/1.0.0/hadoop-test-1.0.0.jar
...
[ivy:resolve] .......................................................................................................................................................................................................................................................................................................................................................................................................................................................................................................................
(2471kB)
[ivy:resolve] .. (0kB)
[ivy:resolve] 	[SUCCESSFUL ] org.apache.hadoop#hadoop-test;1.0.0!hadoop-test.jar (210ms)
[ivy:resolve] downloading http://repo1.maven.org/maven2/commons-codec/commons-codec/1.4/commons-codec-1.4.jar
...
[ivy:resolve] .......... (56kB)
[ivy:resolve] downloading http://repo1.maven.org/maven2/org/apache/commons/commons-math/2.1/commons-math-2.1.jar
...
[ivy:resolve] ................................................................................................................................
(812kB)
[ivy:resolve] .. (0kB)
[ivy:resolve] downloading http://repo1.maven.org/maven2/commons-configuration/commons-configuration/1.6/commons-configuration-1.6.jar
...
[ivy:resolve] .................................................. (291kB)
[ivy:resolve] .. (0kB)
[ivy:resolve] downloading http://repo1.maven.org/maven2/org/mortbay/jetty/jetty/6.1.26/jetty-6.1.26.jar
...
[ivy:resolve] .............................................................................................
(527kB)
[ivy:resolve] .. (0kB)
[ivy:resolve] downloading http://repo1.maven.org/maven2/org/mortbay/jetty/jetty-util/6.1.26/jetty-util-6.1.26.jar
...
[ivy:resolve] ..................... (172kB)
[ivy:resolve] .. (0kB)
[ivy:resolve] downloading http://repo1.maven.org/maven2/org/codehaus/jackson/jackson-mapper-asl/1.0.1/jackson-mapper-asl-1.0.1.jar
...
[ivy:resolve] ..................................................... (264kB)
[ivy:resolve] .. (0kB)
[ivy:resolve] downloading http://repo1.maven.org/maven2/commons-beanutils/commons-beanutils/1.7.0/commons-beanutils-1.7.0.jar
...
[ivy:resolve] ........................................ (184kB)
[ivy:resolve] .. (0kB)
[ivy:resolve] downloading http://repo1.maven.org/maven2/org/mortbay/jetty/servlet-api/2.5-20081211/servlet-api-2.5-20081211.jar
...
[ivy:resolve] ...................... (130kB)
[ivy:resolve] .. (0kB)
[ivy:resolve] 
[ivy:resolve] :: problems summary ::
[ivy:resolve] :::: WARNINGS
[ivy:resolve] 	problem while downloading module descriptor: http://repo1.maven.org/maven2/org/codehaus/jackson/jackson-core-asl/1.0.1/jackson-core-asl-1.0.1.pom:
/home/hudson/.ivy2/cache/org.codehaus.jackson/jackson-core-asl/ivy-1.0.1.xml.original.part
(No such file or directory) (12ms)
[ivy:resolve] 		module not found: org.codehaus.jackson#jackson-core-asl;1.0.1
[ivy:resolve] 	==== local: tried
[ivy:resolve] 	  /home/hudson/.ivy2/local/org.codehaus.jackson/jackson-core-asl/1.0.1/ivys/ivy.xml
[ivy:resolve] 	  -- artifact org.codehaus.jackson#jackson-core-asl;1.0.1!jackson-core-asl.jar:
[ivy:resolve] 	  /home/hudson/.ivy2/local/org.codehaus.jackson/jackson-core-asl/1.0.1/jars/jackson-core-asl.jar
[ivy:resolve] 	==== apache-snapshot: tried
[ivy:resolve] 	  https://repository.apache.org/content/repositories/snapshots/org/codehaus/jackson/jackson-core-asl/1.0.1/jackson-core-asl-1.0.1.pom
[ivy:resolve] 	  -- artifact org.codehaus.jackson#jackson-core-asl;1.0.1!jackson-core-asl.jar:
[ivy:resolve] 	  https://repository.apache.org/content/repositories/snapshots/org/codehaus/jackson/jackson-core-asl/1.0.1/jackson-core-asl-1.0.1.jar
[ivy:resolve] 	==== maven2: tried
[ivy:resolve] 	  http://repo1.maven.org/maven2/org/codehaus/jackson/jackson-core-asl/1.0.1/jackson-core-asl-1.0.1.pom
[ivy:resolve] 	==== datanucleus-repo: tried
[ivy:resolve] 	  -- artifact org.codehaus.jackson#jackson-core-asl;1.0.1!jackson-core-asl.jar:
[ivy:resolve] 	  http://www.datanucleus.org/downloads/maven2/org/codehaus/jackson/jackson-core-asl/1.0.1/jackson-core-asl-1.0.1.jar
[ivy:resolve] 	==== hadoop-source: tried
[ivy:resolve] 	  -- artifact org.codehaus.jackson#jackson-core-asl;1.0.1!jackson-core-asl.jar:
[ivy:resolve] 	  http://mirror.facebook.net/facebook/hive-deps/hadoop/core/jackson-core-asl-1.0.1/jackson-core-asl-1.0.1.jar
[ivy:resolve] 	==== hadoop-source2: tried
[ivy:resolve] 	  -- artifact org.codehaus.jackson#jackson-core-asl;1.0.1!jackson-core-asl.jar:
[ivy:resolve] 	  http://archive.cloudera.com/hive-deps/hadoop/core/jackson-core-asl-1.0.1/jackson-core-asl-1.0.1.jar
[ivy:resolve] 		[FAILED     ] org.apache.hadoop#hadoop-core;1.0.0!hadoop-core.jar: impossible
to move part file to definitive one: /home/hudson/.ivy2/cache/org.apache.hadoop/hadoop-core/jars/hadoop-core-1.0.0.jar.part
-> /home/hudson/.ivy2/cache/org.apache.hadoop/hadoop-core/jars/hadoop-core-1.0.0.jar (325ms)
[ivy:resolve] 		[FAILED     ] org.apache.hadoop#hadoop-tools;1.0.0!hadoop-tools.jar: impossible
to move part file to definitive one: /home/hudson/.ivy2/cache/org.apache.hadoop/hadoop-tools/jars/hadoop-tools-1.0.0.jar.part
-> /home/hudson/.ivy2/cache/org.apache.hadoop/hadoop-tools/jars/hadoop-tools-1.0.0.jar
(71ms)
[ivy:resolve] 		[FAILED     ] commons-codec#commons-codec;1.4!commons-codec.jar: Downloaded
file size doesn't match expected Content Length for http://repo1.maven.org/maven2/commons-codec/commons-codec/1.4/commons-codec-1.4.jar.
Please retry. (7ms)
[ivy:resolve] 		[FAILED     ] commons-codec#commons-codec;1.4!commons-codec.jar:  (0ms)
[ivy:resolve] 	==== local: tried
[ivy:resolve] 	  /home/hudson/.ivy2/local/commons-codec/commons-codec/1.4/jars/commons-codec.jar
[ivy:resolve] 	==== apache-snapshot: tried
[ivy:resolve] 	  https://repository.apache.org/content/repositories/snapshots/commons-codec/commons-codec/1.4/commons-codec-1.4.jar
[ivy:resolve] 	==== maven2: tried
[ivy:resolve] 	  http://repo1.maven.org/maven2/commons-codec/commons-codec/1.4/commons-codec-1.4.jar
[ivy:resolve] 	==== datanucleus-repo: tried
[ivy:resolve] 	  http://www.datanucleus.org/downloads/maven2/commons-codec/commons-codec/1.4/commons-codec-1.4.jar
[ivy:resolve] 	==== hadoop-source: tried
[ivy:resolve] 	  http://mirror.facebook.net/facebook/hive-deps/hadoop/core/commons-codec-1.4/commons-codec-1.4.jar
[ivy:resolve] 	==== hadoop-source2: tried
[ivy:resolve] 	  http://archive.cloudera.com/hive-deps/hadoop/core/commons-codec-1.4/commons-codec-1.4.jar
[ivy:resolve] 		[FAILED     ] org.apache.commons#commons-math;2.1!commons-math.jar: impossible
to move part file to definitive one: /home/hudson/.ivy2/cache/org.apache.commons/commons-math/jars/commons-math-2.1.jar.part
-> /home/hudson/.ivy2/cache/org.apache.commons/commons-math/jars/commons-math-2.1.jar (103ms)
[ivy:resolve] 		[FAILED     ] commons-configuration#commons-configuration;1.6!commons-configuration.jar:
/home/hudson/.ivy2/cache/commons-configuration/commons-configuration/jars/commons-configuration-1.6.jar.part
(No such file or directory) (19ms)
[ivy:resolve] 		[FAILED     ] org.mortbay.jetty#jetty;6.1.26!jetty.jar: impossible to move
part file to definitive one: /home/hudson/.ivy2/cache/org.mortbay.jetty/jetty/jars/jetty-6.1.26.jar.part
-> /home/hudson/.ivy2/cache/org.mortbay.jetty/jetty/jars/jetty-6.1.26.jar (28ms)
[ivy:resolve] 		[FAILED     ] org.mortbay.jetty#jetty-util;6.1.26!jetty-util.jar: /home/hudson/.ivy2/cache/org.mortbay.jetty/jetty-util/jars/jetty-util-6.1.26.jar.part
(No such file or directory) (17ms)
[ivy:resolve] 		[FAILED     ] org.codehaus.jackson#jackson-mapper-asl;1.0.1!jackson-mapper-asl.jar:
/home/hudson/.ivy2/cache/org.codehaus.jackson/jackson-mapper-asl/jars/jackson-mapper-asl-1.0.1.jar.part
(No such file or directory) (47ms)
[ivy:resolve] 		[FAILED     ] commons-beanutils#commons-beanutils;1.7.0!commons-beanutils.jar:
impossible to move part file to definitive one: /home/hudson/.ivy2/cache/commons-beanutils/commons-beanutils/jars/commons-beanutils-1.7.0.jar.part
-> /home/hudson/.ivy2/cache/commons-beanutils/commons-beanutils/jars/commons-beanutils-1.7.0.jar
(34ms)
[ivy:resolve] 		[FAILED     ] org.mortbay.jetty#servlet-api;2.5-20081211!servlet-api.jar:
/home/hudson/.ivy2/cache/org.mortbay.jetty/servlet-api/jars/servlet-api-2.5-20081211.jar.part
(No such file or directory) (17ms)
[ivy:resolve] 		::::::::::::::::::::::::::::::::::::::::::::::
[ivy:resolve] 		::          UNRESOLVED DEPENDENCIES         ::
[ivy:resolve] 		::::::::::::::::::::::::::::::::::::::::::::::
[ivy:resolve] 		:: org.codehaus.jackson#jackson-core-asl;1.0.1: not found
[ivy:resolve] 		::::::::::::::::::::::::::::::::::::::::::::::
[ivy:resolve] 		::::::::::::::::::::::::::::::::::::::::::::::
[ivy:resolve] 		::              FAILED DOWNLOADS            ::
[ivy:resolve] 		:: ^ see resolution messages for details  ^ ::
[ivy:resolve] 		::::::::::::::::::::::::::::::::::::::::::::::
[ivy:resolve] 		:: commons-codec#commons-codec;1.4!commons-codec.jar
[ivy:resolve] 		::::::::::::::::::::::::::::::::::::::::::::::
[ivy:resolve] 
[ivy:resolve] :: USE VERBOSE OR DEBUG MESSAGE LEVEL FOR MORE DETAILS

BUILD FAILED
<https://builds.apache.org/job/Hive-0.9.1-SNAPSHOT-h0.21/ws/hive/build.xml>:302: The
following error occurred while executing this line:
<https://builds.apache.org/job/Hive-0.9.1-SNAPSHOT-h0.21/ws/hive/build.xml>:152: The
following error occurred while executing this line:
<https://builds.apache.org/job/Hive-0.9.1-SNAPSHOT-h0.21/ws/hive/shims/build.xml>:85:
The following error occurred while executing this line:
<https://builds.apache.org/job/Hive-0.9.1-SNAPSHOT-h0.21/ws/hive/shims/build.xml>:88:
The following error occurred while executing this line:
<https://builds.apache.org/job/Hive-0.9.1-SNAPSHOT-h0.21/ws/hive/shims/build.xml>:60:
The following error occurred while executing this line:
<https://builds.apache.org/job/Hive-0.9.1-SNAPSHOT-h0.21/ws/hive/build-common.xml>:164:
impossible to resolve dependencies:
	resolve failed - see output for details

Total time: 36 seconds
Build step 'Invoke Ant' marked build as failure
Archiving artifacts
Recording test results

Mime
View raw message