hive-dev mailing list archives

Site index · List index
Message view « Date » · « Thread »
Top « Date » · « Thread »
From Apache Jenkins Server <jenk...@builds.apache.org>
Subject Build failed in Jenkins: Hive-0.9.1-SNAPSHOT-h0.21-keepgoing=false #77
Date Mon, 16 Jul 2012 16:05:49 GMT
See <https://builds.apache.org/job/Hive-0.9.1-SNAPSHOT-h0.21-keepgoing=false/77/>

------------------------------------------
[...truncated 6184 lines...]
[ivy:resolve] .. (0kB)
[ivy:resolve] 	[SUCCESSFUL ] org.apache.hive#hive-serde;0.9.1-SNAPSHOT!hive-serde.jar (4ms)
[ivy:resolve] downloading http://repo1.maven.org/maven2/org/antlr/antlr/3.0.1/antlr-3.0.1.jar
...
[ivy:resolve] ............................................................................
(549kB)
[ivy:resolve] .. (0kB)
[ivy:resolve] downloading http://repo1.maven.org/maven2/org/antlr/antlr-runtime/3.0.1/antlr-runtime-3.0.1.jar
...
[ivy:resolve] .................... (102kB)
[ivy:resolve] .. (0kB)
[ivy:resolve] 	[SUCCESSFUL ] org.antlr#antlr-runtime;3.0.1!antlr-runtime.jar (191ms)
[ivy:resolve] downloading http://repo1.maven.org/maven2/commons-dbcp/commons-dbcp/1.4/commons-dbcp-1.4.jar
...
[ivy:resolve] .................... (156kB)
[ivy:resolve] .. (0kB)
[ivy:resolve] downloading http://repo1.maven.org/maven2/commons-pool/commons-pool/1.5.4/commons-pool-1.5.4.jar
...
[ivy:resolve] ............ (93kB)
[ivy:resolve] .. (0kB)
[ivy:resolve] downloading http://repo1.maven.org/maven2/org/datanucleus/datanucleus-connectionpool/2.0.3/datanucleus-connectionpool-2.0.3.jar
...
[ivy:resolve] .. (16kB)
[ivy:resolve] .. (0kB)
[ivy:resolve] 	[SUCCESSFUL ] org.datanucleus#datanucleus-connectionpool;2.0.3!datanucleus-connectionpool.jar
(294ms)
[ivy:resolve] downloading http://repo1.maven.org/maven2/org/datanucleus/datanucleus-core/2.0.3/datanucleus-core-2.0.3.jar
...
[ivy:resolve] ..............................................................................................................................................................................................................................................................................................................................................................
(1955kB)
[ivy:resolve] .. (0kB)
[ivy:resolve] 	[SUCCESSFUL ] org.datanucleus#datanucleus-core;2.0.3!datanucleus-core.jar (667ms)
[ivy:resolve] downloading http://repo1.maven.org/maven2/org/datanucleus/datanucleus-enhancer/2.0.3/datanucleus-enhancer-2.0.3.jar
...
[ivy:resolve] ....................... (183kB)
[ivy:resolve] .. (0kB)
[ivy:resolve] downloading http://www.datanucleus.org/downloads/maven2/org/datanucleus/datanucleus-enhancer/2.0.3/datanucleus-enhancer-2.0.3.jar
...
[ivy:resolve] ...............................................................................................................
(183kB)
[ivy:resolve] .. (0kB)
[ivy:resolve] 	[SUCCESSFUL ] org.datanucleus#datanucleus-enhancer;2.0.3!datanucleus-enhancer.jar
(1837ms)
[ivy:resolve] downloading http://repo1.maven.org/maven2/org/datanucleus/datanucleus-rdbms/2.0.3/datanucleus-rdbms-2.0.3.jar
...
[ivy:resolve] ...................................................................................................................................................................................................
(1196kB)
[ivy:resolve] .. (0kB)
[ivy:resolve] downloading http://www.datanucleus.org/downloads/maven2/org/datanucleus/datanucleus-rdbms/2.0.3/datanucleus-rdbms-2.0.3.jar
...
[ivy:resolve] ...................................................................................................................................................................................................................................................................................................................................................................................
[ivy:resolve] ..................................................................................................................................................................................................................................................................................................................................................................................................................................
[ivy:resolve] ................ (1196kB)
[ivy:resolve] .. (0kB)
[ivy:resolve] downloading http://www.datanucleus.org/downloads/maven2/javax/jdo/jdo2-api/2.3-ec/jdo2-api-2.3-ec.jar
...
[ivy:resolve] ................................................................................................................................
(193kB)
[ivy:resolve] .. (0kB)
[ivy:resolve] 	[SUCCESSFUL ] javax.jdo#jdo2-api;2.3-ec!jdo2-api.jar (1257ms)
[ivy:resolve] downloading http://repo1.maven.org/maven2/org/apache/derby/derby/10.4.2.0/derby-10.4.2.0.jar
...
[ivy:resolve] .........................................................................................................................................................................................................................................................................................................................................................................................................................
(2389kB)
[ivy:resolve] .. (0kB)
[ivy:resolve] 	[SUCCESSFUL ] org.apache.derby#derby;10.4.2.0!derby.jar (739ms)
[ivy:resolve] downloading http://repo1.maven.org/maven2/asm/asm/3.1/asm-3.1.jar ...
[ivy:resolve] .... (42kB)
[ivy:resolve] .. (0kB)
[ivy:resolve] 	[SUCCESSFUL ] asm#asm;3.1!asm.jar (33ms)
[ivy:resolve] downloading http://repo1.maven.org/maven2/org/antlr/stringtemplate/3.1-b1/stringtemplate-3.1-b1.jar
...
[ivy:resolve] .................................... (224kB)
[ivy:resolve] .. (0kB)
[ivy:resolve] 	[SUCCESSFUL ] org.antlr#stringtemplate;3.1-b1!stringtemplate.jar (85ms)
[ivy:resolve] downloading http://repo1.maven.org/maven2/antlr/antlr/2.7.7/antlr-2.7.7.jar
...
[ivy:resolve] ....................................................................... (434kB)
[ivy:resolve] .. (0kB)
[ivy:resolve] 	[SUCCESSFUL ] antlr#antlr;2.7.7!antlr.jar (65ms)
[ivy:resolve] 
[ivy:resolve] :: problems summary ::
[ivy:resolve] :::: WARNINGS
[ivy:resolve] 		[FAILED     ] org.antlr#antlr;3.0.1!antlr.jar: impossible to move part file
to definitive one: /home/jenkins/.ivy2/cache/org.antlr/antlr/jars/antlr-3.0.1.jar.part ->
/home/jenkins/.ivy2/cache/org.antlr/antlr/jars/antlr-3.0.1.jar (192ms)
[ivy:resolve] 		[FAILED     ] commons-dbcp#commons-dbcp;1.4!commons-dbcp.jar: impossible to
move part file to definitive one: /home/jenkins/.ivy2/cache/commons-dbcp/commons-dbcp/jars/commons-dbcp-1.4.jar.part
-> /home/jenkins/.ivy2/cache/commons-dbcp/commons-dbcp/jars/commons-dbcp-1.4.jar (54ms)
[ivy:resolve] 		[FAILED     ] commons-pool#commons-pool;1.5.4!commons-pool.jar: /home/jenkins/.ivy2/cache/commons-pool/commons-pool/jars/commons-pool-1.5.4.jar.part
(No such file or directory) (59ms)
[ivy:resolve] 		[FAILED     ] org.datanucleus#datanucleus-enhancer;2.0.3!datanucleus-enhancer.jar:
invalid md5: expected=dd4a00ff0ae0e839bb39e45a7d5dd4b4 computed=6e7f2439bf4597d6356374e6f0f82dfe
(356ms)
[ivy:resolve] 		[FAILED     ] org.datanucleus#datanucleus-rdbms;2.0.3!datanucleus-rdbms.jar:
invalid md5: expected=f0dbdbe10a26fc000215a11209fbe701 computed=eb7d2bd90ba700daf8350e7e351693d7
(579ms)
[ivy:resolve] 		[FAILED     ] org.datanucleus#datanucleus-rdbms;2.0.3!datanucleus-rdbms.jar:
/home/jenkins/.ivy2/cache/org.datanucleus/datanucleus-rdbms/jars/datanucleus-rdbms-2.0.3.jar.part
(No such file or directory) (4126ms)
[ivy:resolve] 
[ivy:resolve] :: USE VERBOSE OR DEBUG MESSAGE LEVEL FOR MORE DETAILS
[ivy:report] Processing /x1/jenkins/jenkins-slave/workspace/Hive-0.9.1-SNAPSHOT-h0.21-keepgoing=false/hive/build/ivy/resolution-cache/org.apache.hive-hive-metastore-default.xml
to /x1/jenkins/jenkins-slave/workspace/Hive-0.9.1-SNAPSHOT-h0.21-keepgoing=false/hive/build/ivy/report/org.apache.hive-hive-metastore-default.html

ivy-retrieve:
     [echo] Project: metastore

build-grammar:
     [echo] Project: metastore
     [echo] Building Grammar /x1/jenkins/jenkins-slave/workspace/Hive-0.9.1-SNAPSHOT-h0.21-keepgoing=false/hive/metastore/src/java/org/apache/hadoop/hive/metastore/parser/Filter.g
 ....
     [java] ANTLR Parser Generator  Version 3.0.1 (August 13, 2007)  1989-2007

model-compile:
     [echo] Project: metastore
    [javac] Compiling 19 source files to /x1/jenkins/jenkins-slave/workspace/Hive-0.9.1-SNAPSHOT-h0.21-keepgoing=false/hive/build/metastore/classes
     [copy] Copying 1 file to /x1/jenkins/jenkins-slave/workspace/Hive-0.9.1-SNAPSHOT-h0.21-keepgoing=false/hive/build/metastore/classes

core-compile:
     [echo] Project: metastore
    [javac] Compiling 83 source files to /x1/jenkins/jenkins-slave/workspace/Hive-0.9.1-SNAPSHOT-h0.21-keepgoing=false/hive/build/metastore/classes
    [javac] Note: /x1/jenkins/jenkins-slave/workspace/Hive-0.9.1-SNAPSHOT-h0.21-keepgoing=false/hive/metastore/src/java/org/apache/hadoop/hive/metastore/MetaStoreUtils.java
uses or overrides a deprecated API.
    [javac] Note: Recompile with -Xlint:deprecation for details.
    [javac] Note: Some input files use unchecked or unsafe operations.
    [javac] Note: Recompile with -Xlint:unchecked for details.
    [javac] Creating empty /x1/jenkins/jenkins-slave/workspace/Hive-0.9.1-SNAPSHOT-h0.21-keepgoing=false/hive/build/metastore/classes/org/apache/hadoop/hive/metastore/parser/package-info.class

model-enhance:
     [echo] Project: metastore
[datanucleusenhancer] log4j:WARN No appenders could be found for logger (DataNucleus.Enhancer).
[datanucleusenhancer] log4j:WARN Please initialize the log4j system properly.
[datanucleusenhancer] log4j:WARN See http://logging.apache.org/log4j/1.2/faq.html#noconfig
for more info.
[datanucleusenhancer] DataNucleus Enhancer (version 2.0.3) : Enhancement of classes
[datanucleusenhancer] DataNucleus Enhancer : Classpath
[datanucleusenhancer] >>  /x1/jenkins/jenkins-slave/workspace/Hive-0.9.1-SNAPSHOT-h0.21-keepgoing=false/hive/build/service/classes
[datanucleusenhancer] >>  /x1/jenkins/jenkins-slave/workspace/Hive-0.9.1-SNAPSHOT-h0.21-keepgoing=false/hive/build/common/classes
[datanucleusenhancer] >>  /x1/jenkins/jenkins-slave/workspace/Hive-0.9.1-SNAPSHOT-h0.21-keepgoing=false/hive/build/serde/classes
[datanucleusenhancer] >>  /x1/jenkins/jenkins-slave/workspace/Hive-0.9.1-SNAPSHOT-h0.21-keepgoing=false/hive/build/metastore/classes
[datanucleusenhancer] >>  /x1/jenkins/jenkins-slave/workspace/Hive-0.9.1-SNAPSHOT-h0.21-keepgoing=false/hive/build/ql/classes
[datanucleusenhancer] >>  /x1/jenkins/jenkins-slave/workspace/Hive-0.9.1-SNAPSHOT-h0.21-keepgoing=false/hive/build/cli/classes
[datanucleusenhancer] >>  /x1/jenkins/jenkins-slave/workspace/Hive-0.9.1-SNAPSHOT-h0.21-keepgoing=false/hive/build/shims/classes
[datanucleusenhancer] >>  /x1/jenkins/jenkins-slave/workspace/Hive-0.9.1-SNAPSHOT-h0.21-keepgoing=false/hive/build/hwi/classes
[datanucleusenhancer] >>  /x1/jenkins/jenkins-slave/workspace/Hive-0.9.1-SNAPSHOT-h0.21-keepgoing=false/hive/build/jdbc/classes
[datanucleusenhancer] >>  /x1/jenkins/jenkins-slave/workspace/Hive-0.9.1-SNAPSHOT-h0.21-keepgoing=false/hive/build/hbase-handler/classes
[datanucleusenhancer] >>  /x1/jenkins/jenkins-slave/workspace/Hive-0.9.1-SNAPSHOT-h0.21-keepgoing=false/hive/build/anttasks/hive-anttasks-0.9.1-SNAPSHOT.jar
[datanucleusenhancer] >>  /x1/jenkins/jenkins-slave/workspace/Hive-0.9.1-SNAPSHOT-h0.21-keepgoing=false/hive/build/common/hive-common-0.9.1-SNAPSHOT.jar
[datanucleusenhancer] >>  /x1/jenkins/jenkins-slave/workspace/Hive-0.9.1-SNAPSHOT-h0.21-keepgoing=false/hive/build/serde/hive-serde-0.9.1-SNAPSHOT.jar
[datanucleusenhancer] >>  /x1/jenkins/jenkins-slave/workspace/Hive-0.9.1-SNAPSHOT-h0.21-keepgoing=false/hive/build/shims/hive-shims-0.9.1-SNAPSHOT.jar
[datanucleusenhancer] >>  /x1/jenkins/jenkins-slave/workspace/Hive-0.9.1-SNAPSHOT-h0.21-keepgoing=false/hive/build/ivy/lib/default/antlr-2.7.7.jar
[datanucleusenhancer] >>  /x1/jenkins/jenkins-slave/workspace/Hive-0.9.1-SNAPSHOT-h0.21-keepgoing=false/hive/build/ivy/lib/default/antlr-3.0.1.jar
[datanucleusenhancer] >>  /x1/jenkins/jenkins-slave/workspace/Hive-0.9.1-SNAPSHOT-h0.21-keepgoing=false/hive/build/ivy/lib/default/antlr-runtime-3.0.1.jar
[datanucleusenhancer] >>  /x1/jenkins/jenkins-slave/workspace/Hive-0.9.1-SNAPSHOT-h0.21-keepgoing=false/hive/build/ivy/lib/default/asm-3.1.jar
[datanucleusenhancer] >>  /x1/jenkins/jenkins-slave/workspace/Hive-0.9.1-SNAPSHOT-h0.21-keepgoing=false/hive/build/ivy/lib/default/commons-cli-1.2.jar
[datanucleusenhancer] >>  /x1/jenkins/jenkins-slave/workspace/Hive-0.9.1-SNAPSHOT-h0.21-keepgoing=false/hive/build/ivy/lib/default/commons-codec-1.4.jar
[datanucleusenhancer] >>  /x1/jenkins/jenkins-slave/workspace/Hive-0.9.1-SNAPSHOT-h0.21-keepgoing=false/hive/build/ivy/lib/default/commons-dbcp-1.4.jar
[datanucleusenhancer] >>  /x1/jenkins/jenkins-slave/workspace/Hive-0.9.1-SNAPSHOT-h0.21-keepgoing=false/hive/build/ivy/lib/default/commons-lang-2.4.jar
[datanucleusenhancer] >>  /x1/jenkins/jenkins-slave/workspace/Hive-0.9.1-SNAPSHOT-h0.21-keepgoing=false/hive/build/ivy/lib/default/commons-logging-1.0.4.jar
[datanucleusenhancer] >>  /x1/jenkins/jenkins-slave/workspace/Hive-0.9.1-SNAPSHOT-h0.21-keepgoing=false/hive/build/ivy/lib/default/commons-logging-api-1.0.4.jar
[datanucleusenhancer] >>  /x1/jenkins/jenkins-slave/workspace/Hive-0.9.1-SNAPSHOT-h0.21-keepgoing=false/hive/build/ivy/lib/default/commons-pool-1.5.4.jar
[datanucleusenhancer] >>  /x1/jenkins/jenkins-slave/workspace/Hive-0.9.1-SNAPSHOT-h0.21-keepgoing=false/hive/build/ivy/lib/default/datanucleus-connectionpool-2.0.3.jar
[datanucleusenhancer] >>  /x1/jenkins/jenkins-slave/workspace/Hive-0.9.1-SNAPSHOT-h0.21-keepgoing=false/hive/build/ivy/lib/default/datanucleus-core-2.0.3.jar
[datanucleusenhancer] >>  /x1/jenkins/jenkins-slave/workspace/Hive-0.9.1-SNAPSHOT-h0.21-keepgoing=false/hive/build/ivy/lib/default/datanucleus-enhancer-2.0.3.jar
[datanucleusenhancer] >>  /x1/jenkins/jenkins-slave/workspace/Hive-0.9.1-SNAPSHOT-h0.21-keepgoing=false/hive/build/ivy/lib/default/datanucleus-rdbms-2.0.3.jar
[datanucleusenhancer] >>  /x1/jenkins/jenkins-slave/workspace/Hive-0.9.1-SNAPSHOT-h0.21-keepgoing=false/hive/build/ivy/lib/default/derby-10.4.2.0.jar
[datanucleusenhancer] >>  /x1/jenkins/jenkins-slave/workspace/Hive-0.9.1-SNAPSHOT-h0.21-keepgoing=false/hive/build/ivy/lib/default/guava-r09.jar
[datanucleusenhancer] >>  /x1/jenkins/jenkins-slave/workspace/Hive-0.9.1-SNAPSHOT-h0.21-keepgoing=false/hive/build/ivy/lib/default/hadoop-core-0.20.2.jar
[datanucleusenhancer] >>  /x1/jenkins/jenkins-slave/workspace/Hive-0.9.1-SNAPSHOT-h0.21-keepgoing=false/hive/build/ivy/lib/default/hadoop-test-0.20.2.jar
[datanucleusenhancer] >>  /x1/jenkins/jenkins-slave/workspace/Hive-0.9.1-SNAPSHOT-h0.21-keepgoing=false/hive/build/ivy/lib/default/hadoop-tools-0.20.2.jar
[datanucleusenhancer] >>  /x1/jenkins/jenkins-slave/workspace/Hive-0.9.1-SNAPSHOT-h0.21-keepgoing=false/hive/build/ivy/lib/default/hive-common-0.9.1-SNAPSHOT.jar
[datanucleusenhancer] >>  /x1/jenkins/jenkins-slave/workspace/Hive-0.9.1-SNAPSHOT-h0.21-keepgoing=false/hive/build/ivy/lib/default/hive-serde-0.9.1-SNAPSHOT.jar
[datanucleusenhancer] >>  /x1/jenkins/jenkins-slave/workspace/Hive-0.9.1-SNAPSHOT-h0.21-keepgoing=false/hive/build/ivy/lib/default/hive-shims-0.9.1-SNAPSHOT.jar
[datanucleusenhancer] >>  /x1/jenkins/jenkins-slave/workspace/Hive-0.9.1-SNAPSHOT-h0.21-keepgoing=false/hive/build/ivy/lib/default/jackson-core-asl-1.8.8.jar
[datanucleusenhancer] >>  /x1/jenkins/jenkins-slave/workspace/Hive-0.9.1-SNAPSHOT-h0.21-keepgoing=false/hive/build/ivy/lib/default/jackson-mapper-asl-1.8.8.jar
[datanucleusenhancer] >>  /x1/jenkins/jenkins-slave/workspace/Hive-0.9.1-SNAPSHOT-h0.21-keepgoing=false/hive/build/ivy/lib/default/jdo2-api-2.3-ec.jar
[datanucleusenhancer] >>  /x1/jenkins/jenkins-slave/workspace/Hive-0.9.1-SNAPSHOT-h0.21-keepgoing=false/hive/build/ivy/lib/default/libfb303-0.7.0.jar
[datanucleusenhancer] >>  /x1/jenkins/jenkins-slave/workspace/Hive-0.9.1-SNAPSHOT-h0.21-keepgoing=false/hive/build/ivy/lib/default/libthrift-0.7.0.jar
[datanucleusenhancer] >>  /x1/jenkins/jenkins-slave/workspace/Hive-0.9.1-SNAPSHOT-h0.21-keepgoing=false/hive/build/ivy/lib/default/log4j-1.2.16.jar
[datanucleusenhancer] >>  /x1/jenkins/jenkins-slave/workspace/Hive-0.9.1-SNAPSHOT-h0.21-keepgoing=false/hive/build/ivy/lib/default/mockito-all-1.8.2.jar
[datanucleusenhancer] >>  /x1/jenkins/jenkins-slave/workspace/Hive-0.9.1-SNAPSHOT-h0.21-keepgoing=false/hive/build/ivy/lib/default/slf4j-api-1.6.1.jar
[datanucleusenhancer] >>  /x1/jenkins/jenkins-slave/workspace/Hive-0.9.1-SNAPSHOT-h0.21-keepgoing=false/hive/build/ivy/lib/default/slf4j-log4j12-1.6.1.jar
[datanucleusenhancer] >>  /x1/jenkins/jenkins-slave/workspace/Hive-0.9.1-SNAPSHOT-h0.21-keepgoing=false/hive/build/ivy/lib/default/stringtemplate-3.1-b1.jar
[datanucleusenhancer] >>  /x1/jenkins/jenkins-slave/workspace/Hive-0.9.1-SNAPSHOT-h0.21-keepgoing=false/hive/build/ivy/lib/default/velocity-1.5.jar
[datanucleusenhancer] >>  /x1/jenkins/jenkins-slave/workspace/Hive-0.9.1-SNAPSHOT-h0.21-keepgoing=false/hive/build/ivy/lib/default/zookeeper-3.4.3.jar
[datanucleusenhancer] ENHANCED (PersistenceCapable) : org.apache.hadoop.hive.metastore.model.MDatabase
[datanucleusenhancer] ENHANCED (PersistenceCapable) : org.apache.hadoop.hive.metastore.model.MFieldSchema
[datanucleusenhancer] ENHANCED (PersistenceCapable) : org.apache.hadoop.hive.metastore.model.MType
[datanucleusenhancer] ENHANCED (PersistenceCapable) : org.apache.hadoop.hive.metastore.model.MTable
[datanucleusenhancer] ENHANCED (PersistenceCapable) : org.apache.hadoop.hive.metastore.model.MSerDeInfo
[datanucleusenhancer] ENHANCED (PersistenceCapable) : org.apache.hadoop.hive.metastore.model.MOrder
[datanucleusenhancer] ENHANCED (PersistenceCapable) : org.apache.hadoop.hive.metastore.model.MColumnDescriptor
[datanucleusenhancer] ENHANCED (PersistenceCapable) : org.apache.hadoop.hive.metastore.model.MStorageDescriptor
[datanucleusenhancer] ENHANCED (PersistenceCapable) : org.apache.hadoop.hive.metastore.model.MPartition
[datanucleusenhancer] ENHANCED (PersistenceCapable) : org.apache.hadoop.hive.metastore.model.MIndex
[datanucleusenhancer] ENHANCED (PersistenceCapable) : org.apache.hadoop.hive.metastore.model.MRole
[datanucleusenhancer] ENHANCED (PersistenceCapable) : org.apache.hadoop.hive.metastore.model.MRoleMap
[datanucleusenhancer] ENHANCED (PersistenceCapable) : org.apache.hadoop.hive.metastore.model.MGlobalPrivilege
[datanucleusenhancer] ENHANCED (PersistenceCapable) : org.apache.hadoop.hive.metastore.model.MDBPrivilege
[datanucleusenhancer] ENHANCED (PersistenceCapable) : org.apache.hadoop.hive.metastore.model.MTablePrivilege
[datanucleusenhancer] ENHANCED (PersistenceCapable) : org.apache.hadoop.hive.metastore.model.MPartitionPrivilege
[datanucleusenhancer] ENHANCED (PersistenceCapable) : org.apache.hadoop.hive.metastore.model.MTableColumnPrivilege
[datanucleusenhancer] ENHANCED (PersistenceCapable) : org.apache.hadoop.hive.metastore.model.MPartitionColumnPrivilege
[datanucleusenhancer] ENHANCED (PersistenceCapable) : org.apache.hadoop.hive.metastore.model.MPartitionEvent
[datanucleusenhancer] DataNucleus Enhancer completed with success for 19 classes. Timings
: input=242 ms, enhance=192 ms, total=434 ms. Consult the log for full details

compile:
     [echo] Project: metastore

jar:
     [echo] Project: metastore
      [jar] Building jar: /x1/jenkins/jenkins-slave/workspace/Hive-0.9.1-SNAPSHOT-h0.21-keepgoing=false/hive/build/metastore/hive-metastore-0.9.1-SNAPSHOT.jar
:: delivering :: org.apache.hive#hive-metastore;0.9.1-SNAPSHOT :: 0.9.1-SNAPSHOT :: integration
:: Mon Jul 16 16:05:45 UTC 2012
	delivering ivy file to /x1/jenkins/jenkins-slave/workspace/Hive-0.9.1-SNAPSHOT-h0.21-keepgoing=false/hive/build/metastore/ivy-0.9.1-SNAPSHOT.xml
:: publishing :: org.apache.hive#hive-metastore
	published hive-metastore to /home/jenkins/.ivy2/local/org.apache.hive/hive-metastore/0.9.1-SNAPSHOT/jars/hive-metastore.jar
	published ivy to /home/jenkins/.ivy2/local/org.apache.hive/hive-metastore/0.9.1-SNAPSHOT/ivys/ivy.xml

create-dirs:
     [echo] Project: ql
     [copy] Warning: /x1/jenkins/jenkins-slave/workspace/Hive-0.9.1-SNAPSHOT-h0.21-keepgoing=false/hive/ql/src/test/resources
does not exist.

init:
     [echo] Project: ql

ql-init:
     [echo] Project: ql
    [mkdir] Created dir: /x1/jenkins/jenkins-slave/workspace/Hive-0.9.1-SNAPSHOT-h0.21-keepgoing=false/hive/build/ql/gen/antlr/gen-java/org/apache/hadoop/hive/ql/parse

ivy-init-settings:
     [echo] Project: ql

ivy-resolve:
     [echo] Project: ql
[ivy:resolve] :: loading settings :: file = /x1/jenkins/jenkins-slave/workspace/Hive-0.9.1-SNAPSHOT-h0.21-keepgoing=false/hive/ivy/ivysettings.xml
[ivy:resolve] downloading http://repo1.maven.org/maven2/junit/junit/4.10/junit-4.10.jar ...
[ivy:resolve] ..................................... (247kB)
[ivy:resolve] .. (0kB)
[ivy:resolve] 	[SUCCESSFUL ] junit#junit;4.10!junit.jar (67ms)
[ivy:resolve] downloading http://repo1.maven.org/maven2/org/hamcrest/hamcrest-core/1.1/hamcrest-core-1.1.jar
...
[ivy:resolve] ....... (74kB)
[ivy:resolve] .. (0kB)
[ivy:resolve] 	[SUCCESSFUL ] org.hamcrest#hamcrest-core;1.1!hamcrest-core.jar (39ms)
[ivy:resolve] 
[ivy:resolve] :: problems summary ::
[ivy:resolve] :::: WARNINGS
[ivy:resolve] 	problem while downloading module descriptor: http://repo1.maven.org/maven2/org/json/json/20090211/json-20090211.pom:
/home/jenkins/.ivy2/cache/org.json/json/ivy-20090211.xml.original.part (No such file or directory)
(29ms)
[ivy:resolve] 		module not found: org.json#json;20090211
[ivy:resolve] 	==== local: tried
[ivy:resolve] 	  /home/jenkins/.ivy2/local/org.json/json/20090211/ivys/ivy.xml
[ivy:resolve] 	  -- artifact org.json#json;20090211!json.jar:
[ivy:resolve] 	  /home/jenkins/.ivy2/local/org.json/json/20090211/jars/json.jar
[ivy:resolve] 	==== apache-snapshot: tried
[ivy:resolve] 	  https://repository.apache.org/content/repositories/snapshots/org/json/json/20090211/json-20090211.pom
[ivy:resolve] 	  -- artifact org.json#json;20090211!json.jar:
[ivy:resolve] 	  https://repository.apache.org/content/repositories/snapshots/org/json/json/20090211/json-20090211.jar
[ivy:resolve] 	==== maven2: tried
[ivy:resolve] 	  http://repo1.maven.org/maven2/org/json/json/20090211/json-20090211.pom
[ivy:resolve] 	==== datanucleus-repo: tried
[ivy:resolve] 	  -- artifact org.json#json;20090211!json.jar:
[ivy:resolve] 	  http://www.datanucleus.org/downloads/maven2/org/json/json/20090211/json-20090211.jar
[ivy:resolve] 	==== hadoop-source: tried
[ivy:resolve] 	  -- artifact org.json#json;20090211!json.jar:
[ivy:resolve] 	  http://mirror.facebook.net/facebook/hive-deps/hadoop/core/json-20090211/json-20090211.jar
[ivy:resolve] 	==== hadoop-source2: tried
[ivy:resolve] 	  -- artifact org.json#json;20090211!json.jar:
[ivy:resolve] 	  http://archive.cloudera.com/hive-deps/hadoop/core/json-20090211/json-20090211.jar
[ivy:resolve] 		::::::::::::::::::::::::::::::::::::::::::::::
[ivy:resolve] 		::          UNRESOLVED DEPENDENCIES         ::
[ivy:resolve] 		::::::::::::::::::::::::::::::::::::::::::::::
[ivy:resolve] 		:: org.json#json;20090211: not found
[ivy:resolve] 		::::::::::::::::::::::::::::::::::::::::::::::
[ivy:resolve] 
[ivy:resolve] :: USE VERBOSE OR DEBUG MESSAGE LEVEL FOR MORE DETAILS

BUILD FAILED
/x1/jenkins/jenkins-slave/workspace/Hive-0.9.1-SNAPSHOT-h0.21-keepgoing=false/hive/build.xml:302:
The following error occurred while executing this line:
/x1/jenkins/jenkins-slave/workspace/Hive-0.9.1-SNAPSHOT-h0.21-keepgoing=false/hive/build.xml:152:
The following error occurred while executing this line:
/x1/jenkins/jenkins-slave/workspace/Hive-0.9.1-SNAPSHOT-h0.21-keepgoing=false/hive/build-common.xml:125:
impossible to resolve dependencies:
	resolve failed - see output for details

Total time: 2 minutes 36 seconds
Build step 'Invoke Ant' marked build as failure
Archiving artifacts
Recording test results

Mime
View raw message