hive-dev mailing list archives

Site index · List index
Message view « Date » · « Thread »
Top « Date » · « Thread »
From Apache Jenkins Server <jenk...@builds.apache.org>
Subject Build failed in Jenkins: Hive-0.9.1-SNAPSHOT-h0.21 #45
Date Tue, 12 Jun 2012 16:05:34 GMT
See <https://builds.apache.org/job/Hive-0.9.1-SNAPSHOT-h0.21/45/>

------------------------------------------
[...truncated 5504 lines...]
[ivy:resolve] .. (0kB)
[ivy:resolve] 	[SUCCESSFUL ] org.apache.thrift#libthrift;0.7.0!libthrift.jar (2292ms)
[ivy:resolve] downloading http://repo1.maven.org/maven2/commons-logging/commons-logging/1.0.4/commons-logging-1.0.4.jar
...
[ivy:resolve] ... (37kB)
[ivy:resolve] .. (0kB)
[ivy:resolve] 	[SUCCESSFUL ] commons-logging#commons-logging;1.0.4!commons-logging.jar (1943ms)
[ivy:resolve] downloading http://repo1.maven.org/maven2/commons-logging/commons-logging-api/1.0.4/commons-logging-api-1.0.4.jar
...
[ivy:resolve] ... (25kB)
[ivy:resolve] .. (0kB)
[ivy:resolve] 	[SUCCESSFUL ] commons-logging#commons-logging-api;1.0.4!commons-logging-api.jar
(1750ms)
[ivy:resolve] downloading http://repo1.maven.org/maven2/com/google/guava/guava/r09/guava-r09.jar
...
[ivy:resolve] ................................................... (1117kB)
[ivy:resolve] .. (0kB)
[ivy:resolve] 	[SUCCESSFUL ] com.google.guava#guava;r09!guava.jar (2361ms)
[ivy:resolve] downloading http://repo1.maven.org/maven2/org/codehaus/jackson/jackson-core-asl/1.8.8/jackson-core-asl-1.8.8.jar
...
[ivy:resolve] ........ (222kB)
[ivy:resolve] .. (0kB)
[ivy:resolve] 	[SUCCESSFUL ] org.codehaus.jackson#jackson-core-asl;1.8.8!jackson-core-asl.jar
(2238ms)
[ivy:resolve] downloading http://repo1.maven.org/maven2/org/codehaus/jackson/jackson-mapper-asl/1.8.8/jackson-mapper-asl-1.8.8.jar
...
[ivy:resolve] ....................... (652kB)
[ivy:resolve] .. (0kB)
[ivy:resolve] 	[SUCCESSFUL ] org.codehaus.jackson#jackson-mapper-asl;1.8.8!jackson-mapper-asl.jar
(1619ms)
[ivy:report] Processing <https://builds.apache.org/job/Hive-0.9.1-SNAPSHOT-h0.21/45/artifact/hive/build/ivy/resolution-cache/org.apache.hive-hive-shims-default.xml>
to <https://builds.apache.org/job/Hive-0.9.1-SNAPSHOT-h0.21/45/artifact/hive/build/ivy/report/org.apache.hive-hive-shims-default.html>

ivy-retrieve:
     [echo] Project: shims

compile:
     [echo] Project: shims
     [echo] Building shims 0.20

build_shims:
     [echo] Project: shims
     [echo] Compiling <https://builds.apache.org/job/Hive-0.9.1-SNAPSHOT-h0.21/ws/hive/shims/src/common/java;/home/jenkins/jenkins-slave/workspace/Hive-0.9.1-SNAPSHOT-h0.21/hive/shims/src/0.20/java>
against hadoop 0.20.2 (<https://builds.apache.org/job/Hive-0.9.1-SNAPSHOT-h0.21/45/artifact/hive/build/hadoopcore/hadoop-0.20.2)>

ivy-init-settings:
     [echo] Project: shims

ivy-resolve-hadoop-shim:
     [echo] Project: shims
[ivy:resolve] :: loading settings :: file = <https://builds.apache.org/job/Hive-0.9.1-SNAPSHOT-h0.21/ws/hive/ivy/ivysettings.xml>
[ivy:resolve] downloading http://repo1.maven.org/maven2/org/apache/hadoop/hadoop-core/0.20.2/hadoop-core-0.20.2.jar
...
[ivy:resolve] ..................................................................................................................................................................
(2624kB)
[ivy:resolve] .. (0kB)
[ivy:resolve] 	[SUCCESSFUL ] org.apache.hadoop#hadoop-core;0.20.2!hadoop-core.jar (1623ms)
[ivy:resolve] downloading http://repo1.maven.org/maven2/org/apache/hadoop/hadoop-tools/0.20.2/hadoop-tools-0.20.2.jar
...
[ivy:resolve] .... (68kB)
[ivy:resolve] .. (0kB)
[ivy:resolve] 	[SUCCESSFUL ] org.apache.hadoop#hadoop-tools;0.20.2!hadoop-tools.jar (1973ms)
[ivy:resolve] downloading http://repo1.maven.org/maven2/org/apache/hadoop/hadoop-test/0.20.2/hadoop-test-0.20.2.jar
...
[ivy:resolve] .............................................................. (1527kB)
[ivy:resolve] .. (0kB)
[ivy:resolve] 	[SUCCESSFUL ] org.apache.hadoop#hadoop-test;0.20.2!hadoop-test.jar (2013ms)
[ivy:resolve] downloading http://repo1.maven.org/maven2/commons-cli/commons-cli/1.2/commons-cli-1.2.jar
...
[ivy:resolve] .. (40kB)
[ivy:resolve] .. (0kB)
[ivy:resolve] 	[SUCCESSFUL ] commons-cli#commons-cli;1.2!commons-cli.jar (2045ms)
[ivy:resolve] downloading http://repo1.maven.org/maven2/xmlenc/xmlenc/0.52/xmlenc-0.52.jar
...
[ivy:resolve] .... (14kB)
[ivy:resolve] .. (0kB)
[ivy:resolve] 	[SUCCESSFUL ] xmlenc#xmlenc;0.52!xmlenc.jar (1935ms)
[ivy:resolve] downloading http://repo1.maven.org/maven2/commons-httpclient/commons-httpclient/3.0.1/commons-httpclient-3.0.1.jar
...
[ivy:resolve] ........... (273kB)
[ivy:resolve] .. (0kB)
[ivy:resolve] 	[SUCCESSFUL ] commons-httpclient#commons-httpclient;3.0.1!commons-httpclient.jar
(2501ms)
[ivy:resolve] downloading http://repo1.maven.org/maven2/commons-codec/commons-codec/1.3/commons-codec-1.3.jar
...
[ivy:resolve] ... (45kB)
[ivy:resolve] .. (0kB)
[ivy:resolve] 	[SUCCESSFUL ] commons-codec#commons-codec;1.3!commons-codec.jar (1756ms)
[ivy:resolve] downloading http://repo1.maven.org/maven2/commons-net/commons-net/1.4.1/commons-net-1.4.1.jar
...
[ivy:resolve] ...... (176kB)
[ivy:resolve] .. (0kB)
[ivy:resolve] 	[SUCCESSFUL ] commons-net#commons-net;1.4.1!commons-net.jar (1743ms)
[ivy:resolve] downloading http://repo1.maven.org/maven2/org/mortbay/jetty/jetty/6.1.14/jetty-6.1.14.jar
...
[ivy:resolve] ......................... (504kB)
[ivy:resolve] .. (0kB)
[ivy:resolve] 	[SUCCESSFUL ] org.mortbay.jetty#jetty;6.1.14!jetty.jar (1751ms)
[ivy:resolve] downloading http://repo1.maven.org/maven2/org/mortbay/jetty/jetty-util/6.1.14/jetty-util-6.1.14.jar
...
[ivy:resolve] ..... (159kB)
[ivy:resolve] .. (0kB)
[ivy:resolve] downloading http://repo1.maven.org/maven2/tomcat/jasper-runtime/5.5.12/jasper-runtime-5.5.12.jar
...
[ivy:resolve] .... (74kB)
[ivy:resolve] .. (0kB)
[ivy:resolve] 	[SUCCESSFUL ] tomcat#jasper-runtime;5.5.12!jasper-runtime.jar (1740ms)
[ivy:resolve] downloading http://repo1.maven.org/maven2/tomcat/jasper-compiler/5.5.12/jasper-compiler-5.5.12.jar
...
[ivy:resolve] ............ (395kB)
[ivy:resolve] .. (0kB)
[ivy:resolve] 	[SUCCESSFUL ] tomcat#jasper-compiler;5.5.12!jasper-compiler.jar (1847ms)
[ivy:resolve] downloading http://repo1.maven.org/maven2/org/mortbay/jetty/jsp-api-2.1/6.1.14/jsp-api-2.1-6.1.14.jar
...
[ivy:resolve] ..... (131kB)
[ivy:resolve] .. (0kB)
[ivy:resolve] 	[SUCCESSFUL ] org.mortbay.jetty#jsp-api-2.1;6.1.14!jsp-api-2.1.jar (1935ms)
[ivy:resolve] downloading http://repo1.maven.org/maven2/org/mortbay/jetty/jsp-2.1/6.1.14/jsp-2.1-6.1.14.jar
...
[ivy:resolve] ......................................... (1000kB)
[ivy:resolve] .. (0kB)
[ivy:resolve] 	[SUCCESSFUL ] org.mortbay.jetty#jsp-2.1;6.1.14!jsp-2.1.jar (1742ms)
[ivy:resolve] downloading http://repo1.maven.org/maven2/org/mortbay/jetty/servlet-api-2.5/6.1.14/servlet-api-2.5-6.1.14.jar
...
[ivy:resolve] ..... (129kB)
[ivy:resolve] .. (0kB)
[ivy:resolve] 	[SUCCESSFUL ] org.mortbay.jetty#servlet-api-2.5;6.1.14!servlet-api-2.5.jar
(2240ms)
[ivy:resolve] downloading http://repo1.maven.org/maven2/net/sf/kosmosfs/kfs/0.3/kfs-0.3.jar
...
[ivy:resolve] ... (11kB)
[ivy:resolve] .. (0kB)
[ivy:resolve] 	[SUCCESSFUL ] net.sf.kosmosfs#kfs;0.3!kfs.jar (1750ms)
[ivy:resolve] downloading http://repo1.maven.org/maven2/junit/junit/4.5/junit-4.5.jar ...
[ivy:resolve] ....... (194kB)
[ivy:resolve] .. (0kB)
[ivy:resolve] downloading http://repo1.maven.org/maven2/hsqldb/hsqldb/1.8.0.10/hsqldb-1.8.0.10.jar
...
[ivy:resolve] ............................ (690kB)
[ivy:resolve] .. (0kB)
[ivy:resolve] downloading http://repo1.maven.org/maven2/oro/oro/2.0.8/oro-2.0.8.jar ...
[ivy:resolve] ... (63kB)
[ivy:resolve] .. (0kB)
[ivy:resolve] downloading http://repo1.maven.org/maven2/org/eclipse/jdt/core/3.1.1/core-3.1.1.jar
...
[ivy:resolve] ..............................................................................................................................................................................
(3483kB)
[ivy:resolve] downloading http://repo1.maven.org/maven2/commons-logging/commons-logging/1.0.3/commons-logging-1.0.3.jar
...
[ivy:resolve] .. (30kB)
[ivy:resolve] .. (0kB)
[ivy:resolve] 	[SUCCESSFUL ] commons-logging#commons-logging;1.0.3!commons-logging.jar (2810ms)
[ivy:resolve] downloading http://repo1.maven.org/maven2/ant/ant/1.6.5/ant-1.6.5.jar ...
[ivy:resolve] .................................. (1009kB)
[ivy:resolve] .. (0kB)
[ivy:resolve] 	[SUCCESSFUL ] ant#ant;1.6.5!ant.jar (2156ms)
[ivy:resolve] downloading http://repo1.maven.org/maven2/org/apache/mina/mina-core/2.0.0-M5/mina-core-2.0.0-M5.jar
...
[ivy:resolve] .................... (622kB)
[ivy:resolve] .. (0kB)
[ivy:resolve] 	[SUCCESSFUL ] org.apache.mina#mina-core;2.0.0-M5!mina-core.jar(bundle) (2406ms)
[ivy:resolve] downloading http://repo1.maven.org/maven2/org/apache/ftpserver/ftpserver-deprecated/1.0.0-M2/ftpserver-deprecated-1.0.0-M2.jar
...
[ivy:resolve] ... (31kB)
[ivy:resolve] .. (0kB)
[ivy:resolve] downloading http://repo1.maven.org/maven2/org/slf4j/slf4j-api/1.5.2/slf4j-api-1.5.2.jar
...
[ivy:resolve] ... (16kB)
[ivy:resolve] .. (0kB)
[ivy:resolve] 
[ivy:resolve] :: problems summary ::
[ivy:resolve] :::: WARNINGS
[ivy:resolve] 	impossible to put metadata file in cache: http://repo1.maven.org/maven2/commons-net/commons-net/1.4.1/commons-net-1.4.1.pom
(1.4.1). java.io.FileNotFoundException: /home/jenkins/.ivy2/cache/commons-net/commons-net/ivy-1.4.1.xml.original
(No such file or directory)
[ivy:resolve] 	impossible to put metadata file in cache: http://repo1.maven.org/maven2/oro/oro/2.0.8/oro-2.0.8.pom
(2.0.8). java.io.FileNotFoundException: /home/jenkins/.ivy2/cache/oro/oro/ivy-2.0.8.xml.original
(No such file or directory)
[ivy:resolve] 	impossible to put metadata file in cache: http://repo1.maven.org/maven2/org/mortbay/jetty/jetty-parent/7/jetty-parent-7.pom
(7). java.io.FileNotFoundException: /home/jenkins/.ivy2/cache/org.mortbay.jetty/jetty-parent/ivy-7.xml.original
(No such file or directory)
[ivy:resolve] 	impossible to put metadata file in cache: http://repo1.maven.org/maven2/org/mortbay/jetty/jetty-util/6.1.14/jetty-util-6.1.14.pom
(6.1.14). java.io.FileNotFoundException: /home/jenkins/.ivy2/cache/org.mortbay.jetty/jetty-util/ivy-6.1.14.xml.original
(No such file or directory)
[ivy:resolve] 	impossible to put metadata file in cache: http://repo1.maven.org/maven2/org/mortbay/jetty/servlet-api-2.5/6.1.14/servlet-api-2.5-6.1.14.pom
(6.1.14). java.io.FileNotFoundException: /home/jenkins/.ivy2/cache/org.mortbay.jetty/servlet-api-2.5/ivy-6.1.14.xml.original
(No such file or directory)
[ivy:resolve] 	problem while downloading module descriptor: http://repo1.maven.org/maven2/commons-el/commons-el/1.0/commons-el-1.0.pom:
/home/jenkins/.ivy2/cache/commons-el/commons-el/ivy-1.0.xml.original.part (No such file or
directory) (2002ms)
[ivy:resolve] 		module not found: commons-el#commons-el;1.0
[ivy:resolve] 	==== local: tried
[ivy:resolve] 	  /home/jenkins/.ivy2/local/commons-el/commons-el/1.0/ivys/ivy.xml
[ivy:resolve] 	  -- artifact commons-el#commons-el;1.0!commons-el.jar:
[ivy:resolve] 	  /home/jenkins/.ivy2/local/commons-el/commons-el/1.0/jars/commons-el.jar
[ivy:resolve] 	==== apache-snapshot: tried
[ivy:resolve] 	  https://repository.apache.org/content/repositories/snapshots/commons-el/commons-el/1.0/commons-el-1.0.pom
[ivy:resolve] 	  -- artifact commons-el#commons-el;1.0!commons-el.jar:
[ivy:resolve] 	  https://repository.apache.org/content/repositories/snapshots/commons-el/commons-el/1.0/commons-el-1.0.jar
[ivy:resolve] 	==== maven2: tried
[ivy:resolve] 	  http://repo1.maven.org/maven2/commons-el/commons-el/1.0/commons-el-1.0.pom
[ivy:resolve] 	==== datanucleus-repo: tried
[ivy:resolve] 	  -- artifact commons-el#commons-el;1.0!commons-el.jar:
[ivy:resolve] 	  http://www.datanucleus.org/downloads/maven2/commons-el/commons-el/1.0/commons-el-1.0.jar
[ivy:resolve] 	==== hadoop-source: tried
[ivy:resolve] 	  -- artifact commons-el#commons-el;1.0!commons-el.jar:
[ivy:resolve] 	  http://mirror.facebook.net/facebook/hive-deps/hadoop/core/commons-el-1.0/commons-el-1.0.jar
[ivy:resolve] 	==== hadoop-source2: tried
[ivy:resolve] 	  -- artifact commons-el#commons-el;1.0!commons-el.jar:
[ivy:resolve] 	  http://archive.cloudera.com/hive-deps/hadoop/core/commons-el-1.0/commons-el-1.0.jar
[ivy:resolve] 	problem while downloading module descriptor: http://repo1.maven.org/maven2/net/java/dev/jets3t/jets3t/0.7.1/jets3t-0.7.1.pom:
/home/jenkins/.ivy2/cache/net.java.dev.jets3t/jets3t/ivy-0.7.1.xml.original.part (No such
file or directory) (1999ms)
[ivy:resolve] 		module not found: net.java.dev.jets3t#jets3t;0.7.1
[ivy:resolve] 	==== local: tried
[ivy:resolve] 	  /home/jenkins/.ivy2/local/net.java.dev.jets3t/jets3t/0.7.1/ivys/ivy.xml
[ivy:resolve] 	  -- artifact net.java.dev.jets3t#jets3t;0.7.1!jets3t.jar:
[ivy:resolve] 	  /home/jenkins/.ivy2/local/net.java.dev.jets3t/jets3t/0.7.1/jars/jets3t.jar
[ivy:resolve] 	==== apache-snapshot: tried
[ivy:resolve] 	  https://repository.apache.org/content/repositories/snapshots/net/java/dev/jets3t/jets3t/0.7.1/jets3t-0.7.1.pom
[ivy:resolve] 	  -- artifact net.java.dev.jets3t#jets3t;0.7.1!jets3t.jar:
[ivy:resolve] 	  https://repository.apache.org/content/repositories/snapshots/net/java/dev/jets3t/jets3t/0.7.1/jets3t-0.7.1.jar
[ivy:resolve] 	==== maven2: tried
[ivy:resolve] 	  http://repo1.maven.org/maven2/net/java/dev/jets3t/jets3t/0.7.1/jets3t-0.7.1.pom
[ivy:resolve] 	==== datanucleus-repo: tried
[ivy:resolve] 	  -- artifact net.java.dev.jets3t#jets3t;0.7.1!jets3t.jar:
[ivy:resolve] 	  http://www.datanucleus.org/downloads/maven2/net/java/dev/jets3t/jets3t/0.7.1/jets3t-0.7.1.jar
[ivy:resolve] 	==== hadoop-source: tried
[ivy:resolve] 	  -- artifact net.java.dev.jets3t#jets3t;0.7.1!jets3t.jar:
[ivy:resolve] 	  http://mirror.facebook.net/facebook/hive-deps/hadoop/core/jets3t-0.7.1/jets3t-0.7.1.jar
[ivy:resolve] 	==== hadoop-source2: tried
[ivy:resolve] 	  -- artifact net.java.dev.jets3t#jets3t;0.7.1!jets3t.jar:
[ivy:resolve] 	  http://archive.cloudera.com/hive-deps/hadoop/core/jets3t-0.7.1/jets3t-0.7.1.jar
[ivy:resolve] 	impossible to put metadata file in cache: http://repo1.maven.org/maven2/junit/junit/4.5/junit-4.5.pom
(4.5). java.io.FileNotFoundException: /home/jenkins/.ivy2/cache/junit/junit/ivy-4.5.xml.original
(No such file or directory)
[ivy:resolve] 	impossible to put metadata file in cache: http://repo1.maven.org/maven2/hsqldb/hsqldb/1.8.0.10/hsqldb-1.8.0.10.pom
(1.8.0.10). java.io.FileNotFoundException: /home/jenkins/.ivy2/cache/hsqldb/hsqldb/ivy-1.8.0.10.xml.original
(No such file or directory)
[ivy:resolve] 	impossible to put metadata file in cache: http://repo1.maven.org/maven2/org/apache/hadoop/hadoop-tools/0.20.2/hadoop-tools-0.20.2.pom
(0.20.2). java.io.FileNotFoundException: /home/jenkins/.ivy2/cache/org.apache.hadoop/hadoop-tools/ivy-0.20.2.xml.original
(No such file or directory)
[ivy:resolve] 	impossible to put metadata file in cache: http://repo1.maven.org/maven2/org/apache/hadoop/hadoop-test/0.20.2/hadoop-test-0.20.2.pom
(0.20.2). java.io.FileNotFoundException: /home/jenkins/.ivy2/cache/org.apache.hadoop/hadoop-test/ivy-0.20.2.xml.original
(No such file or directory)
[ivy:resolve] 		[FAILED     ] org.mortbay.jetty#jetty-util;6.1.14!jetty-util.jar: invalid
sha1: expected=1b707d5884e35c9b97114a24aa9ee94ca531fa21 computed=f67d977a7e705ba52b4de7d42cd8d3dc2a42a350
(2000ms)
[ivy:resolve] 		[FAILED     ] org.mortbay.jetty#jetty-util;6.1.14!jetty-util.jar:  (0ms)
[ivy:resolve] 	==== local: tried
[ivy:resolve] 	  /home/jenkins/.ivy2/local/org.mortbay.jetty/jetty-util/6.1.14/jars/jetty-util.jar
[ivy:resolve] 	==== apache-snapshot: tried
[ivy:resolve] 	  https://repository.apache.org/content/repositories/snapshots/org/mortbay/jetty/jetty-util/6.1.14/jetty-util-6.1.14.jar
[ivy:resolve] 	==== maven2: tried
[ivy:resolve] 	  http://repo1.maven.org/maven2/org/mortbay/jetty/jetty-util/6.1.14/jetty-util-6.1.14.jar
[ivy:resolve] 	==== datanucleus-repo: tried
[ivy:resolve] 	  http://www.datanucleus.org/downloads/maven2/org/mortbay/jetty/jetty-util/6.1.14/jetty-util-6.1.14.jar
[ivy:resolve] 	==== hadoop-source: tried
[ivy:resolve] 	  http://mirror.facebook.net/facebook/hive-deps/hadoop/core/jetty-util-6.1.14/jetty-util-6.1.14.jar
[ivy:resolve] 	==== hadoop-source2: tried
[ivy:resolve] 	  http://archive.cloudera.com/hive-deps/hadoop/core/jetty-util-6.1.14/jetty-util-6.1.14.jar
[ivy:resolve] 		[FAILED     ] junit#junit;4.5!junit.jar: invalid sha1: expected=7059d3d3bedc1fca9b33cde8503095b3576a0bba
computed=f4dad09ca60b7c58931ebac9e050575382e79a6a (1999ms)
[ivy:resolve] 		[FAILED     ] junit#junit;4.5!junit.jar:  (0ms)
[ivy:resolve] 	==== local: tried
[ivy:resolve] 	  /home/jenkins/.ivy2/local/junit/junit/4.5/jars/junit.jar
[ivy:resolve] 	==== apache-snapshot: tried
[ivy:resolve] 	  https://repository.apache.org/content/repositories/snapshots/junit/junit/4.5/junit-4.5.jar
[ivy:resolve] 	==== maven2: tried
[ivy:resolve] 	  http://repo1.maven.org/maven2/junit/junit/4.5/junit-4.5.jar
[ivy:resolve] 	==== datanucleus-repo: tried
[ivy:resolve] 	  http://www.datanucleus.org/downloads/maven2/junit/junit/4.5/junit-4.5.jar
[ivy:resolve] 	==== hadoop-source: tried
[ivy:resolve] 	  http://mirror.facebook.net/facebook/hive-deps/hadoop/core/junit-4.5/junit-4.5.jar
[ivy:resolve] 	==== hadoop-source2: tried
[ivy:resolve] 	  http://archive.cloudera.com/hive-deps/hadoop/core/junit-4.5/junit-4.5.jar
[ivy:resolve] 		[FAILED     ] hsqldb#hsqldb;1.8.0.10!hsqldb.jar: /home/jenkins/.ivy2/cache/hsqldb/hsqldb/jars/hsqldb-1.8.0.10.jar.part
(No such file or directory) (2603ms)
[ivy:resolve] 		[FAILED     ] oro#oro;2.0.8!oro.jar: /home/jenkins/.ivy2/cache/oro/oro/jars/oro-2.0.8.jar.part
(No such file or directory) (1816ms)
[ivy:resolve] 		[FAILED     ] org.eclipse.jdt#core;3.1.1!core.jar: Downloaded file size doesn't
match expected Content Length for http://repo1.maven.org/maven2/org/eclipse/jdt/core/3.1.1/core-3.1.1.jar.
Please retry. (1495ms)
[ivy:resolve] 		[FAILED     ] org.apache.ftpserver#ftpserver-deprecated;1.0.0-M2!ftpserver-deprecated.jar:
/home/jenkins/.ivy2/cache/org.apache.ftpserver/ftpserver-deprecated/jars/ftpserver-deprecated-1.0.0-M2.jar.part
(No such file or directory) (1991ms)
[ivy:resolve] 		[FAILED     ] org.slf4j#slf4j-api;1.5.2!slf4j-api.jar: /home/jenkins/.ivy2/cache/org.slf4j/slf4j-api/jars/slf4j-api-1.5.2.jar.part
(No such file or directory) (2004ms)
[ivy:resolve] 		::::::::::::::::::::::::::::::::::::::::::::::
[ivy:resolve] 		::          UNRESOLVED DEPENDENCIES         ::
[ivy:resolve] 		::::::::::::::::::::::::::::::::::::::::::::::
[ivy:resolve] 		:: commons-el#commons-el;1.0: not found
[ivy:resolve] 		:: net.java.dev.jets3t#jets3t;0.7.1: not found
[ivy:resolve] 		::::::::::::::::::::::::::::::::::::::::::::::
[ivy:resolve] 		::::::::::::::::::::::::::::::::::::::::::::::
[ivy:resolve] 		::              FAILED DOWNLOADS            ::
[ivy:resolve] 		:: ^ see resolution messages for details  ^ ::
[ivy:resolve] 		::::::::::::::::::::::::::::::::::::::::::::::
[ivy:resolve] 		:: org.mortbay.jetty#jetty-util;6.1.14!jetty-util.jar
[ivy:resolve] 		:: junit#junit;4.5!junit.jar
[ivy:resolve] 		::::::::::::::::::::::::::::::::::::::::::::::
[ivy:resolve] 
[ivy:resolve] :: USE VERBOSE OR DEBUG MESSAGE LEVEL FOR MORE DETAILS

BUILD FAILED
<https://builds.apache.org/job/Hive-0.9.1-SNAPSHOT-h0.21/ws/hive/build.xml>:302: The
following error occurred while executing this line:
<https://builds.apache.org/job/Hive-0.9.1-SNAPSHOT-h0.21/ws/hive/build.xml>:152: The
following error occurred while executing this line:
<https://builds.apache.org/job/Hive-0.9.1-SNAPSHOT-h0.21/ws/hive/shims/build.xml>:85:
The following error occurred while executing this line:
<https://builds.apache.org/job/Hive-0.9.1-SNAPSHOT-h0.21/ws/hive/shims/build.xml>:88:
The following error occurred while executing this line:
<https://builds.apache.org/job/Hive-0.9.1-SNAPSHOT-h0.21/ws/hive/shims/build.xml>:60:
The following error occurred while executing this line:
<https://builds.apache.org/job/Hive-0.9.1-SNAPSHOT-h0.21/ws/hive/build-common.xml>:164:
impossible to resolve dependencies:
	resolve failed - see output for details

Total time: 3 minutes 58 seconds
Build step 'Invoke Ant' marked build as failure
Archiving artifacts
Recording test results

Mime
View raw message