hive-dev mailing list archives

Site index · List index
Message view « Date » · « Thread »
Top « Date » · « Thread »
From Apache Jenkins Server <jenk...@builds.apache.org>
Subject Build failed in Jenkins: Hive-0.9.1-SNAPSHOT-h0.21 #51
Date Mon, 18 Jun 2012 16:12:04 GMT
See <https://builds.apache.org/job/Hive-0.9.1-SNAPSHOT-h0.21/51/>

------------------------------------------
[...truncated 5827 lines...]
[ivy:resolve] .. (0kB)
[ivy:resolve] 	[SUCCESSFUL ] tomcat#jasper-runtime;5.5.23!jasper-runtime.jar (1746ms)
[ivy:resolve] downloading http://repo1.maven.org/maven2/javax/servlet/jsp/jsp-api/2.1/jsp-api-2.1.jar
...
[ivy:resolve] ............ (98kB)
[ivy:resolve] .. (0kB)
[ivy:resolve] 	[SUCCESSFUL ] javax.servlet.jsp#jsp-api;2.1!jsp-api.jar (1747ms)
[ivy:resolve] downloading http://repo1.maven.org/maven2/commons-logging/commons-logging-api/1.1/commons-logging-api-1.1.jar
...
[ivy:resolve] ....... (43kB)
[ivy:resolve] .. (0kB)
[ivy:resolve] 	[SUCCESSFUL ] commons-logging#commons-logging-api;1.1!commons-logging-api.jar
(1747ms)
[ivy:resolve] downloading http://repo1.maven.org/maven2/log4j/log4j/1.2.15/log4j-1.2.15.jar
...
[ivy:resolve] .................................... (382kB)
[ivy:resolve] .. (0kB)
[ivy:resolve] 	[SUCCESSFUL ] log4j#log4j;1.2.15!log4j.jar (2002ms)
[ivy:resolve] downloading http://repo1.maven.org/maven2/net/java/dev/jets3t/jets3t/0.6.1/jets3t-0.6.1.jar
...
[ivy:resolve] ....................... (314kB)
[ivy:resolve] .. (0kB)
[ivy:resolve] 	[SUCCESSFUL ] net.java.dev.jets3t#jets3t;0.6.1!jets3t.jar (1747ms)
[ivy:resolve] downloading http://repo1.maven.org/maven2/commons-lang/commons-lang/2.5/commons-lang-2.5.jar
...
[ivy:resolve] .......................... (272kB)
[ivy:resolve] .. (0kB)
[ivy:resolve] 	[SUCCESSFUL ] commons-lang#commons-lang;2.5!commons-lang.jar (2499ms)
[ivy:resolve] downloading http://repo1.maven.org/maven2/hsqldb/hsqldb/1.8.0.7/hsqldb-1.8.0.7.jar
...
[ivy:resolve] ........................................................... (628kB)
[ivy:resolve] .. (0kB)
[ivy:resolve] 	[SUCCESSFUL ] hsqldb#hsqldb;1.8.0.7!hsqldb.jar (2250ms)
[ivy:resolve] downloading http://repo1.maven.org/maven2/org/slf4j/slf4j-api/1.6.1/slf4j-api-1.6.1.jar
...
[ivy:resolve] .. (24kB)
[ivy:resolve] .. (0kB)
[ivy:resolve] 	[SUCCESSFUL ] org.slf4j#slf4j-api;1.6.1!slf4j-api.jar (1740ms)
[ivy:resolve] downloading http://repo1.maven.org/maven2/org/slf4j/slf4j-log4j12/1.6.1/slf4j-log4j12-1.6.1.jar
...
[ivy:resolve] ... (9kB)
[ivy:resolve] .. (0kB)
[ivy:resolve] 	[SUCCESSFUL ] org.slf4j#slf4j-log4j12;1.6.1!slf4j-log4j12.jar (1763ms)
[ivy:resolve] downloading http://repo1.maven.org/maven2/org/aspectj/aspectjrt/1.6.5/aspectjrt-1.6.5.jar
...
[ivy:resolve] ................... (113kB)
[ivy:resolve] .. (0kB)
[ivy:resolve] 	[SUCCESSFUL ] org.aspectj#aspectjrt;1.6.5!aspectjrt.jar (2234ms)
[ivy:resolve] downloading http://repo1.maven.org/maven2/org/apache/avro/avro/1.5.3/avro-1.5.3.jar
...
[ivy:resolve] ..................... (257kB)
[ivy:resolve] .. (0kB)
[ivy:resolve] 	[SUCCESSFUL ] org.apache.avro#avro;1.5.3!avro.jar (2251ms)
[ivy:resolve] downloading http://repo1.maven.org/maven2/org/apache/avro/avro-ipc/1.5.3/avro-ipc-1.5.3.jar
...
[ivy:resolve] ................ (164kB)
[ivy:resolve] .. (0kB)
[ivy:resolve] 	[SUCCESSFUL ] org.apache.avro#avro-ipc;1.5.3!avro-ipc.jar (2000ms)
[ivy:resolve] downloading http://repo1.maven.org/maven2/com/google/protobuf/protobuf-java/2.4.0a/protobuf-java-2.4.0a.jar
...
[ivy:resolve] .......................................... (439kB)
[ivy:resolve] .. (0kB)
[ivy:resolve] 	[SUCCESSFUL ] com.google.protobuf#protobuf-java;2.4.0a!protobuf-java.jar (1997ms)
[ivy:resolve] downloading http://repo1.maven.org/maven2/org/apache/hadoop/hadoop-auth/0.23.1/hadoop-auth-0.23.1.jar
...
[ivy:resolve] ... (41kB)
[ivy:resolve] .. (0kB)
[ivy:resolve] 	[SUCCESSFUL ] org.apache.hadoop#hadoop-auth;0.23.1!hadoop-auth.jar (1494ms)
[ivy:resolve] downloading http://repo1.maven.org/maven2/com/googlecode/json-simple/json-simple/1.1/json-simple-1.1.jar
...
[ivy:resolve] ... (15kB)
[ivy:resolve] .. (0kB)
[ivy:resolve] 	[SUCCESSFUL ] com.googlecode.json-simple#json-simple;1.1!json-simple.jar (1999ms)
[ivy:resolve] downloading http://repo1.maven.org/maven2/org/codehaus/jettison/jettison/1.1/jettison-1.1.jar
...
[ivy:resolve] ... (66kB)
[ivy:resolve] .. (0kB)
[ivy:resolve] 	[SUCCESSFUL ] org.codehaus.jettison#jettison;1.1!jettison.jar(bundle) (1997ms)
[ivy:resolve] downloading http://repo1.maven.org/maven2/com/sun/xml/bind/jaxb-impl/2.2.3-1/jaxb-impl-2.2.3-1.jar
...
[ivy:resolve] ................................................................ (869kB)
[ivy:resolve] .. (0kB)
[ivy:resolve] downloading http://repo1.maven.org/maven2/org/codehaus/jackson/jackson-core-asl/1.7.1/jackson-core-asl-1.7.1.jar
...
[ivy:resolve] ................ (202kB)
[ivy:resolve] .. (0kB)
[ivy:resolve] 	[SUCCESSFUL ] org.codehaus.jackson#jackson-core-asl;1.7.1!jackson-core-asl.jar
(1257ms)
[ivy:resolve] downloading http://repo1.maven.org/maven2/org/codehaus/jackson/jackson-jaxrs/1.7.1/jackson-jaxrs-1.7.1.jar
...
[ivy:resolve] .. (17kB)
[ivy:resolve] .. (0kB)
[ivy:resolve] 	[SUCCESSFUL ] org.codehaus.jackson#jackson-jaxrs;1.7.1!jackson-jaxrs.jar (1995ms)
[ivy:resolve] downloading http://repo1.maven.org/maven2/org/codehaus/jackson/jackson-xc/1.7.1/jackson-xc-1.7.1.jar
...
[ivy:resolve] ....... (30kB)
[ivy:resolve] .. (0kB)
[ivy:resolve] 	[SUCCESSFUL ] org.codehaus.jackson#jackson-xc;1.7.1!jackson-xc.jar (1999ms)
[ivy:resolve] downloading http://repo1.maven.org/maven2/stax/stax-api/1.0.1/stax-api-1.0.1.jar
...
[ivy:resolve] ........ (25kB)
[ivy:resolve] .. (0kB)
[ivy:resolve] 	[SUCCESSFUL ] stax#stax-api;1.0.1!stax-api.jar (1999ms)
[ivy:resolve] downloading http://repo1.maven.org/maven2/javax/xml/bind/jaxb-api/2.2.2/jaxb-api-2.2.2.jar
...
[ivy:resolve] ............. (102kB)
[ivy:resolve] .. (0kB)
[ivy:resolve] 	[SUCCESSFUL ] javax.xml.bind#jaxb-api;2.2.2!jaxb-api.jar (2249ms)
[ivy:resolve] downloading http://repo1.maven.org/maven2/javax/activation/activation/1.1/activation-1.1.jar
...
[ivy:resolve] .......... (61kB)
[ivy:resolve] .. (0kB)
[ivy:resolve] 	[SUCCESSFUL ] javax.activation#activation;1.1!activation.jar (2000ms)
[ivy:resolve] downloading http://repo1.maven.org/maven2/com/thoughtworks/paranamer/paranamer/2.3/paranamer-2.3.jar
...
[ivy:resolve] ....... (28kB)
[ivy:resolve] .. (0kB)
[ivy:resolve] 	[SUCCESSFUL ] com.thoughtworks.paranamer#paranamer;2.3!paranamer.jar (1997ms)
[ivy:resolve] downloading http://repo1.maven.org/maven2/org/xerial/snappy/snappy-java/1.0.3.2/snappy-java-1.0.3.2.jar
...
[ivy:resolve] ....................................................................... (972kB)
[ivy:resolve] .. (0kB)
[ivy:resolve] downloading http://repo1.maven.org/maven2/org/jboss/netty/netty/3.2.3.Final/netty-3.2.3.Final.jar
...
[ivy:resolve] .......................................................................................
(767kB)
[ivy:resolve] .. (0kB)
[ivy:resolve] 	[SUCCESSFUL ] org.jboss.netty#netty;3.2.3.Final!netty.jar(bundle) (2107ms)
[ivy:resolve] downloading http://repo1.maven.org/maven2/org/apache/velocity/velocity/1.7/velocity-1.7.jar
...
[ivy:resolve] ....................................... (438kB)
[ivy:resolve] .. (0kB)
[ivy:resolve] 	[SUCCESSFUL ] org.apache.velocity#velocity;1.7!velocity.jar (1746ms)
[ivy:resolve] downloading http://repo1.maven.org/maven2/org/apache/hadoop/hadoop-yarn-common/0.23.1/hadoop-yarn-common-0.23.1.jar
...
[ivy:resolve] .....................................................................................
(1056kB)
[ivy:resolve] .. (0kB)
[ivy:resolve] downloading http://repo1.maven.org/maven2/org/apache/hadoop/hadoop-annotations/0.23.1/hadoop-annotations-0.23.1.jar
...
[ivy:resolve] ... (16kB)
[ivy:resolve] .. (0kB)
[ivy:resolve] downloading http://repo1.maven.org/maven2/com/google/inject/extensions/guice-servlet/3.0/guice-servlet-3.0.jar
...
[ivy:resolve] .......... (63kB)
[ivy:resolve] .. (0kB)
[ivy:resolve] downloading http://repo1.maven.org/maven2/junit/junit/4.8.2/junit-4.8.2.jar
...
[ivy:resolve] .......................... (231kB)
[ivy:resolve] .. (0kB)
[ivy:resolve] 	[SUCCESSFUL ] junit#junit;4.8.2!junit.jar (1750ms)
[ivy:resolve] downloading http://repo1.maven.org/maven2/com/cenqua/clover/clover/3.0.2/clover-3.0.2.jar
...
[ivy:resolve] .........................................................................................................................................................................................................................................................................................................................................................................................................................................................................................................................................................................................................................................................................................................................................................................................................................
(11446kB)
[ivy:resolve] .. (0kB)
[ivy:resolve] downloading http://repo1.maven.org/maven2/org/apache/hadoop/hadoop-yarn-api/0.23.1/hadoop-yarn-api-0.23.1.jar
...
[ivy:resolve] .......................................................................................................................................................
[ivy:resolve] ................
[ivy:resolve] ................
[ivy:resolve] ................
[ivy:resolve] ..... (870kB)
[ivy:resolve] downloading http://repo1.maven.org/maven2/com/sun/jersey/jersey-test-framework/jersey-test-framework-grizzly2/1.8/jersey-test-framework-grizzly2-1.8.jar
...
[ivy:resolve] ..... (12kB)
[ivy:resolve] .. (0kB)
[ivy:resolve] downloading http://repo1.maven.org/maven2/com/sun/jersey/contribs/jersey-guice/1.8/jersey-guice-1.8.jar
...
[ivy:resolve] ..... (14kB)
[ivy:resolve] .. (0kB)
[ivy:resolve] 	[SUCCESSFUL ] com.sun.jersey.contribs#jersey-guice;1.8!jersey-guice.jar (2003ms)
[ivy:resolve] downloading http://repo1.maven.org/maven2/jdiff/jdiff/1.0.9/jdiff-1.0.9.jar
...
[ivy:resolve] .............. (126kB)
[ivy:resolve] .. (0kB)
[ivy:resolve] 	[SUCCESSFUL ] jdiff#jdiff;1.0.9!jdiff.jar (1995ms)
[ivy:resolve] downloading http://repo1.maven.org/maven2/javax/inject/javax.inject/1/javax.inject-1.jar
...
[ivy:resolve] .. (2kB)
[ivy:resolve] .. (0kB)
[ivy:resolve] 	[SUCCESSFUL ] javax.inject#javax.inject;1!javax.inject.jar (1998ms)
[ivy:resolve] downloading http://repo1.maven.org/maven2/aopalliance/aopalliance/1.0/aopalliance-1.0.jar
...
[ivy:resolve] ... (4kB)
[ivy:resolve] .. (0kB)
[ivy:resolve] 	[SUCCESSFUL ] aopalliance#aopalliance;1.0!aopalliance.jar (1998ms)
[ivy:resolve] downloading http://repo1.maven.org/maven2/org/sonatype/sisu/inject/cglib/2.2.1-v20090111/cglib-2.2.1-v20090111.jar
...
[ivy:resolve] .............................. (272kB)
[ivy:resolve] .. (0kB)
[ivy:resolve] 	[SUCCESSFUL ] org.sonatype.sisu.inject#cglib;2.2.1-v20090111!cglib.jar (2270ms)
[ivy:resolve] 
[ivy:resolve] :: problems summary ::
[ivy:resolve] :::: WARNINGS
[ivy:resolve] 	problem while downloading module descriptor: http://repo1.maven.org/maven2/asm/asm/3.2/asm-3.2.pom:
/home/jenkins/.ivy2/cache/asm/asm/ivy-3.2.xml.original.part (No such file or directory) (1426ms)
[ivy:resolve] 		module not found: asm#asm;3.2
[ivy:resolve] 	==== local: tried
[ivy:resolve] 	  /home/jenkins/.ivy2/local/asm/asm/3.2/ivys/ivy.xml
[ivy:resolve] 	  -- artifact asm#asm;3.2!asm.jar:
[ivy:resolve] 	  /home/jenkins/.ivy2/local/asm/asm/3.2/jars/asm.jar
[ivy:resolve] 	==== apache-snapshot: tried
[ivy:resolve] 	  https://repository.apache.org/content/repositories/snapshots/asm/asm/3.2/asm-3.2.pom
[ivy:resolve] 	  -- artifact asm#asm;3.2!asm.jar:
[ivy:resolve] 	  https://repository.apache.org/content/repositories/snapshots/asm/asm/3.2/asm-3.2.jar
[ivy:resolve] 	==== maven2: tried
[ivy:resolve] 	  http://repo1.maven.org/maven2/asm/asm/3.2/asm-3.2.pom
[ivy:resolve] 	==== datanucleus-repo: tried
[ivy:resolve] 	  -- artifact asm#asm;3.2!asm.jar:
[ivy:resolve] 	  http://www.datanucleus.org/downloads/maven2/asm/asm/3.2/asm-3.2.jar
[ivy:resolve] 	==== hadoop-source: tried
[ivy:resolve] 	  -- artifact asm#asm;3.2!asm.jar:
[ivy:resolve] 	  http://mirror.facebook.net/facebook/hive-deps/hadoop/core/asm-3.2/asm-3.2.jar
[ivy:resolve] 	==== hadoop-source2: tried
[ivy:resolve] 	  -- artifact asm#asm;3.2!asm.jar:
[ivy:resolve] 	  http://archive.cloudera.com/hive-deps/hadoop/core/asm-3.2/asm-3.2.jar
[ivy:resolve] 		[FAILED     ] com.sun.xml.bind#jaxb-impl;2.2.3-1!jaxb-impl.jar: invalid sha1:
expected=56baae106392040a45a06d4a41099173425da1e6 computed=d87a929093e4c2a3f83c8678b30cc3f3ef13453a
(2500ms)
[ivy:resolve] 		[FAILED     ] com.sun.xml.bind#jaxb-impl;2.2.3-1!jaxb-impl.jar:  (0ms)
[ivy:resolve] 	==== local: tried
[ivy:resolve] 	  /home/jenkins/.ivy2/local/com.sun.xml.bind/jaxb-impl/2.2.3-1/jars/jaxb-impl.jar
[ivy:resolve] 	==== apache-snapshot: tried
[ivy:resolve] 	  https://repository.apache.org/content/repositories/snapshots/com/sun/xml/bind/jaxb-impl/2.2.3-1/jaxb-impl-2.2.3-1.jar
[ivy:resolve] 	==== maven2: tried
[ivy:resolve] 	  http://repo1.maven.org/maven2/com/sun/xml/bind/jaxb-impl/2.2.3-1/jaxb-impl-2.2.3-1.jar
[ivy:resolve] 	==== datanucleus-repo: tried
[ivy:resolve] 	  http://www.datanucleus.org/downloads/maven2/com/sun/xml/bind/jaxb-impl/2.2.3-1/jaxb-impl-2.2.3-1.jar
[ivy:resolve] 	==== hadoop-source: tried
[ivy:resolve] 	  http://mirror.facebook.net/facebook/hive-deps/hadoop/core/jaxb-impl-2.2.3-1/jaxb-impl-2.2.3-1.jar
[ivy:resolve] 	==== hadoop-source2: tried
[ivy:resolve] 	  http://archive.cloudera.com/hive-deps/hadoop/core/jaxb-impl-2.2.3-1/jaxb-impl-2.2.3-1.jar
[ivy:resolve] 		[FAILED     ] org.xerial.snappy#snappy-java;1.0.3.2!snappy-java.jar(bundle):
invalid sha1: expected=ac128161763df895bd34b88487f3bb3eb68c50a4 computed=6b071122d538244f73f6ac6f9cbeeab55df56ef7
(2498ms)
[ivy:resolve] 		[FAILED     ] org.xerial.snappy#snappy-java;1.0.3.2!snappy-java.jar(bundle):
 (0ms)
[ivy:resolve] 	==== local: tried
[ivy:resolve] 	  /home/jenkins/.ivy2/local/org.xerial.snappy/snappy-java/1.0.3.2/bundles/snappy-java.jar
[ivy:resolve] 	==== apache-snapshot: tried
[ivy:resolve] 	  https://repository.apache.org/content/repositories/snapshots/org/xerial/snappy/snappy-java/1.0.3.2/snappy-java-1.0.3.2.jar
[ivy:resolve] 	==== maven2: tried
[ivy:resolve] 	  http://repo1.maven.org/maven2/org/xerial/snappy/snappy-java/1.0.3.2/snappy-java-1.0.3.2.jar
[ivy:resolve] 	==== datanucleus-repo: tried
[ivy:resolve] 	  http://www.datanucleus.org/downloads/maven2/org/xerial/snappy/snappy-java/1.0.3.2/snappy-java-1.0.3.2.jar
[ivy:resolve] 	==== hadoop-source: tried
[ivy:resolve] 	  http://mirror.facebook.net/facebook/hive-deps/hadoop/core/snappy-java-1.0.3.2/snappy-java-1.0.3.2.jar
[ivy:resolve] 	==== hadoop-source2: tried
[ivy:resolve] 	  http://archive.cloudera.com/hive-deps/hadoop/core/snappy-java-1.0.3.2/snappy-java-1.0.3.2.jar
[ivy:resolve] 		[FAILED     ] org.apache.hadoop#hadoop-yarn-common;0.23.1!hadoop-yarn-common.jar:
/home/jenkins/.ivy2/cache/org.apache.hadoop/hadoop-yarn-common/jars/hadoop-yarn-common-0.23.1.jar.part
(No such file or directory) (2246ms)
[ivy:resolve] 		[FAILED     ] org.apache.hadoop#hadoop-annotations;0.23.1!hadoop-annotations.jar:
/home/jenkins/.ivy2/cache/org.apache.hadoop/hadoop-annotations/jars/hadoop-annotations-0.23.1.jar.part
(No such file or directory) (1998ms)
[ivy:resolve] 		[FAILED     ] com.google.inject.extensions#guice-servlet;3.0!guice-servlet.jar:
/home/jenkins/.ivy2/cache/com.google.inject.extensions/guice-servlet/jars/guice-servlet-3.0.jar.part
(No such file or directory) (1998ms)
[ivy:resolve] 		[FAILED     ] com.cenqua.clover#clover;3.0.2!clover.jar: invalid sha1: expected=480225ed7ba7249347465456fcd8227f7bff2df2
computed=0a307e333c0df3a1641a23d0ed1f04c26718f0af (2080ms)
[ivy:resolve] 		[FAILED     ] com.cenqua.clover#clover;3.0.2!clover.jar:  (0ms)
[ivy:resolve] 	==== local: tried
[ivy:resolve] 	  /home/jenkins/.ivy2/local/com.cenqua.clover/clover/3.0.2/jars/clover.jar
[ivy:resolve] 	==== apache-snapshot: tried
[ivy:resolve] 	  https://repository.apache.org/content/repositories/snapshots/com/cenqua/clover/clover/3.0.2/clover-3.0.2.jar
[ivy:resolve] 	==== maven2: tried
[ivy:resolve] 	  http://repo1.maven.org/maven2/com/cenqua/clover/clover/3.0.2/clover-3.0.2.jar
[ivy:resolve] 	==== datanucleus-repo: tried
[ivy:resolve] 	  http://www.datanucleus.org/downloads/maven2/com/cenqua/clover/clover/3.0.2/clover-3.0.2.jar
[ivy:resolve] 	==== hadoop-source: tried
[ivy:resolve] 	  http://mirror.facebook.net/facebook/hive-deps/hadoop/core/clover-3.0.2/clover-3.0.2.jar
[ivy:resolve] 	==== hadoop-source2: tried
[ivy:resolve] 	  http://archive.cloudera.com/hive-deps/hadoop/core/clover-3.0.2/clover-3.0.2.jar
[ivy:resolve] 		[FAILED     ] org.apache.hadoop#hadoop-yarn-api;0.23.1!hadoop-yarn-api.jar:
Downloaded file size doesn't match expected Content Length for http://repo1.maven.org/maven2/org/apache/hadoop/hadoop-yarn-api/0.23.1/hadoop-yarn-api-0.23.1.jar.
Please retry. (6717ms)
[ivy:resolve] 		[FAILED     ] com.sun.jersey.jersey-test-framework#jersey-test-framework-grizzly2;1.8!jersey-test-framework-grizzly2.jar:
/home/jenkins/.ivy2/cache/com.sun.jersey.jersey-test-framework/jersey-test-framework-grizzly2/jars/jersey-test-framework-grizzly2-1.8.jar.part
(No such file or directory) (1962ms)
[ivy:resolve] 		::::::::::::::::::::::::::::::::::::::::::::::
[ivy:resolve] 		::          UNRESOLVED DEPENDENCIES         ::
[ivy:resolve] 		::::::::::::::::::::::::::::::::::::::::::::::
[ivy:resolve] 		:: asm#asm;3.2: not found
[ivy:resolve] 		::::::::::::::::::::::::::::::::::::::::::::::
[ivy:resolve] 		::::::::::::::::::::::::::::::::::::::::::::::
[ivy:resolve] 		::              FAILED DOWNLOADS            ::
[ivy:resolve] 		:: ^ see resolution messages for details  ^ ::
[ivy:resolve] 		::::::::::::::::::::::::::::::::::::::::::::::
[ivy:resolve] 		:: com.sun.xml.bind#jaxb-impl;2.2.3-1!jaxb-impl.jar
[ivy:resolve] 		:: org.xerial.snappy#snappy-java;1.0.3.2!snappy-java.jar(bundle)
[ivy:resolve] 		:: com.cenqua.clover#clover;3.0.2!clover.jar
[ivy:resolve] 		::::::::::::::::::::::::::::::::::::::::::::::
[ivy:resolve] 
[ivy:resolve] :: USE VERBOSE OR DEBUG MESSAGE LEVEL FOR MORE DETAILS

BUILD FAILED
/x1/jenkins/jenkins-slave/workspace/Hive-0.9.1-SNAPSHOT-h0.21/hive/build.xml:302: The following
error occurred while executing this line:
/x1/jenkins/jenkins-slave/workspace/Hive-0.9.1-SNAPSHOT-h0.21/hive/build.xml:152: The following
error occurred while executing this line:
/x1/jenkins/jenkins-slave/workspace/Hive-0.9.1-SNAPSHOT-h0.21/hive/shims/build.xml:85: The
following error occurred while executing this line:
/x1/jenkins/jenkins-slave/workspace/Hive-0.9.1-SNAPSHOT-h0.21/hive/shims/build.xml:88: The
following error occurred while executing this line:
/x1/jenkins/jenkins-slave/workspace/Hive-0.9.1-SNAPSHOT-h0.21/hive/shims/build.xml:60: The
following error occurred while executing this line:
/x1/jenkins/jenkins-slave/workspace/Hive-0.9.1-SNAPSHOT-h0.21/hive/build-common.xml:164: impossible
to resolve dependencies:
	resolve failed - see output for details

Total time: 10 minutes 48 seconds
Build step 'Invoke Ant' marked build as failure
Archiving artifacts
Recording test results

Mime
View raw message