hive-dev mailing list archives

Site index · List index
Message view « Date » · « Thread »
Top « Date » · « Thread »
From Apache Jenkins Server <jenk...@builds.apache.org>
Subject Build failed in Jenkins: Hive-0.9.1-SNAPSHOT-h0.21-keepgoing=false #40
Date Thu, 07 Jun 2012 06:44:52 GMT
See <https://builds.apache.org/job/Hive-0.9.1-SNAPSHOT-h0.21-keepgoing=false/40/changes>

Changes:

[hashutosh] HIVE-3057: metastore.HiveMetaStore should set the thread local raw store to null
in shutdown() (Travis Crawford via Ashutosh Chauhan) Merged in from trunk

[cws] HIVE-3082. Oracle Metastore schema script doesn't include DDL for DN internal tables

[cws] HIVE-2928. Support for Oracle-backed Hive-Metastore (longvarchar to clob in package.jdo)

------------------------------------------
[...truncated 9212 lines...]
ivy-resolve:
     [echo] Project: shims
[ivy:resolve] :: loading settings :: file = <https://builds.apache.org/job/Hive-0.9.1-SNAPSHOT-h0.21-keepgoing=false/ws/hive/ivy/ivysettings.xml>
[ivy:report] Processing <https://builds.apache.org/job/Hive-0.9.1-SNAPSHOT-h0.21-keepgoing=false/40/artifact/hive/build/ivy/resolution-cache/org.apache.hive-hive-shims-default.xml>
to <https://builds.apache.org/job/Hive-0.9.1-SNAPSHOT-h0.21-keepgoing=false/40/artifact/hive/build/ivy/report/org.apache.hive-hive-shims-default.html>

ivy-retrieve:
     [echo] Project: shims

compile:
     [echo] Project: shims
     [echo] Building shims 0.20

build_shims:
     [echo] Project: shims
     [echo] Compiling <https://builds.apache.org/job/Hive-0.9.1-SNAPSHOT-h0.21-keepgoing=false/ws/hive/shims/src/common/java;/home/hudson/hudson-slave/workspace/Hive-0.9.1-SNAPSHOT-h0.21-keepgoing=false/hive/shims/src/0.20/java>
against hadoop 0.20.2 (<https://builds.apache.org/job/Hive-0.9.1-SNAPSHOT-h0.21-keepgoing=false/40/artifact/hive/build/hadoopcore/hadoop-0.20.2)>

ivy-init-settings:
     [echo] Project: shims

ivy-resolve-hadoop-shim:
     [echo] Project: shims
[ivy:resolve] :: loading settings :: file = <https://builds.apache.org/job/Hive-0.9.1-SNAPSHOT-h0.21-keepgoing=false/ws/hive/ivy/ivysettings.xml>
[ivy:resolve] downloading http://repo1.maven.org/maven2/org/apache/hadoop/hadoop-tools/0.20.2/hadoop-tools-0.20.2.jar
...
[ivy:resolve] .................... (68kB)
[ivy:resolve] .. (0kB)
[ivy:resolve] 	[SUCCESSFUL ] org.apache.hadoop#hadoop-tools;0.20.2!hadoop-tools.jar (1974ms)
[ivy:resolve] downloading http://repo1.maven.org/maven2/org/apache/hadoop/hadoop-test/0.20.2/hadoop-test-0.20.2.jar
...
[ivy:resolve] ....................................................................................................................................................................................................................................................
(1527kB)
[ivy:resolve] downloading http://repo1.maven.org/maven2/commons-cli/commons-cli/1.2/commons-cli-1.2.jar
...
[ivy:resolve] ... (40kB)
[ivy:resolve] .. (0kB)
[ivy:resolve] 	[SUCCESSFUL ] commons-cli#commons-cli;1.2!commons-cli.jar (2377ms)
[ivy:resolve] downloading http://repo1.maven.org/maven2/commons-httpclient/commons-httpclient/3.0.1/commons-httpclient-3.0.1.jar
...
[ivy:resolve] ........................................................... (273kB)
[ivy:resolve] .. (0kB)
[ivy:resolve] downloading http://repo1.maven.org/maven2/commons-codec/commons-codec/1.3/commons-codec-1.3.jar
...
[ivy:resolve] ............ (45kB)
[ivy:resolve] .. (0kB)
[ivy:resolve] downloading http://repo1.maven.org/maven2/commons-net/commons-net/1.4.1/commons-net-1.4.1.jar
...
[ivy:resolve] ..................................... (176kB)
[ivy:resolve] downloading http://repo1.maven.org/maven2/org/mortbay/jetty/jetty/6.1.14/jetty-6.1.14.jar
...
[ivy:resolve] .................................................................................
(504kB)
[ivy:resolve] .. (0kB)
[ivy:resolve] downloading http://repo1.maven.org/maven2/org/mortbay/jetty/jetty-util/6.1.14/jetty-util-6.1.14.jar
...
[ivy:resolve] ...................................... (159kB)
[ivy:resolve] downloading http://repo1.maven.org/maven2/tomcat/jasper-runtime/5.5.12/jasper-runtime-5.5.12.jar
...
[ivy:resolve] ......... (74kB)
[ivy:resolve] .. (0kB)
[ivy:resolve] downloading http://repo1.maven.org/maven2/tomcat/jasper-compiler/5.5.12/jasper-compiler-5.5.12.jar
...
[ivy:resolve] ...................................................................... (395kB)
[ivy:resolve] .. (0kB)
[ivy:resolve] downloading http://repo1.maven.org/maven2/org/mortbay/jetty/jsp-api-2.1/6.1.14/jsp-api-2.1-6.1.14.jar
...
[ivy:resolve] ......................... (131kB)
[ivy:resolve] .. (0kB)
[ivy:resolve] 	[SUCCESSFUL ] org.mortbay.jetty#jsp-api-2.1;6.1.14!jsp-api-2.1.jar (1879ms)
[ivy:resolve] downloading http://repo1.maven.org/maven2/org/mortbay/jetty/jsp-2.1/6.1.14/jsp-2.1-6.1.14.jar
...
[ivy:resolve] .............................................................................................................................................................
(1000kB)
[ivy:resolve] downloading http://repo1.maven.org/maven2/commons-el/commons-el/1.0/commons-el-1.0.jar
...
[ivy:resolve] ................ (109kB)
[ivy:resolve] .. (0kB)
[ivy:resolve] 	[SUCCESSFUL ] commons-el#commons-el;1.0!commons-el.jar (2127ms)
[ivy:resolve] downloading http://repo1.maven.org/maven2/net/java/dev/jets3t/jets3t/0.7.1/jets3t-0.7.1.jar
...
[ivy:resolve] ...........................................................................
(368kB)
[ivy:resolve] .. (0kB)
[ivy:resolve] 	[SUCCESSFUL ] net.java.dev.jets3t#jets3t;0.7.1!jets3t.jar (2730ms)
[ivy:resolve] downloading http://repo1.maven.org/maven2/net/sf/kosmosfs/kfs/0.3/kfs-0.3.jar
...
[ivy:resolve] ... (11kB)
[ivy:resolve] .. (0kB)
[ivy:resolve] downloading http://repo1.maven.org/maven2/junit/junit/4.5/junit-4.5.jar ...
[ivy:resolve] ......................................... (194kB)
[ivy:resolve] .. (0kB)
[ivy:resolve] downloading http://repo1.maven.org/maven2/hsqldb/hsqldb/1.8.0.10/hsqldb-1.8.0.10.jar
...
[ivy:resolve] ........................................................................................................................
(690kB)
[ivy:resolve] downloading http://repo1.maven.org/maven2/oro/oro/2.0.8/oro-2.0.8.jar ...
[ivy:resolve] ....... (63kB)
[ivy:resolve] .. (0kB)
[ivy:resolve] 	[SUCCESSFUL ] oro#oro;2.0.8!oro.jar (1889ms)
[ivy:resolve] downloading http://repo1.maven.org/maven2/org/eclipse/jdt/core/3.1.1/core-3.1.1.jar
...
[ivy:resolve] ...................................................................................................................................................................................................................................................................................................................................................................................................................................................................................................................................................
(3483kB)
[ivy:resolve] downloading http://repo1.maven.org/maven2/ant/ant/1.6.5/ant-1.6.5.jar ...
[ivy:resolve] ................................................................................................................................................
(1009kB)
[ivy:resolve] .. (0kB)
[ivy:resolve] 	[SUCCESSFUL ] ant#ant;1.6.5!ant.jar (2512ms)
[ivy:resolve] downloading http://repo1.maven.org/maven2/org/apache/ftpserver/ftplet-api/1.0.0/ftplet-api-1.0.0.jar
...
[ivy:resolve] ......... (22kB)
[ivy:resolve] .. (0kB)
[ivy:resolve] downloading http://repo1.maven.org/maven2/org/apache/mina/mina-core/2.0.0-M5/mina-core-2.0.0-M5.jar
...
[ivy:resolve] ..................................................................................................................
(622kB)
[ivy:resolve] .. (0kB)
[ivy:resolve] downloading http://repo1.maven.org/maven2/org/apache/ftpserver/ftpserver-deprecated/1.0.0-M2/ftpserver-deprecated-1.0.0-M2.jar
...
[ivy:resolve] ........ (31kB)
[ivy:resolve] .. (0kB)
[ivy:resolve] 	[SUCCESSFUL ] org.apache.ftpserver#ftpserver-deprecated;1.0.0-M2!ftpserver-deprecated.jar
(1972ms)
[ivy:resolve] downloading http://repo1.maven.org/maven2/org/slf4j/slf4j-api/1.5.2/slf4j-api-1.5.2.jar
...
[ivy:resolve] .......... (16kB)
[ivy:resolve] .. (0kB)
[ivy:resolve] 	[SUCCESSFUL ] org.slf4j#slf4j-api;1.5.2!slf4j-api.jar (1761ms)
[ivy:resolve] 
[ivy:resolve] :: problems summary ::
[ivy:resolve] :::: WARNINGS
[ivy:resolve] 	problem while downloading module descriptor: http://repo1.maven.org/maven2/org/apache/ftpserver/ftpserver-core/1.0.0/ftpserver-core-1.0.0.pom:
/home/hudson/.ivy2/cache/org.apache.ftpserver/ftpserver-core/ivy-1.0.0.xml.original.part (No
such file or directory) (1997ms)
[ivy:resolve] 		module not found: org.apache.ftpserver#ftpserver-core;1.0.0
[ivy:resolve] 	==== local: tried
[ivy:resolve] 	  /home/hudson/.ivy2/local/org.apache.ftpserver/ftpserver-core/1.0.0/ivys/ivy.xml
[ivy:resolve] 	  -- artifact org.apache.ftpserver#ftpserver-core;1.0.0!ftpserver-core.jar:
[ivy:resolve] 	  /home/hudson/.ivy2/local/org.apache.ftpserver/ftpserver-core/1.0.0/jars/ftpserver-core.jar
[ivy:resolve] 	==== apache-snapshot: tried
[ivy:resolve] 	  https://repository.apache.org/content/repositories/snapshots/org/apache/ftpserver/ftpserver-core/1.0.0/ftpserver-core-1.0.0.pom
[ivy:resolve] 	  -- artifact org.apache.ftpserver#ftpserver-core;1.0.0!ftpserver-core.jar:
[ivy:resolve] 	  https://repository.apache.org/content/repositories/snapshots/org/apache/ftpserver/ftpserver-core/1.0.0/ftpserver-core-1.0.0.jar
[ivy:resolve] 	==== maven2: tried
[ivy:resolve] 	  http://repo1.maven.org/maven2/org/apache/ftpserver/ftpserver-core/1.0.0/ftpserver-core-1.0.0.pom
[ivy:resolve] 	==== datanucleus-repo: tried
[ivy:resolve] 	  -- artifact org.apache.ftpserver#ftpserver-core;1.0.0!ftpserver-core.jar:
[ivy:resolve] 	  http://www.datanucleus.org/downloads/maven2/org/apache/ftpserver/ftpserver-core/1.0.0/ftpserver-core-1.0.0.jar
[ivy:resolve] 	==== hadoop-source: tried
[ivy:resolve] 	  -- artifact org.apache.ftpserver#ftpserver-core;1.0.0!ftpserver-core.jar:
[ivy:resolve] 	  http://mirror.facebook.net/facebook/hive-deps/hadoop/core/ftpserver-core-1.0.0/ftpserver-core-1.0.0.jar
[ivy:resolve] 	==== hadoop-source2: tried
[ivy:resolve] 	  -- artifact org.apache.ftpserver#ftpserver-core;1.0.0!ftpserver-core.jar:
[ivy:resolve] 	  http://archive.cloudera.com/hive-deps/hadoop/core/ftpserver-core-1.0.0/ftpserver-core-1.0.0.jar
[ivy:resolve] 		[FAILED     ] org.apache.hadoop#hadoop-test;0.20.2!hadoop-test.jar: Downloaded
file size doesn't match expected Content Length for http://repo1.maven.org/maven2/org/apache/hadoop/hadoop-test/0.20.2/hadoop-test-0.20.2.jar.
Please retry. (1739ms)
[ivy:resolve] 		[FAILED     ] org.apache.hadoop#hadoop-test;0.20.2!hadoop-test.jar:  (0ms)
[ivy:resolve] 	==== local: tried
[ivy:resolve] 	  /home/hudson/.ivy2/local/org.apache.hadoop/hadoop-test/0.20.2/jars/hadoop-test.jar
[ivy:resolve] 	==== apache-snapshot: tried
[ivy:resolve] 	  https://repository.apache.org/content/repositories/snapshots/org/apache/hadoop/hadoop-test/0.20.2/hadoop-test-0.20.2.jar
[ivy:resolve] 	==== maven2: tried
[ivy:resolve] 	  http://repo1.maven.org/maven2/org/apache/hadoop/hadoop-test/0.20.2/hadoop-test-0.20.2.jar
[ivy:resolve] 	==== datanucleus-repo: tried
[ivy:resolve] 	  http://www.datanucleus.org/downloads/maven2/org/apache/hadoop/hadoop-test/0.20.2/hadoop-test-0.20.2.jar
[ivy:resolve] 	==== hadoop-source: tried
[ivy:resolve] 	  http://mirror.facebook.net/facebook/hive-deps/hadoop/core/hadoop-test-0.20.2/hadoop-test-0.20.2.jar
[ivy:resolve] 	==== hadoop-source2: tried
[ivy:resolve] 	  http://archive.cloudera.com/hive-deps/hadoop/core/hadoop-test-0.20.2/hadoop-test-0.20.2.jar
[ivy:resolve] 		[FAILED     ] commons-httpclient#commons-httpclient;3.0.1!commons-httpclient.jar:
/home/hudson/.ivy2/cache/commons-httpclient/commons-httpclient/jars/commons-httpclient-3.0.1.jar.part
(No such file or directory) (2483ms)
[ivy:resolve] 		[FAILED     ] commons-codec#commons-codec;1.3!commons-codec.jar: /home/hudson/.ivy2/cache/commons-codec/commons-codec/jars/commons-codec-1.3.jar.part
(No such file or directory) (2175ms)
[ivy:resolve] 		[FAILED     ] commons-net#commons-net;1.4.1!commons-net.jar: Downloaded file
size doesn't match expected Content Length for http://repo1.maven.org/maven2/commons-net/commons-net/1.4.1/commons-net-1.4.1.jar.
Please retry. (1308ms)
[ivy:resolve] 		[FAILED     ] commons-net#commons-net;1.4.1!commons-net.jar:  (0ms)
[ivy:resolve] 	==== local: tried
[ivy:resolve] 	  /home/hudson/.ivy2/local/commons-net/commons-net/1.4.1/jars/commons-net.jar
[ivy:resolve] 	==== apache-snapshot: tried
[ivy:resolve] 	  https://repository.apache.org/content/repositories/snapshots/commons-net/commons-net/1.4.1/commons-net-1.4.1.jar
[ivy:resolve] 	==== maven2: tried
[ivy:resolve] 	  http://repo1.maven.org/maven2/commons-net/commons-net/1.4.1/commons-net-1.4.1.jar
[ivy:resolve] 	==== datanucleus-repo: tried
[ivy:resolve] 	  http://www.datanucleus.org/downloads/maven2/commons-net/commons-net/1.4.1/commons-net-1.4.1.jar
[ivy:resolve] 	==== hadoop-source: tried
[ivy:resolve] 	  http://mirror.facebook.net/facebook/hive-deps/hadoop/core/commons-net-1.4.1/commons-net-1.4.1.jar
[ivy:resolve] 	==== hadoop-source2: tried
[ivy:resolve] 	  http://archive.cloudera.com/hive-deps/hadoop/core/commons-net-1.4.1/commons-net-1.4.1.jar
[ivy:resolve] 		[FAILED     ] org.mortbay.jetty#jetty;6.1.14!jetty.jar: /home/hudson/.ivy2/cache/org.mortbay.jetty/jetty/jars/jetty-6.1.14.jar.part
(No such file or directory) (2432ms)
[ivy:resolve] 		[FAILED     ] org.mortbay.jetty#jetty-util;6.1.14!jetty-util.jar: Downloaded
file size doesn't match expected Content Length for http://repo1.maven.org/maven2/org/mortbay/jetty/jetty-util/6.1.14/jetty-util-6.1.14.jar.
Please retry. (1142ms)
[ivy:resolve] 		[FAILED     ] org.mortbay.jetty#jetty-util;6.1.14!jetty-util.jar:  (0ms)
[ivy:resolve] 	==== local: tried
[ivy:resolve] 	  /home/hudson/.ivy2/local/org.mortbay.jetty/jetty-util/6.1.14/jars/jetty-util.jar
[ivy:resolve] 	==== apache-snapshot: tried
[ivy:resolve] 	  https://repository.apache.org/content/repositories/snapshots/org/mortbay/jetty/jetty-util/6.1.14/jetty-util-6.1.14.jar
[ivy:resolve] 	==== maven2: tried
[ivy:resolve] 	  http://repo1.maven.org/maven2/org/mortbay/jetty/jetty-util/6.1.14/jetty-util-6.1.14.jar
[ivy:resolve] 	==== datanucleus-repo: tried
[ivy:resolve] 	  http://www.datanucleus.org/downloads/maven2/org/mortbay/jetty/jetty-util/6.1.14/jetty-util-6.1.14.jar
[ivy:resolve] 	==== hadoop-source: tried
[ivy:resolve] 	  http://mirror.facebook.net/facebook/hive-deps/hadoop/core/jetty-util-6.1.14/jetty-util-6.1.14.jar
[ivy:resolve] 	==== hadoop-source2: tried
[ivy:resolve] 	  http://archive.cloudera.com/hive-deps/hadoop/core/jetty-util-6.1.14/jetty-util-6.1.14.jar
[ivy:resolve] 		[FAILED     ] tomcat#jasper-runtime;5.5.12!jasper-runtime.jar: /home/hudson/.ivy2/cache/tomcat/jasper-runtime/jars/jasper-runtime-5.5.12.jar.part
(No such file or directory) (1869ms)
[ivy:resolve] 		[FAILED     ] tomcat#jasper-compiler;5.5.12!jasper-compiler.jar: /home/hudson/.ivy2/cache/tomcat/jasper-compiler/jars/jasper-compiler-5.5.12.jar.part
(No such file or directory) (2687ms)
[ivy:resolve] 		[FAILED     ] org.mortbay.jetty#jsp-2.1;6.1.14!jsp-2.1.jar: Downloaded file
size doesn't match expected Content Length for http://repo1.maven.org/maven2/org/mortbay/jetty/jsp-2.1/6.1.14/jsp-2.1-6.1.14.jar.
Please retry. (1570ms)
[ivy:resolve] 		[FAILED     ] org.mortbay.jetty#jsp-2.1;6.1.14!jsp-2.1.jar:  (0ms)
[ivy:resolve] 	==== local: tried
[ivy:resolve] 	  /home/hudson/.ivy2/local/org.mortbay.jetty/jsp-2.1/6.1.14/jars/jsp-2.1.jar
[ivy:resolve] 	==== apache-snapshot: tried
[ivy:resolve] 	  https://repository.apache.org/content/repositories/snapshots/org/mortbay/jetty/jsp-2.1/6.1.14/jsp-2.1-6.1.14.jar
[ivy:resolve] 	==== maven2: tried
[ivy:resolve] 	  http://repo1.maven.org/maven2/org/mortbay/jetty/jsp-2.1/6.1.14/jsp-2.1-6.1.14.jar
[ivy:resolve] 	==== datanucleus-repo: tried
[ivy:resolve] 	  http://www.datanucleus.org/downloads/maven2/org/mortbay/jetty/jsp-2.1/6.1.14/jsp-2.1-6.1.14.jar
[ivy:resolve] 	==== hadoop-source: tried
[ivy:resolve] 	  http://mirror.facebook.net/facebook/hive-deps/hadoop/core/jsp-2.1-6.1.14/jsp-2.1-6.1.14.jar
[ivy:resolve] 	==== hadoop-source2: tried
[ivy:resolve] 	  http://archive.cloudera.com/hive-deps/hadoop/core/jsp-2.1-6.1.14/jsp-2.1-6.1.14.jar
[ivy:resolve] 		[FAILED     ] net.sf.kosmosfs#kfs;0.3!kfs.jar: /home/hudson/.ivy2/cache/net.sf.kosmosfs/kfs/jars/kfs-0.3.jar.part
(No such file or directory) (2412ms)
[ivy:resolve] 		[FAILED     ] junit#junit;4.5!junit.jar: /home/hudson/.ivy2/cache/junit/junit/jars/junit-4.5.jar.part
(No such file or directory) (2211ms)
[ivy:resolve] 		[FAILED     ] hsqldb#hsqldb;1.8.0.10!hsqldb.jar: Downloaded file size doesn't
match expected Content Length for http://repo1.maven.org/maven2/hsqldb/hsqldb/1.8.0.10/hsqldb-1.8.0.10.jar.
Please retry. (1519ms)
[ivy:resolve] 		[FAILED     ] hsqldb#hsqldb;1.8.0.10!hsqldb.jar:  (0ms)
[ivy:resolve] 	==== local: tried
[ivy:resolve] 	  /home/hudson/.ivy2/local/hsqldb/hsqldb/1.8.0.10/jars/hsqldb.jar
[ivy:resolve] 	==== apache-snapshot: tried
[ivy:resolve] 	  https://repository.apache.org/content/repositories/snapshots/hsqldb/hsqldb/1.8.0.10/hsqldb-1.8.0.10.jar
[ivy:resolve] 	==== maven2: tried
[ivy:resolve] 	  http://repo1.maven.org/maven2/hsqldb/hsqldb/1.8.0.10/hsqldb-1.8.0.10.jar
[ivy:resolve] 	==== datanucleus-repo: tried
[ivy:resolve] 	  http://www.datanucleus.org/downloads/maven2/hsqldb/hsqldb/1.8.0.10/hsqldb-1.8.0.10.jar
[ivy:resolve] 	==== hadoop-source: tried
[ivy:resolve] 	  http://mirror.facebook.net/facebook/hive-deps/hadoop/core/hsqldb-1.8.0.10/hsqldb-1.8.0.10.jar
[ivy:resolve] 	==== hadoop-source2: tried
[ivy:resolve] 	  http://archive.cloudera.com/hive-deps/hadoop/core/hsqldb-1.8.0.10/hsqldb-1.8.0.10.jar
[ivy:resolve] 		[FAILED     ] org.eclipse.jdt#core;3.1.1!core.jar: Downloaded file size doesn't
match expected Content Length for http://repo1.maven.org/maven2/org/eclipse/jdt/core/3.1.1/core-3.1.1.jar.
Please retry. (1896ms)
[ivy:resolve] 		[FAILED     ] org.eclipse.jdt#core;3.1.1!core.jar:  (0ms)
[ivy:resolve] 	==== local: tried
[ivy:resolve] 	  /home/hudson/.ivy2/local/org.eclipse.jdt/core/3.1.1/jars/core.jar
[ivy:resolve] 	==== apache-snapshot: tried
[ivy:resolve] 	  https://repository.apache.org/content/repositories/snapshots/org/eclipse/jdt/core/3.1.1/core-3.1.1.jar
[ivy:resolve] 	==== maven2: tried
[ivy:resolve] 	  http://repo1.maven.org/maven2/org/eclipse/jdt/core/3.1.1/core-3.1.1.jar
[ivy:resolve] 	==== datanucleus-repo: tried
[ivy:resolve] 	  http://www.datanucleus.org/downloads/maven2/org/eclipse/jdt/core/3.1.1/core-3.1.1.jar
[ivy:resolve] 	==== hadoop-source: tried
[ivy:resolve] 	  http://mirror.facebook.net/facebook/hive-deps/hadoop/core/core-3.1.1/core-3.1.1.jar
[ivy:resolve] 	==== hadoop-source2: tried
[ivy:resolve] 	  http://archive.cloudera.com/hive-deps/hadoop/core/core-3.1.1/core-3.1.1.jar
[ivy:resolve] 		[FAILED     ] org.apache.ftpserver#ftplet-api;1.0.0!ftplet-api.jar(bundle):
/home/hudson/.ivy2/cache/org.apache.ftpserver/ftplet-api/bundles/ftplet-api-1.0.0.jar.part
(No such file or directory) (2375ms)
[ivy:resolve] 		[FAILED     ] org.apache.mina#mina-core;2.0.0-M5!mina-core.jar(bundle): /home/hudson/.ivy2/cache/org.apache.mina/mina-core/bundles/mina-core-2.0.0-M5.jar.part
(No such file or directory) (2457ms)
[ivy:resolve] 		::::::::::::::::::::::::::::::::::::::::::::::
[ivy:resolve] 		::          UNRESOLVED DEPENDENCIES         ::
[ivy:resolve] 		::::::::::::::::::::::::::::::::::::::::::::::
[ivy:resolve] 		:: org.apache.ftpserver#ftpserver-core;1.0.0: not found
[ivy:resolve] 		::::::::::::::::::::::::::::::::::::::::::::::
[ivy:resolve] 		::::::::::::::::::::::::::::::::::::::::::::::
[ivy:resolve] 		::              FAILED DOWNLOADS            ::
[ivy:resolve] 		:: ^ see resolution messages for details  ^ ::
[ivy:resolve] 		::::::::::::::::::::::::::::::::::::::::::::::
[ivy:resolve] 		:: commons-net#commons-net;1.4.1!commons-net.jar
[ivy:resolve] 		:: org.mortbay.jetty#jetty-util;6.1.14!jetty-util.jar
[ivy:resolve] 		:: org.mortbay.jetty#jsp-2.1;6.1.14!jsp-2.1.jar
[ivy:resolve] 		:: org.eclipse.jdt#core;3.1.1!core.jar
[ivy:resolve] 		:: hsqldb#hsqldb;1.8.0.10!hsqldb.jar
[ivy:resolve] 		:: org.apache.hadoop#hadoop-test;0.20.2!hadoop-test.jar
[ivy:resolve] 		::::::::::::::::::::::::::::::::::::::::::::::
[ivy:resolve] 
[ivy:resolve] :: USE VERBOSE OR DEBUG MESSAGE LEVEL FOR MORE DETAILS

BUILD FAILED
<https://builds.apache.org/job/Hive-0.9.1-SNAPSHOT-h0.21-keepgoing=false/ws/hive/build.xml>:302:
The following error occurred while executing this line:
<https://builds.apache.org/job/Hive-0.9.1-SNAPSHOT-h0.21-keepgoing=false/ws/hive/build.xml>:152:
The following error occurred while executing this line:
<https://builds.apache.org/job/Hive-0.9.1-SNAPSHOT-h0.21-keepgoing=false/ws/hive/shims/build.xml>:85:
The following error occurred while executing this line:
<https://builds.apache.org/job/Hive-0.9.1-SNAPSHOT-h0.21-keepgoing=false/ws/hive/shims/build.xml>:88:
The following error occurred while executing this line:
<https://builds.apache.org/job/Hive-0.9.1-SNAPSHOT-h0.21-keepgoing=false/ws/hive/shims/build.xml>:60:
The following error occurred while executing this line:
<https://builds.apache.org/job/Hive-0.9.1-SNAPSHOT-h0.21-keepgoing=false/ws/hive/build-common.xml>:164:
impossible to resolve dependencies:
	resolve failed - see output for details

Total time: 1 minute 6 seconds
Build step 'Invoke Ant' marked build as failure
Archiving artifacts
Updating HIVE-3057
Updating HIVE-2928
Updating HIVE-3082
Recording test results

Mime
View raw message