hive-dev mailing list archives

Site index · List index
Message view « Date » · « Thread »
Top « Date » · « Thread »
From Apache Jenkins Server <jenk...@builds.apache.org>
Subject Build failed in Jenkins: Hive-0.9.1-SNAPSHOT-h0.21-keepgoing=false #27
Date Fri, 25 May 2012 17:26:43 GMT
See <https://builds.apache.org/job/Hive-0.9.1-SNAPSHOT-h0.21-keepgoing=false/27/>

------------------------------------------
[...truncated 5526 lines...]
ivy-retrieve:
     [echo] Project: shims

compile:
     [echo] Project: shims
     [echo] Building shims 0.20

build_shims:
     [echo] Project: shims
     [echo] Compiling <https://builds.apache.org/job/Hive-0.9.1-SNAPSHOT-h0.21-keepgoing=false/ws/hive/shims/src/common/java;/home/jenkins/jenkins-slave/workspace/Hive-0.9.1-SNAPSHOT-h0.21-keepgoing=false/hive/shims/src/0.20/java>
against hadoop 0.20.2 (<https://builds.apache.org/job/Hive-0.9.1-SNAPSHOT-h0.21-keepgoing=false/27/artifact/hive/build/hadoopcore/hadoop-0.20.2)>

ivy-init-settings:
     [echo] Project: shims

ivy-resolve-hadoop-shim:
     [echo] Project: shims
[ivy:resolve] :: loading settings :: file = <https://builds.apache.org/job/Hive-0.9.1-SNAPSHOT-h0.21-keepgoing=false/ws/hive/ivy/ivysettings.xml>
[ivy:resolve] downloading http://repo1.maven.org/maven2/org/apache/hadoop/hadoop-tools/0.20.2/hadoop-tools-0.20.2.jar
...
[ivy:resolve] .... (68kB)
[ivy:resolve] .. (0kB)
[ivy:resolve] downloading http://repo1.maven.org/maven2/org/apache/hadoop/hadoop-test/0.20.2/hadoop-test-0.20.2.jar
...
[ivy:resolve] ..................................................................... (1527kB)
[ivy:resolve] downloading http://repo1.maven.org/maven2/commons-cli/commons-cli/1.2/commons-cli-1.2.jar
...
[ivy:resolve] .. (40kB)
[ivy:resolve] .. (0kB)
[ivy:resolve] downloading http://repo1.maven.org/maven2/xmlenc/xmlenc/0.52/xmlenc-0.52.jar
...
[ivy:resolve] ... (14kB)
[ivy:resolve] .. (0kB)
[ivy:resolve] downloading http://repo1.maven.org/maven2/commons-httpclient/commons-httpclient/3.0.1/commons-httpclient-3.0.1.jar
...
[ivy:resolve] ............. (273kB)
[ivy:resolve] .. (0kB)
[ivy:resolve] downloading http://repo1.maven.org/maven2/commons-codec/commons-codec/1.3/commons-codec-1.3.jar
...
[ivy:resolve] ... (45kB)
[ivy:resolve] .. (0kB)
[ivy:resolve] downloading http://repo1.maven.org/maven2/commons-net/commons-net/1.4.1/commons-net-1.4.1.jar
...
[ivy:resolve] ...... (176kB)
[ivy:resolve] .. (0kB)
[ivy:resolve] downloading http://repo1.maven.org/maven2/org/mortbay/jetty/jetty/6.1.14/jetty-6.1.14.jar
...
[ivy:resolve] .................... (504kB)
[ivy:resolve] .. (0kB)
[ivy:resolve] downloading http://repo1.maven.org/maven2/org/mortbay/jetty/jetty-util/6.1.14/jetty-util-6.1.14.jar
...
[ivy:resolve] ..... (159kB)
[ivy:resolve] .. (0kB)
[ivy:resolve] downloading http://repo1.maven.org/maven2/tomcat/jasper-runtime/5.5.12/jasper-runtime-5.5.12.jar
...
[ivy:resolve] .... (74kB)
[ivy:resolve] downloading http://repo1.maven.org/maven2/tomcat/jasper-compiler/5.5.12/jasper-compiler-5.5.12.jar
...
[ivy:resolve] ............ (395kB)
[ivy:resolve] .. (0kB)
[ivy:resolve] downloading http://repo1.maven.org/maven2/org/mortbay/jetty/jsp-api-2.1/6.1.14/jsp-api-2.1-6.1.14.jar
...
[ivy:resolve] ...... (131kB)
[ivy:resolve] downloading http://repo1.maven.org/maven2/org/mortbay/jetty/jsp-2.1/6.1.14/jsp-2.1-6.1.14.jar
...
[ivy:resolve] ..................................... (1000kB)
[ivy:resolve] .. (0kB)
[ivy:resolve] downloading http://repo1.maven.org/maven2/commons-el/commons-el/1.0/commons-el-1.0.jar
...
[ivy:resolve] .... (109kB)
[ivy:resolve] .. (0kB)
[ivy:resolve] downloading http://repo1.maven.org/maven2/net/java/dev/jets3t/jets3t/0.7.1/jets3t-0.7.1.jar
...
[ivy:resolve] ........... (368kB)
[ivy:resolve] .. (0kB)
[ivy:resolve] downloading http://repo1.maven.org/maven2/org/mortbay/jetty/servlet-api-2.5/6.1.14/servlet-api-2.5-6.1.14.jar
...
[ivy:resolve] ..... (129kB)
[ivy:resolve] .. (0kB)
[ivy:resolve] 	[SUCCESSFUL ] org.mortbay.jetty#servlet-api-2.5;6.1.14!servlet-api-2.5.jar
(2706ms)
[ivy:resolve] downloading http://repo1.maven.org/maven2/junit/junit/4.5/junit-4.5.jar ...
[ivy:resolve] ....... (194kB)
[ivy:resolve] .. (0kB)
[ivy:resolve] downloading http://repo1.maven.org/maven2/hsqldb/hsqldb/1.8.0.10/hsqldb-1.8.0.10.jar
...
[ivy:resolve] ..................... (690kB)
[ivy:resolve] downloading http://repo1.maven.org/maven2/oro/oro/2.0.8/oro-2.0.8.jar ...
[ivy:resolve] ... (63kB)
[ivy:resolve] .. (0kB)
[ivy:resolve] downloading http://repo1.maven.org/maven2/org/eclipse/jdt/core/3.1.1/core-3.1.1.jar
...
[ivy:resolve] ....................................................................................................................................................................................
(3483kB)
[ivy:resolve] downloading http://repo1.maven.org/maven2/ant/ant/1.6.5/ant-1.6.5.jar ...
[ivy:resolve] ................................................................... (1009kB)
[ivy:resolve] .. (0kB)
[ivy:resolve] downloading http://repo1.maven.org/maven2/commons-logging/commons-logging/1.1.1/commons-logging-1.1.1.jar
...
[ivy:resolve] .... (59kB)
[ivy:resolve] .. (0kB)
[ivy:resolve] 	[SUCCESSFUL ] commons-logging#commons-logging;1.1.1!commons-logging.jar (2453ms)
[ivy:resolve] downloading http://repo1.maven.org/maven2/org/apache/ftpserver/ftplet-api/1.0.0/ftplet-api-1.0.0.jar
...
[ivy:resolve] ... (22kB)
[ivy:resolve] .. (0kB)
[ivy:resolve] 	[SUCCESSFUL ] org.apache.ftpserver#ftplet-api;1.0.0!ftplet-api.jar(bundle)
(1818ms)
[ivy:resolve] downloading http://repo1.maven.org/maven2/org/apache/mina/mina-core/2.0.0-M5/mina-core-2.0.0-M5.jar
...
[ivy:resolve] ....................... (622kB)
[ivy:resolve] downloading http://repo1.maven.org/maven2/org/apache/ftpserver/ftpserver-core/1.0.0/ftpserver-core-1.0.0.jar
...
[ivy:resolve] ........... (264kB)
[ivy:resolve] .. (0kB)
[ivy:resolve] downloading http://repo1.maven.org/maven2/org/apache/ftpserver/ftpserver-deprecated/1.0.0-M2/ftpserver-deprecated-1.0.0-M2.jar
...
[ivy:resolve] ... (31kB)
[ivy:resolve] .. (0kB)
[ivy:resolve] 	[SUCCESSFUL ] org.apache.ftpserver#ftpserver-deprecated;1.0.0-M2!ftpserver-deprecated.jar
(1997ms)
[ivy:resolve] 
[ivy:resolve] :: problems summary ::
[ivy:resolve] :::: WARNINGS
[ivy:resolve] 	problem while downloading module descriptor: http://repo1.maven.org/maven2/org/slf4j/slf4j-api/1.5.2/slf4j-api-1.5.2.pom:
/home/jenkins/.ivy2/cache/org.slf4j/slf4j-api/ivy-1.5.2.xml.original.part (No such file or
directory) (1992ms)
[ivy:resolve] 		module not found: org.slf4j#slf4j-api;1.5.2
[ivy:resolve] 	==== local: tried
[ivy:resolve] 	  /home/jenkins/.ivy2/local/org.slf4j/slf4j-api/1.5.2/ivys/ivy.xml
[ivy:resolve] 	  -- artifact org.slf4j#slf4j-api;1.5.2!slf4j-api.jar:
[ivy:resolve] 	  /home/jenkins/.ivy2/local/org.slf4j/slf4j-api/1.5.2/jars/slf4j-api.jar
[ivy:resolve] 	==== apache-snapshot: tried
[ivy:resolve] 	  https://repository.apache.org/content/repositories/snapshots/org/slf4j/slf4j-api/1.5.2/slf4j-api-1.5.2.pom
[ivy:resolve] 	  -- artifact org.slf4j#slf4j-api;1.5.2!slf4j-api.jar:
[ivy:resolve] 	  https://repository.apache.org/content/repositories/snapshots/org/slf4j/slf4j-api/1.5.2/slf4j-api-1.5.2.jar
[ivy:resolve] 	==== maven2: tried
[ivy:resolve] 	  http://repo1.maven.org/maven2/org/slf4j/slf4j-api/1.5.2/slf4j-api-1.5.2.pom
[ivy:resolve] 	==== datanucleus-repo: tried
[ivy:resolve] 	  -- artifact org.slf4j#slf4j-api;1.5.2!slf4j-api.jar:
[ivy:resolve] 	  http://www.datanucleus.org/downloads/maven2/org/slf4j/slf4j-api/1.5.2/slf4j-api-1.5.2.jar
[ivy:resolve] 	==== hadoop-source: tried
[ivy:resolve] 	  -- artifact org.slf4j#slf4j-api;1.5.2!slf4j-api.jar:
[ivy:resolve] 	  http://mirror.facebook.net/facebook/hive-deps/hadoop/core/slf4j-api-1.5.2/slf4j-api-1.5.2.jar
[ivy:resolve] 	==== hadoop-source2: tried
[ivy:resolve] 	  -- artifact org.slf4j#slf4j-api;1.5.2!slf4j-api.jar:
[ivy:resolve] 	  http://archive.cloudera.com/hive-deps/hadoop/core/slf4j-api-1.5.2/slf4j-api-1.5.2.jar
[ivy:resolve] 		[FAILED     ] org.apache.hadoop#hadoop-tools;0.20.2!hadoop-tools.jar: /home/jenkins/.ivy2/cache/org.apache.hadoop/hadoop-tools/jars/hadoop-tools-0.20.2.jar.part
(No such file or directory) (2183ms)
[ivy:resolve] 		[FAILED     ] org.apache.hadoop#hadoop-test;0.20.2!hadoop-test.jar: Downloaded
file size doesn't match expected Content Length for http://repo1.maven.org/maven2/org/apache/hadoop/hadoop-test/0.20.2/hadoop-test-0.20.2.jar.
Please retry. (1471ms)
[ivy:resolve] 		[FAILED     ] org.apache.hadoop#hadoop-test;0.20.2!hadoop-test.jar:  (0ms)
[ivy:resolve] 	==== local: tried
[ivy:resolve] 	  /home/jenkins/.ivy2/local/org.apache.hadoop/hadoop-test/0.20.2/jars/hadoop-test.jar
[ivy:resolve] 	==== apache-snapshot: tried
[ivy:resolve] 	  https://repository.apache.org/content/repositories/snapshots/org/apache/hadoop/hadoop-test/0.20.2/hadoop-test-0.20.2.jar
[ivy:resolve] 	==== maven2: tried
[ivy:resolve] 	  http://repo1.maven.org/maven2/org/apache/hadoop/hadoop-test/0.20.2/hadoop-test-0.20.2.jar
[ivy:resolve] 	==== datanucleus-repo: tried
[ivy:resolve] 	  http://www.datanucleus.org/downloads/maven2/org/apache/hadoop/hadoop-test/0.20.2/hadoop-test-0.20.2.jar
[ivy:resolve] 	==== hadoop-source: tried
[ivy:resolve] 	  http://mirror.facebook.net/facebook/hive-deps/hadoop/core/hadoop-test-0.20.2/hadoop-test-0.20.2.jar
[ivy:resolve] 	==== hadoop-source2: tried
[ivy:resolve] 	  http://archive.cloudera.com/hive-deps/hadoop/core/hadoop-test-0.20.2/hadoop-test-0.20.2.jar
[ivy:resolve] 		[FAILED     ] commons-cli#commons-cli;1.2!commons-cli.jar: /home/jenkins/.ivy2/cache/commons-cli/commons-cli/jars/commons-cli-1.2.jar.part
(No such file or directory) (2022ms)
[ivy:resolve] 		[FAILED     ] xmlenc#xmlenc;0.52!xmlenc.jar: /home/jenkins/.ivy2/cache/xmlenc/xmlenc/jars/xmlenc-0.52.jar.part
(No such file or directory) (1699ms)
[ivy:resolve] 		[FAILED     ] commons-httpclient#commons-httpclient;3.0.1!commons-httpclient.jar:
/home/jenkins/.ivy2/cache/commons-httpclient/commons-httpclient/jars/commons-httpclient-3.0.1.jar.part
(No such file or directory) (2011ms)
[ivy:resolve] 		[FAILED     ] commons-codec#commons-codec;1.3!commons-codec.jar: /home/jenkins/.ivy2/cache/commons-codec/commons-codec/jars/commons-codec-1.3.jar.part
(No such file or directory) (1985ms)
[ivy:resolve] 		[FAILED     ] commons-net#commons-net;1.4.1!commons-net.jar: /home/jenkins/.ivy2/cache/commons-net/commons-net/jars/commons-net-1.4.1.jar.part
(No such file or directory) (2028ms)
[ivy:resolve] 		[FAILED     ] org.mortbay.jetty#jetty;6.1.14!jetty.jar: /home/jenkins/.ivy2/cache/org.mortbay.jetty/jetty/jars/jetty-6.1.14.jar.part
(No such file or directory) (2120ms)
[ivy:resolve] 		[FAILED     ] org.mortbay.jetty#jetty-util;6.1.14!jetty-util.jar: /home/jenkins/.ivy2/cache/org.mortbay.jetty/jetty-util/jars/jetty-util-6.1.14.jar.part
(No such file or directory) (2209ms)
[ivy:resolve] 		[FAILED     ] tomcat#jasper-runtime;5.5.12!jasper-runtime.jar: Downloaded
file size doesn't match expected Content Length for http://repo1.maven.org/maven2/tomcat/jasper-runtime/5.5.12/jasper-runtime-5.5.12.jar.
Please retry. (1232ms)
[ivy:resolve] 		[FAILED     ] tomcat#jasper-runtime;5.5.12!jasper-runtime.jar:  (0ms)
[ivy:resolve] 	==== local: tried
[ivy:resolve] 	  /home/jenkins/.ivy2/local/tomcat/jasper-runtime/5.5.12/jars/jasper-runtime.jar
[ivy:resolve] 	==== apache-snapshot: tried
[ivy:resolve] 	  https://repository.apache.org/content/repositories/snapshots/tomcat/jasper-runtime/5.5.12/jasper-runtime-5.5.12.jar
[ivy:resolve] 	==== maven2: tried
[ivy:resolve] 	  http://repo1.maven.org/maven2/tomcat/jasper-runtime/5.5.12/jasper-runtime-5.5.12.jar
[ivy:resolve] 	==== datanucleus-repo: tried
[ivy:resolve] 	  http://www.datanucleus.org/downloads/maven2/tomcat/jasper-runtime/5.5.12/jasper-runtime-5.5.12.jar
[ivy:resolve] 	==== hadoop-source: tried
[ivy:resolve] 	  http://mirror.facebook.net/facebook/hive-deps/hadoop/core/jasper-runtime-5.5.12/jasper-runtime-5.5.12.jar
[ivy:resolve] 	==== hadoop-source2: tried
[ivy:resolve] 	  http://archive.cloudera.com/hive-deps/hadoop/core/jasper-runtime-5.5.12/jasper-runtime-5.5.12.jar
[ivy:resolve] 		[FAILED     ] tomcat#jasper-compiler;5.5.12!jasper-compiler.jar: /home/jenkins/.ivy2/cache/tomcat/jasper-compiler/jars/jasper-compiler-5.5.12.jar.part
(No such file or directory) (2056ms)
[ivy:resolve] 		[FAILED     ] org.mortbay.jetty#jsp-api-2.1;6.1.14!jsp-api-2.1.jar: Downloaded
file size doesn't match expected Content Length for http://repo1.maven.org/maven2/org/mortbay/jetty/jsp-api-2.1/6.1.14/jsp-api-2.1-6.1.14.jar.
Please retry. (1386ms)
[ivy:resolve] 		[FAILED     ] org.mortbay.jetty#jsp-api-2.1;6.1.14!jsp-api-2.1.jar:  (0ms)
[ivy:resolve] 	==== local: tried
[ivy:resolve] 	  /home/jenkins/.ivy2/local/org.mortbay.jetty/jsp-api-2.1/6.1.14/jars/jsp-api-2.1.jar
[ivy:resolve] 	==== apache-snapshot: tried
[ivy:resolve] 	  https://repository.apache.org/content/repositories/snapshots/org/mortbay/jetty/jsp-api-2.1/6.1.14/jsp-api-2.1-6.1.14.jar
[ivy:resolve] 	==== maven2: tried
[ivy:resolve] 	  http://repo1.maven.org/maven2/org/mortbay/jetty/jsp-api-2.1/6.1.14/jsp-api-2.1-6.1.14.jar
[ivy:resolve] 	==== datanucleus-repo: tried
[ivy:resolve] 	  http://www.datanucleus.org/downloads/maven2/org/mortbay/jetty/jsp-api-2.1/6.1.14/jsp-api-2.1-6.1.14.jar
[ivy:resolve] 	==== hadoop-source: tried
[ivy:resolve] 	  http://mirror.facebook.net/facebook/hive-deps/hadoop/core/jsp-api-2.1-6.1.14/jsp-api-2.1-6.1.14.jar
[ivy:resolve] 	==== hadoop-source2: tried
[ivy:resolve] 	  http://archive.cloudera.com/hive-deps/hadoop/core/jsp-api-2.1-6.1.14/jsp-api-2.1-6.1.14.jar
[ivy:resolve] 		[FAILED     ] org.mortbay.jetty#jsp-2.1;6.1.14!jsp-2.1.jar: /home/jenkins/.ivy2/cache/org.mortbay.jetty/jsp-2.1/jars/jsp-2.1-6.1.14.jar.part
(No such file or directory) (2055ms)
[ivy:resolve] 		[FAILED     ] commons-el#commons-el;1.0!commons-el.jar: /home/jenkins/.ivy2/cache/commons-el/commons-el/jars/commons-el-1.0.jar.part
(No such file or directory) (2212ms)
[ivy:resolve] 		[FAILED     ] net.java.dev.jets3t#jets3t;0.7.1!jets3t.jar: /home/jenkins/.ivy2/cache/net.java.dev.jets3t/jets3t/jars/jets3t-0.7.1.jar.part
(No such file or directory) (2462ms)
[ivy:resolve] 		[FAILED     ] junit#junit;4.5!junit.jar: /home/jenkins/.ivy2/cache/junit/junit/jars/junit-4.5.jar.part
(No such file or directory) (2458ms)
[ivy:resolve] 		[FAILED     ] hsqldb#hsqldb;1.8.0.10!hsqldb.jar: Downloaded file size doesn't
match expected Content Length for http://repo1.maven.org/maven2/hsqldb/hsqldb/1.8.0.10/hsqldb-1.8.0.10.jar.
Please retry. (1278ms)
[ivy:resolve] 		[FAILED     ] hsqldb#hsqldb;1.8.0.10!hsqldb.jar:  (0ms)
[ivy:resolve] 	==== local: tried
[ivy:resolve] 	  /home/jenkins/.ivy2/local/hsqldb/hsqldb/1.8.0.10/jars/hsqldb.jar
[ivy:resolve] 	==== apache-snapshot: tried
[ivy:resolve] 	  https://repository.apache.org/content/repositories/snapshots/hsqldb/hsqldb/1.8.0.10/hsqldb-1.8.0.10.jar
[ivy:resolve] 	==== maven2: tried
[ivy:resolve] 	  http://repo1.maven.org/maven2/hsqldb/hsqldb/1.8.0.10/hsqldb-1.8.0.10.jar
[ivy:resolve] 	==== datanucleus-repo: tried
[ivy:resolve] 	  http://www.datanucleus.org/downloads/maven2/hsqldb/hsqldb/1.8.0.10/hsqldb-1.8.0.10.jar
[ivy:resolve] 	==== hadoop-source: tried
[ivy:resolve] 	  http://mirror.facebook.net/facebook/hive-deps/hadoop/core/hsqldb-1.8.0.10/hsqldb-1.8.0.10.jar
[ivy:resolve] 	==== hadoop-source2: tried
[ivy:resolve] 	  http://archive.cloudera.com/hive-deps/hadoop/core/hsqldb-1.8.0.10/hsqldb-1.8.0.10.jar
[ivy:resolve] 		[FAILED     ] oro#oro;2.0.8!oro.jar: /home/jenkins/.ivy2/cache/oro/oro/jars/oro-2.0.8.jar.part
(No such file or directory) (2157ms)
[ivy:resolve] 		[FAILED     ] org.eclipse.jdt#core;3.1.1!core.jar: Downloaded file size doesn't
match expected Content Length for http://repo1.maven.org/maven2/org/eclipse/jdt/core/3.1.1/core-3.1.1.jar.
Please retry. (1207ms)
[ivy:resolve] 		[FAILED     ] org.eclipse.jdt#core;3.1.1!core.jar:  (0ms)
[ivy:resolve] 	==== local: tried
[ivy:resolve] 	  /home/jenkins/.ivy2/local/org.eclipse.jdt/core/3.1.1/jars/core.jar
[ivy:resolve] 	==== apache-snapshot: tried
[ivy:resolve] 	  https://repository.apache.org/content/repositories/snapshots/org/eclipse/jdt/core/3.1.1/core-3.1.1.jar
[ivy:resolve] 	==== maven2: tried
[ivy:resolve] 	  http://repo1.maven.org/maven2/org/eclipse/jdt/core/3.1.1/core-3.1.1.jar
[ivy:resolve] 	==== datanucleus-repo: tried
[ivy:resolve] 	  http://www.datanucleus.org/downloads/maven2/org/eclipse/jdt/core/3.1.1/core-3.1.1.jar
[ivy:resolve] 	==== hadoop-source: tried
[ivy:resolve] 	  http://mirror.facebook.net/facebook/hive-deps/hadoop/core/core-3.1.1/core-3.1.1.jar
[ivy:resolve] 	==== hadoop-source2: tried
[ivy:resolve] 	  http://archive.cloudera.com/hive-deps/hadoop/core/core-3.1.1/core-3.1.1.jar
[ivy:resolve] 		[FAILED     ] ant#ant;1.6.5!ant.jar: /home/jenkins/.ivy2/cache/ant/ant/jars/ant-1.6.5.jar.part
(No such file or directory) (2378ms)
[ivy:resolve] 		[FAILED     ] org.apache.mina#mina-core;2.0.0-M5!mina-core.jar(bundle): Downloaded
file size doesn't match expected Content Length for http://repo1.maven.org/maven2/org/apache/mina/mina-core/2.0.0-M5/mina-core-2.0.0-M5.jar.
Please retry. (1486ms)
[ivy:resolve] 		[FAILED     ] org.apache.mina#mina-core;2.0.0-M5!mina-core.jar(bundle):  (0ms)
[ivy:resolve] 	==== local: tried
[ivy:resolve] 	  /home/jenkins/.ivy2/local/org.apache.mina/mina-core/2.0.0-M5/bundles/mina-core.jar
[ivy:resolve] 	==== apache-snapshot: tried
[ivy:resolve] 	  https://repository.apache.org/content/repositories/snapshots/org/apache/mina/mina-core/2.0.0-M5/mina-core-2.0.0-M5.jar
[ivy:resolve] 	==== maven2: tried
[ivy:resolve] 	  http://repo1.maven.org/maven2/org/apache/mina/mina-core/2.0.0-M5/mina-core-2.0.0-M5.jar
[ivy:resolve] 	==== datanucleus-repo: tried
[ivy:resolve] 	  http://www.datanucleus.org/downloads/maven2/org/apache/mina/mina-core/2.0.0-M5/mina-core-2.0.0-M5.jar
[ivy:resolve] 	==== hadoop-source: tried
[ivy:resolve] 	  http://mirror.facebook.net/facebook/hive-deps/hadoop/core/mina-core-2.0.0-M5/mina-core-2.0.0-M5.jar
[ivy:resolve] 	==== hadoop-source2: tried
[ivy:resolve] 	  http://archive.cloudera.com/hive-deps/hadoop/core/mina-core-2.0.0-M5/mina-core-2.0.0-M5.jar
[ivy:resolve] 		[FAILED     ] org.apache.ftpserver#ftpserver-core;1.0.0!ftpserver-core.jar(bundle):
/home/jenkins/.ivy2/cache/org.apache.ftpserver/ftpserver-core/bundles/ftpserver-core-1.0.0.jar.part
(No such file or directory) (1640ms)
[ivy:resolve] 		::::::::::::::::::::::::::::::::::::::::::::::
[ivy:resolve] 		::          UNRESOLVED DEPENDENCIES         ::
[ivy:resolve] 		::::::::::::::::::::::::::::::::::::::::::::::
[ivy:resolve] 		:: org.slf4j#slf4j-api;1.5.2: not found
[ivy:resolve] 		::::::::::::::::::::::::::::::::::::::::::::::
[ivy:resolve] 		::::::::::::::::::::::::::::::::::::::::::::::
[ivy:resolve] 		::              FAILED DOWNLOADS            ::
[ivy:resolve] 		:: ^ see resolution messages for details  ^ ::
[ivy:resolve] 		::::::::::::::::::::::::::::::::::::::::::::::
[ivy:resolve] 		:: tomcat#jasper-runtime;5.5.12!jasper-runtime.jar
[ivy:resolve] 		:: org.mortbay.jetty#jsp-api-2.1;6.1.14!jsp-api-2.1.jar
[ivy:resolve] 		:: org.eclipse.jdt#core;3.1.1!core.jar
[ivy:resolve] 		:: hsqldb#hsqldb;1.8.0.10!hsqldb.jar
[ivy:resolve] 		:: org.apache.hadoop#hadoop-test;0.20.2!hadoop-test.jar
[ivy:resolve] 		:: org.apache.mina#mina-core;2.0.0-M5!mina-core.jar(bundle)
[ivy:resolve] 		::::::::::::::::::::::::::::::::::::::::::::::
[ivy:resolve] 
[ivy:resolve] :: USE VERBOSE OR DEBUG MESSAGE LEVEL FOR MORE DETAILS

BUILD FAILED
<https://builds.apache.org/job/Hive-0.9.1-SNAPSHOT-h0.21-keepgoing=false/ws/hive/build.xml>:302:
The following error occurred while executing this line:
<https://builds.apache.org/job/Hive-0.9.1-SNAPSHOT-h0.21-keepgoing=false/ws/hive/build.xml>:152:
The following error occurred while executing this line:
<https://builds.apache.org/job/Hive-0.9.1-SNAPSHOT-h0.21-keepgoing=false/ws/hive/shims/build.xml>:85:
The following error occurred while executing this line:
<https://builds.apache.org/job/Hive-0.9.1-SNAPSHOT-h0.21-keepgoing=false/ws/hive/shims/build.xml>:88:
The following error occurred while executing this line:
<https://builds.apache.org/job/Hive-0.9.1-SNAPSHOT-h0.21-keepgoing=false/ws/hive/shims/build.xml>:60:
The following error occurred while executing this line:
<https://builds.apache.org/job/Hive-0.9.1-SNAPSHOT-h0.21-keepgoing=false/ws/hive/build-common.xml>:164:
impossible to resolve dependencies:
	resolve failed - see output for details

Total time: 2 minutes 44 seconds
Build step 'Invoke Ant' marked build as failure
Archiving artifacts
Recording test results

Mime
View raw message