hive-dev mailing list archives

Site index · List index
Message view « Date » · « Thread »
Top « Date » · « Thread »
From Apache Jenkins Server <jenk...@builds.apache.org>
Subject Build failed in Jenkins: Hive-0.9.1-SNAPSHOT-h0.21-keepgoing=false #19
Date Thu, 17 May 2012 16:08:22 GMT
See <https://builds.apache.org/job/Hive-0.9.1-SNAPSHOT-h0.21-keepgoing=false/19/>

------------------------------------------
[...truncated 5630 lines...]
[ivy:resolve] 	[SUCCESSFUL ] org.eclipse.jdt#core;3.1.1!core.jar (1142ms)
[ivy:resolve] downloading http://repo1.maven.org/maven2/ant/ant/1.6.5/ant-1.6.5.jar ...
[ivy:resolve] ....................................................................................................
(1009kB)
[ivy:resolve] .. (0kB)
[ivy:resolve] 	[SUCCESSFUL ] ant#ant;1.6.5!ant.jar (956ms)
[ivy:resolve] downloading http://repo1.maven.org/maven2/commons-logging/commons-logging/1.1.1/commons-logging-1.1.1.jar
...
[ivy:resolve] ... (59kB)
[ivy:resolve] .. (0kB)
[ivy:resolve] 	[SUCCESSFUL ] commons-logging#commons-logging;1.1.1!commons-logging.jar (1177ms)
[ivy:resolve] downloading http://repo1.maven.org/maven2/org/apache/ftpserver/ftplet-api/1.0.0/ftplet-api-1.0.0.jar
...
[ivy:resolve] ... (22kB)
[ivy:resolve] .. (0kB)
[ivy:resolve] 	[SUCCESSFUL ] org.apache.ftpserver#ftplet-api;1.0.0!ftplet-api.jar(bundle)
(955ms)
[ivy:resolve] downloading http://repo1.maven.org/maven2/org/apache/mina/mina-core/2.0.0-M5/mina-core-2.0.0-M5.jar
...
[ivy:resolve] .................. (622kB)
[ivy:resolve] .. (0kB)
[ivy:resolve] 	[SUCCESSFUL ] org.apache.mina#mina-core;2.0.0-M5!mina-core.jar(bundle) (1240ms)
[ivy:resolve] downloading http://repo1.maven.org/maven2/org/apache/ftpserver/ftpserver-core/1.0.0/ftpserver-core-1.0.0.jar
...
[ivy:resolve] .............. (264kB)
[ivy:resolve] .. (0kB)
[ivy:resolve] 	[SUCCESSFUL ] org.apache.ftpserver#ftpserver-core;1.0.0!ftpserver-core.jar(bundle)
(1446ms)
[ivy:resolve] downloading http://repo1.maven.org/maven2/org/apache/ftpserver/ftpserver-deprecated/1.0.0-M2/ftpserver-deprecated-1.0.0-M2.jar
...
[ivy:resolve] .. (31kB)
[ivy:resolve] .. (0kB)
[ivy:resolve] 	[SUCCESSFUL ] org.apache.ftpserver#ftpserver-deprecated;1.0.0-M2!ftpserver-deprecated.jar
(809ms)
[ivy:resolve] downloading http://repo1.maven.org/maven2/org/slf4j/slf4j-api/1.5.2/slf4j-api-1.5.2.jar
...
[ivy:resolve] .. (16kB)
[ivy:resolve] .. (0kB)
[ivy:resolve] 	[SUCCESSFUL ] org.slf4j#slf4j-api;1.5.2!slf4j-api.jar (998ms)

ivy-retrieve-hadoop-shim:
     [echo] Project: shims
    [javac] Compiling 16 source files to <https://builds.apache.org/job/Hive-0.9.1-SNAPSHOT-h0.21-keepgoing=false/19/artifact/hive/build/shims/classes>
    [javac] Note: Some input files use or override a deprecated API.
    [javac] Note: Recompile with -Xlint:deprecation for details.
    [javac] Note: <https://builds.apache.org/job/Hive-0.9.1-SNAPSHOT-h0.21-keepgoing=false/ws/hive/shims/src/0.20/java/org/apache/hadoop/hive/shims/Hadoop20Shims.java>
uses unchecked or unsafe operations.
    [javac] Note: Recompile with -Xlint:unchecked for details.
     [echo] Building shims 0.20S

build_shims:
     [echo] Project: shims
     [echo] Compiling <https://builds.apache.org/job/Hive-0.9.1-SNAPSHOT-h0.21-keepgoing=false/ws/hive/shims/src/common/java;/home/jenkins/jenkins-slave/workspace/Hive-0.9.1-SNAPSHOT-h0.21-keepgoing=false/hive/shims/src/common-secure/java;/home/jenkins/jenkins-slave/workspace/Hive-0.9.1-SNAPSHOT-h0.21-keepgoing=false/hive/shims/src/0.20S/java>
against hadoop 1.0.0 (<https://builds.apache.org/job/Hive-0.9.1-SNAPSHOT-h0.21-keepgoing=false/19/artifact/hive/build/hadoopcore/hadoop-1.0.0)>

ivy-init-settings:
     [echo] Project: shims

ivy-resolve-hadoop-shim:
     [echo] Project: shims
[ivy:resolve] :: loading settings :: file = <https://builds.apache.org/job/Hive-0.9.1-SNAPSHOT-h0.21-keepgoing=false/ws/hive/ivy/ivysettings.xml>
[ivy:resolve] downloading http://repo1.maven.org/maven2/org/apache/hadoop/hadoop-core/1.0.0/hadoop-core-1.0.0.jar
...
[ivy:resolve] ..................................................................................................................................................................................................................................................................
(3652kB)
[ivy:resolve] .. (0kB)
[ivy:resolve] 	[SUCCESSFUL ] org.apache.hadoop#hadoop-core;1.0.0!hadoop-core.jar (2759ms)
[ivy:resolve] downloading http://repo1.maven.org/maven2/org/apache/hadoop/hadoop-tools/1.0.0/hadoop-tools-1.0.0.jar
...
[ivy:resolve] ............. (281kB)
[ivy:resolve] .. (0kB)
[ivy:resolve] 	[SUCCESSFUL ] org.apache.hadoop#hadoop-tools;1.0.0!hadoop-tools.jar (1479ms)
[ivy:resolve] downloading http://repo1.maven.org/maven2/org/apache/hadoop/hadoop-test/1.0.0/hadoop-test-1.0.0.jar
...
[ivy:resolve] ..............................................................................................................................................
(2471kB)
[ivy:resolve] .. (0kB)
[ivy:resolve] 	[SUCCESSFUL ] org.apache.hadoop#hadoop-test;1.0.0!hadoop-test.jar (1886ms)
[ivy:resolve] downloading http://repo1.maven.org/maven2/commons-cli/commons-cli/1.2/commons-cli-1.2.jar
...
[ivy:resolve] .... (40kB)
[ivy:resolve] .. (0kB)
[ivy:resolve] 	[SUCCESSFUL ] commons-cli#commons-cli;1.2!commons-cli.jar (2526ms)
[ivy:resolve] downloading http://repo1.maven.org/maven2/commons-httpclient/commons-httpclient/3.0.1/commons-httpclient-3.0.1.jar
...
[ivy:resolve] ......... (273kB)
[ivy:resolve] .. (0kB)
[ivy:resolve] downloading http://repo1.maven.org/maven2/commons-codec/commons-codec/1.4/commons-codec-1.4.jar
...
[ivy:resolve] ... (56kB)
[ivy:resolve] .. (0kB)
[ivy:resolve] 	[SUCCESSFUL ] commons-codec#commons-codec;1.4!commons-codec.jar (1999ms)
[ivy:resolve] downloading http://repo1.maven.org/maven2/commons-configuration/commons-configuration/1.6/commons-configuration-1.6.jar
...
[ivy:resolve] .......... (291kB)
[ivy:resolve] .. (0kB)
[ivy:resolve] 	[SUCCESSFUL ] commons-configuration#commons-configuration;1.6!commons-configuration.jar
(2250ms)
[ivy:resolve] downloading http://repo1.maven.org/maven2/org/mortbay/jetty/jetty/6.1.26/jetty-6.1.26.jar
...
[ivy:resolve] ..................... (527kB)
[ivy:resolve] .. (0kB)
[ivy:resolve] 	[SUCCESSFUL ] org.mortbay.jetty#jetty;6.1.26!jetty.jar (2001ms)
[ivy:resolve] downloading http://repo1.maven.org/maven2/org/mortbay/jetty/jetty-util/6.1.26/jetty-util-6.1.26.jar
...
[ivy:resolve] ........ (172kB)
[ivy:resolve] .. (0kB)
[ivy:resolve] 	[SUCCESSFUL ] org.mortbay.jetty#jetty-util;6.1.26!jetty-util.jar (2051ms)
[ivy:resolve] downloading http://repo1.maven.org/maven2/tomcat/jasper-runtime/5.5.12/jasper-runtime-5.5.12.jar
...
[ivy:resolve] .... (74kB)
[ivy:resolve] .. (0kB)
[ivy:resolve] downloading http://repo1.maven.org/maven2/tomcat/jasper-compiler/5.5.12/jasper-compiler-5.5.12.jar
...
[ivy:resolve] ............... (395kB)
[ivy:resolve] .. (0kB)
[ivy:resolve] downloading http://repo1.maven.org/maven2/org/mortbay/jetty/jsp-api-2.1/6.1.14/jsp-api-2.1-6.1.14.jar
...
[ivy:resolve] ..... (131kB)
[ivy:resolve] .. (0kB)
[ivy:resolve] downloading http://repo1.maven.org/maven2/org/mortbay/jetty/jsp-2.1/6.1.14/jsp-2.1-6.1.14.jar
...
[ivy:resolve] ......................................... (1000kB)
[ivy:resolve] .. (0kB)
[ivy:resolve] downloading http://repo1.maven.org/maven2/commons-el/commons-el/1.0/commons-el-1.0.jar
...
[ivy:resolve] .... (109kB)
[ivy:resolve] .. (0kB)
[ivy:resolve] downloading http://repo1.maven.org/maven2/net/java/dev/jets3t/jets3t/0.7.1/jets3t-0.7.1.jar
...
[ivy:resolve] ............ (368kB)
[ivy:resolve] .. (0kB)
[ivy:resolve] downloading http://repo1.maven.org/maven2/net/sf/kosmosfs/kfs/0.3/kfs-0.3.jar
...
[ivy:resolve] ... (11kB)
[ivy:resolve] .. (0kB)
[ivy:resolve] 	[SUCCESSFUL ] net.sf.kosmosfs#kfs;0.3!kfs.jar (1996ms)
[ivy:resolve] downloading http://repo1.maven.org/maven2/hsqldb/hsqldb/1.8.0.10/hsqldb-1.8.0.10.jar
...
[ivy:resolve] .................... (690kB)
[ivy:resolve] .. (0kB)
[ivy:resolve] 	[SUCCESSFUL ] hsqldb#hsqldb;1.8.0.10!hsqldb.jar (2505ms)
[ivy:resolve] downloading http://repo1.maven.org/maven2/oro/oro/2.0.8/oro-2.0.8.jar ...
[ivy:resolve] .... (63kB)
[ivy:resolve] .. (0kB)
[ivy:resolve] 	[SUCCESSFUL ] oro#oro;2.0.8!oro.jar (1743ms)
[ivy:resolve] downloading http://repo1.maven.org/maven2/org/eclipse/jdt/core/3.1.1/core-3.1.1.jar
...
[ivy:resolve] .................................................................................................................................................................................................................
(3483kB)
[ivy:resolve] .. (0kB)
[ivy:resolve] downloading http://repo1.maven.org/maven2/org/codehaus/jackson/jackson-mapper-asl/1.0.1/jackson-mapper-asl-1.0.1.jar
...
[ivy:resolve] .......... (264kB)
[ivy:resolve] .. (0kB)
[ivy:resolve] 	[SUCCESSFUL ] org.codehaus.jackson#jackson-mapper-asl;1.0.1!jackson-mapper-asl.jar
(1010ms)
[ivy:resolve] downloading http://repo1.maven.org/maven2/junit/junit/3.8.1/junit-3.8.1.jar
...
[ivy:resolve] ...... (118kB)
[ivy:resolve] .. (0kB)
[ivy:resolve] 	[SUCCESSFUL ] junit#junit;3.8.1!junit.jar (1487ms)
[ivy:resolve] downloading http://repo1.maven.org/maven2/commons-logging/commons-logging/1.1.1/commons-logging-1.1.1.jar
...
[ivy:resolve] ... (59kB)
[ivy:resolve] .. (0kB)
[ivy:resolve] 	[SUCCESSFUL ] commons-logging#commons-logging;1.1.1!commons-logging.jar (2002ms)
[ivy:resolve] downloading http://repo1.maven.org/maven2/commons-digester/commons-digester/1.8/commons-digester-1.8.jar
...
[ivy:resolve] ..... (140kB)
[ivy:resolve] .. (0kB)
[ivy:resolve] 	[SUCCESSFUL ] commons-digester#commons-digester;1.8!commons-digester.jar (2269ms)
[ivy:resolve] downloading http://repo1.maven.org/maven2/commons-beanutils/commons-beanutils-core/1.8.0/commons-beanutils-core-1.8.0.jar
...
[ivy:resolve] ....... (201kB)
[ivy:resolve] .. (0kB)
[ivy:resolve] 	[SUCCESSFUL ] commons-beanutils#commons-beanutils-core;1.8.0!commons-beanutils-core.jar
(2004ms)
[ivy:resolve] downloading http://repo1.maven.org/maven2/commons-beanutils/commons-beanutils/1.7.0/commons-beanutils-1.7.0.jar
...
[ivy:resolve] ....... (184kB)
[ivy:resolve] .. (0kB)
[ivy:resolve] 	[SUCCESSFUL ] commons-beanutils#commons-beanutils;1.7.0!commons-beanutils.jar
(1994ms)
[ivy:resolve] downloading http://repo1.maven.org/maven2/org/mortbay/jetty/servlet-api/2.5-20081211/servlet-api-2.5-20081211.jar
...
[ivy:resolve] ..... (130kB)
[ivy:resolve] .. (0kB)
[ivy:resolve] 	[SUCCESSFUL ] org.mortbay.jetty#servlet-api;2.5-20081211!servlet-api.jar (1973ms)
[ivy:resolve] downloading http://repo1.maven.org/maven2/org/codehaus/jackson/jackson-core-asl/1.0.1/jackson-core-asl-1.0.1.jar
...
[ivy:resolve] ..... (132kB)
[ivy:resolve] .. (0kB)
[ivy:resolve] 	[SUCCESSFUL ] org.codehaus.jackson#jackson-core-asl;1.0.1!jackson-core-asl.jar
(2265ms)
[ivy:resolve] downloading http://repo1.maven.org/maven2/org/slf4j/slf4j-api/1.5.2/slf4j-api-1.5.2.jar
...
[ivy:resolve] ... (16kB)
[ivy:resolve] .. (0kB)
[ivy:resolve] 
[ivy:resolve] :: problems summary ::
[ivy:resolve] :::: WARNINGS
[ivy:resolve] 	problem while downloading module descriptor: http://repo1.maven.org/maven2/org/apache/commons/commons-parent/14/commons-parent-14.pom:
/home/jenkins/.ivy2/cache/org.apache.commons/commons-parent/ivy-14.xml.original.part (No such
file or directory) (1829ms)
[ivy:resolve] 	io problem while parsing ivy file: http://repo1.maven.org/maven2/org/apache/commons/commons-math/2.1/commons-math-2.1.pom:
Impossible to load parent for file:/home/jenkins/.ivy2/cache/org.apache.commons/commons-math/ivy-2.1.xml.original.
Parent=org.apache.commons#commons-parent;14
[ivy:resolve] 		module not found: org.apache.commons#commons-math;2.1
[ivy:resolve] 	==== local: tried
[ivy:resolve] 	  /home/jenkins/.ivy2/local/org.apache.commons/commons-parent/14/ivys/ivy.xml
[ivy:resolve] 	  -- artifact org.apache.commons#commons-parent;14!commons-parent.jar:
[ivy:resolve] 	  /home/jenkins/.ivy2/local/org.apache.commons/commons-parent/14/jars/commons-parent.jar
[ivy:resolve] 	==== apache-snapshot: tried
[ivy:resolve] 	  https://repository.apache.org/content/repositories/snapshots/org/apache/commons/commons-parent/14/commons-parent-14.pom
[ivy:resolve] 	  -- artifact org.apache.commons#commons-parent;14!commons-parent.jar:
[ivy:resolve] 	  https://repository.apache.org/content/repositories/snapshots/org/apache/commons/commons-parent/14/commons-parent-14.jar
[ivy:resolve] 	==== maven2: tried
[ivy:resolve] 	  http://repo1.maven.org/maven2/org/apache/commons/commons-parent/14/commons-parent-14.pom
[ivy:resolve] 	==== datanucleus-repo: tried
[ivy:resolve] 	  -- artifact org.apache.commons#commons-math;2.1!commons-math.jar:
[ivy:resolve] 	  http://www.datanucleus.org/downloads/maven2/org/apache/commons/commons-math/2.1/commons-math-2.1.jar
[ivy:resolve] 	==== hadoop-source: tried
[ivy:resolve] 	  -- artifact org.apache.commons#commons-math;2.1!commons-math.jar:
[ivy:resolve] 	  http://mirror.facebook.net/facebook/hive-deps/hadoop/core/commons-math-2.1/commons-math-2.1.jar
[ivy:resolve] 	==== hadoop-source2: tried
[ivy:resolve] 	  -- artifact org.apache.commons#commons-math;2.1!commons-math.jar:
[ivy:resolve] 	  http://archive.cloudera.com/hive-deps/hadoop/core/commons-math-2.1/commons-math-2.1.jar
[ivy:resolve] 	problem while downloading module descriptor: http://repo1.maven.org/maven2/org/apache/commons/commons-parent/9/commons-parent-9.pom:
/home/jenkins/.ivy2/cache/org.apache.commons/commons-parent/ivy-9.xml.original.part (No such
file or directory) (2002ms)
[ivy:resolve] 	io problem while parsing ivy file: http://repo1.maven.org/maven2/commons-collections/commons-collections/3.2.1/commons-collections-3.2.1.pom:
Impossible to load parent for file:/home/jenkins/.ivy2/cache/commons-collections/commons-collections/ivy-3.2.1.xml.original.
Parent=org.apache.commons#commons-parent;9
[ivy:resolve] 		module not found: commons-collections#commons-collections;3.2.1
[ivy:resolve] 	==== local: tried
[ivy:resolve] 	  /home/jenkins/.ivy2/local/org.apache.commons/commons-parent/9/ivys/ivy.xml
[ivy:resolve] 	  -- artifact org.apache.commons#commons-parent;9!commons-parent.jar:
[ivy:resolve] 	  /home/jenkins/.ivy2/local/org.apache.commons/commons-parent/9/jars/commons-parent.jar
[ivy:resolve] 	==== apache-snapshot: tried
[ivy:resolve] 	  https://repository.apache.org/content/repositories/snapshots/org/apache/commons/commons-parent/9/commons-parent-9.pom
[ivy:resolve] 	  -- artifact org.apache.commons#commons-parent;9!commons-parent.jar:
[ivy:resolve] 	  https://repository.apache.org/content/repositories/snapshots/org/apache/commons/commons-parent/9/commons-parent-9.jar
[ivy:resolve] 	==== maven2: tried
[ivy:resolve] 	  http://repo1.maven.org/maven2/org/apache/commons/commons-parent/9/commons-parent-9.pom
[ivy:resolve] 	==== datanucleus-repo: tried
[ivy:resolve] 	  -- artifact commons-collections#commons-collections;3.2.1!commons-collections.jar:
[ivy:resolve] 	  http://www.datanucleus.org/downloads/maven2/commons-collections/commons-collections/3.2.1/commons-collections-3.2.1.jar
[ivy:resolve] 	==== hadoop-source: tried
[ivy:resolve] 	  -- artifact commons-collections#commons-collections;3.2.1!commons-collections.jar:
[ivy:resolve] 	  http://mirror.facebook.net/facebook/hive-deps/hadoop/core/commons-collections-3.2.1/commons-collections-3.2.1.jar
[ivy:resolve] 	==== hadoop-source2: tried
[ivy:resolve] 	  -- artifact commons-collections#commons-collections;3.2.1!commons-collections.jar:
[ivy:resolve] 	  http://archive.cloudera.com/hive-deps/hadoop/core/commons-collections-3.2.1/commons-collections-3.2.1.jar
[ivy:resolve] 		[FAILED     ] commons-httpclient#commons-httpclient;3.0.1!commons-httpclient.jar:
/home/jenkins/.ivy2/cache/commons-httpclient/commons-httpclient/jars/commons-httpclient-3.0.1.jar.part
(No such file or directory) (2465ms)
[ivy:resolve] 		[FAILED     ] tomcat#jasper-runtime;5.5.12!jasper-runtime.jar: /home/jenkins/.ivy2/cache/tomcat/jasper-runtime/jars/jasper-runtime-5.5.12.jar.part
(No such file or directory) (2193ms)
[ivy:resolve] 		[FAILED     ] tomcat#jasper-compiler;5.5.12!jasper-compiler.jar: /home/jenkins/.ivy2/cache/tomcat/jasper-compiler/jars/jasper-compiler-5.5.12.jar.part
(No such file or directory) (2241ms)
[ivy:resolve] 		[FAILED     ] org.mortbay.jetty#jsp-api-2.1;6.1.14!jsp-api-2.1.jar: /home/jenkins/.ivy2/cache/org.mortbay.jetty/jsp-api-2.1/jars/jsp-api-2.1-6.1.14.jar.part
(No such file or directory) (2644ms)
[ivy:resolve] 		[FAILED     ] org.mortbay.jetty#jsp-2.1;6.1.14!jsp-2.1.jar: /home/jenkins/.ivy2/cache/org.mortbay.jetty/jsp-2.1/jars/jsp-2.1-6.1.14.jar.part
(No such file or directory) (2289ms)
[ivy:resolve] 		[FAILED     ] commons-el#commons-el;1.0!commons-el.jar: /home/jenkins/.ivy2/cache/commons-el/commons-el/jars/commons-el-1.0.jar.part
(No such file or directory) (1994ms)
[ivy:resolve] 		[FAILED     ] net.java.dev.jets3t#jets3t;0.7.1!jets3t.jar: /home/jenkins/.ivy2/cache/net.java.dev.jets3t/jets3t/jars/jets3t-0.7.1.jar.part
(No such file or directory) (2250ms)
[ivy:resolve] 		[FAILED     ] org.eclipse.jdt#core;3.1.1!core.jar: invalid sha1: expected=88c83ce444cf46d02494da37c9fa1eebc9ce9cea
computed=11a2ae1240a9c6cb0c4886c35f4797405a256f10 (2768ms)
[ivy:resolve] 		[FAILED     ] org.eclipse.jdt#core;3.1.1!core.jar:  (0ms)
[ivy:resolve] 	==== local: tried
[ivy:resolve] 	  /home/jenkins/.ivy2/local/org.eclipse.jdt/core/3.1.1/jars/core.jar
[ivy:resolve] 	==== apache-snapshot: tried
[ivy:resolve] 	  https://repository.apache.org/content/repositories/snapshots/org/eclipse/jdt/core/3.1.1/core-3.1.1.jar
[ivy:resolve] 	==== maven2: tried
[ivy:resolve] 	  http://repo1.maven.org/maven2/org/eclipse/jdt/core/3.1.1/core-3.1.1.jar
[ivy:resolve] 	==== datanucleus-repo: tried
[ivy:resolve] 	  http://www.datanucleus.org/downloads/maven2/org/eclipse/jdt/core/3.1.1/core-3.1.1.jar
[ivy:resolve] 	==== hadoop-source: tried
[ivy:resolve] 	  http://mirror.facebook.net/facebook/hive-deps/hadoop/core/core-3.1.1/core-3.1.1.jar
[ivy:resolve] 	==== hadoop-source2: tried
[ivy:resolve] 	  http://archive.cloudera.com/hive-deps/hadoop/core/core-3.1.1/core-3.1.1.jar
[ivy:resolve] 		[FAILED     ] org.slf4j#slf4j-api;1.5.2!slf4j-api.jar: /home/jenkins/.ivy2/cache/org.slf4j/slf4j-api/jars/slf4j-api-1.5.2.jar.part
(No such file or directory) (1478ms)
[ivy:resolve] 		::::::::::::::::::::::::::::::::::::::::::::::
[ivy:resolve] 		::          UNRESOLVED DEPENDENCIES         ::
[ivy:resolve] 		::::::::::::::::::::::::::::::::::::::::::::::
[ivy:resolve] 		:: org.apache.commons#commons-math;2.1: not found
[ivy:resolve] 		:: commons-collections#commons-collections;3.2.1: not found
[ivy:resolve] 		::::::::::::::::::::::::::::::::::::::::::::::
[ivy:resolve] 		::::::::::::::::::::::::::::::::::::::::::::::
[ivy:resolve] 		::              FAILED DOWNLOADS            ::
[ivy:resolve] 		:: ^ see resolution messages for details  ^ ::
[ivy:resolve] 		::::::::::::::::::::::::::::::::::::::::::::::
[ivy:resolve] 		:: org.eclipse.jdt#core;3.1.1!core.jar
[ivy:resolve] 		::::::::::::::::::::::::::::::::::::::::::::::
[ivy:resolve] 
[ivy:resolve] :: USE VERBOSE OR DEBUG MESSAGE LEVEL FOR MORE DETAILS

BUILD FAILED
<https://builds.apache.org/job/Hive-0.9.1-SNAPSHOT-h0.21-keepgoing=false/ws/hive/build.xml>:302:
The following error occurred while executing this line:
<https://builds.apache.org/job/Hive-0.9.1-SNAPSHOT-h0.21-keepgoing=false/ws/hive/build.xml>:152:
The following error occurred while executing this line:
<https://builds.apache.org/job/Hive-0.9.1-SNAPSHOT-h0.21-keepgoing=false/ws/hive/shims/build.xml>:85:
The following error occurred while executing this line:
<https://builds.apache.org/job/Hive-0.9.1-SNAPSHOT-h0.21-keepgoing=false/ws/hive/shims/build.xml>:88:
The following error occurred while executing this line:
<https://builds.apache.org/job/Hive-0.9.1-SNAPSHOT-h0.21-keepgoing=false/ws/hive/shims/build.xml>:60:
The following error occurred while executing this line:
<https://builds.apache.org/job/Hive-0.9.1-SNAPSHOT-h0.21-keepgoing=false/ws/hive/build-common.xml>:164:
impossible to resolve dependencies:
	resolve failed - see output for details

Total time: 6 minutes 28 seconds
Build step 'Invoke Ant' marked build as failure
Archiving artifacts
Recording test results

Mime
View raw message