hive-dev mailing list archives

Site index · List index
Message view « Date » · « Thread »
Top « Date » · « Thread »
From Apache Jenkins Server <jenk...@builds.apache.org>
Subject Build failed in Jenkins: Hive-0.9.1-SNAPSHOT-h0.21 #30
Date Mon, 28 May 2012 16:13:44 GMT
See <https://builds.apache.org/job/Hive-0.9.1-SNAPSHOT-h0.21/30/>

------------------------------------------
[...truncated 5973 lines...]
[ivy:resolve] .. (0kB)
[ivy:resolve] 	[SUCCESSFUL ] org.sonatype.sisu.inject#cglib;2.2.1-v20090111!cglib.jar (1265ms)

ivy-retrieve-hadoop-shim:
     [echo] Project: shims
    [javac] Compiling 2 source files to <https://builds.apache.org/job/Hive-0.9.1-SNAPSHOT-h0.21/30/artifact/hive/build/shims/classes>

jar:
     [echo] Project: shims
      [jar] Building jar: <https://builds.apache.org/job/Hive-0.9.1-SNAPSHOT-h0.21/30/artifact/hive/build/shims/hive-shims-0.9.1-SNAPSHOT.jar>
:: delivering :: org.apache.hive#hive-shims;0.9.1-SNAPSHOT :: 0.9.1-SNAPSHOT :: integration
:: Mon May 28 16:12:42 UTC 2012
	delivering ivy file to <https://builds.apache.org/job/Hive-0.9.1-SNAPSHOT-h0.21/30/artifact/hive/build/shims/ivy-0.9.1-SNAPSHOT.xml>
:: publishing :: org.apache.hive#hive-shims
	published hive-shims to /home/jenkins/.ivy2/local/org.apache.hive/hive-shims/0.9.1-SNAPSHOT/jars/hive-shims.jar
	published ivy to /home/jenkins/.ivy2/local/org.apache.hive/hive-shims/0.9.1-SNAPSHOT/ivys/ivy.xml

create-dirs:
     [echo] Project: common

init:
     [echo] Project: common

setup:
     [echo] Project: common

ivy-init-settings:
     [echo] Project: common

ivy-resolve:
     [echo] Project: common
[ivy:resolve] :: loading settings :: file = <https://builds.apache.org/job/Hive-0.9.1-SNAPSHOT-h0.21/ws/hive/ivy/ivysettings.xml>
[ivy:resolve] downloading /home/jenkins/.ivy2/local/org.apache.hive/hive-shims/0.9.1-SNAPSHOT/jars/hive-shims.jar
...
[ivy:resolve] ... (110kB)
[ivy:resolve] .. (0kB)
[ivy:resolve] 	[SUCCESSFUL ] org.apache.hive#hive-shims;0.9.1-SNAPSHOT!hive-shims.jar (3ms)
[ivy:resolve] downloading http://repo1.maven.org/maven2/log4j/log4j/1.2.16/log4j-1.2.16.jar
...
[ivy:resolve] .............. (470kB)
[ivy:resolve] .. (0kB)
[ivy:resolve] 	[SUCCESSFUL ] log4j#log4j;1.2.16!log4j.jar(bundle) (1266ms)
[ivy:report] Processing <https://builds.apache.org/job/Hive-0.9.1-SNAPSHOT-h0.21/30/artifact/hive/build/ivy/resolution-cache/org.apache.hive-hive-common-default.xml>
to <https://builds.apache.org/job/Hive-0.9.1-SNAPSHOT-h0.21/30/artifact/hive/build/ivy/report/org.apache.hive-hive-common-default.html>

ivy-retrieve:
     [echo] Project: common

compile:
     [echo] Project: common
    [javac] Compiling 16 source files to <https://builds.apache.org/job/Hive-0.9.1-SNAPSHOT-h0.21/30/artifact/hive/build/common/classes>
    [javac] Note: <https://builds.apache.org/job/Hive-0.9.1-SNAPSHOT-h0.21/ws/hive/common/src/java/org/apache/hadoop/hive/conf/HiveConf.java>
uses or overrides a deprecated API.
    [javac] Note: Recompile with -Xlint:deprecation for details.
     [copy] Copying 1 file to <https://builds.apache.org/job/Hive-0.9.1-SNAPSHOT-h0.21/30/artifact/hive/build/common/classes>

jar:
     [echo] Project: common
      [jar] Building jar: <https://builds.apache.org/job/Hive-0.9.1-SNAPSHOT-h0.21/30/artifact/hive/build/common/hive-common-0.9.1-SNAPSHOT.jar>
:: delivering :: org.apache.hive#hive-common;0.9.1-SNAPSHOT :: 0.9.1-SNAPSHOT :: integration
:: Mon May 28 16:12:45 UTC 2012
	delivering ivy file to <https://builds.apache.org/job/Hive-0.9.1-SNAPSHOT-h0.21/30/artifact/hive/build/common/ivy-0.9.1-SNAPSHOT.xml>
:: publishing :: org.apache.hive#hive-common
	published hive-common to /home/jenkins/.ivy2/local/org.apache.hive/hive-common/0.9.1-SNAPSHOT/jars/hive-common.jar
	published ivy to /home/jenkins/.ivy2/local/org.apache.hive/hive-common/0.9.1-SNAPSHOT/ivys/ivy.xml

create-dirs:
     [echo] Project: serde
     [copy] Warning: <https://builds.apache.org/job/Hive-0.9.1-SNAPSHOT-h0.21/ws/hive/serde/src/test/resources>
does not exist.

init:
     [echo] Project: serde

ivy-init-settings:
     [echo] Project: serde

ivy-resolve:
     [echo] Project: serde
[ivy:resolve] :: loading settings :: file = <https://builds.apache.org/job/Hive-0.9.1-SNAPSHOT-h0.21/ws/hive/ivy/ivysettings.xml>
[ivy:resolve] downloading /home/jenkins/.ivy2/local/org.apache.hive/hive-common/0.9.1-SNAPSHOT/jars/hive-common.jar
...
[ivy:resolve] .. (57kB)
[ivy:resolve] .. (0kB)
[ivy:resolve] 	[SUCCESSFUL ] org.apache.hive#hive-common;0.9.1-SNAPSHOT!hive-common.jar (30ms)
[ivy:resolve] downloading http://repo1.maven.org/maven2/org/mockito/mockito-all/1.8.2/mockito-all-1.8.2.jar
...
[ivy:resolve] .......................................................................... (1315kB)
[ivy:resolve] .. (0kB)
[ivy:resolve] 	[SUCCESSFUL ] org.mockito#mockito-all;1.8.2!mockito-all.jar (1439ms)
[ivy:resolve] downloading http://repo1.maven.org/maven2/org/apache/thrift/libfb303/0.7.0/libfb303-0.7.0.jar
...
[ivy:resolve] ......... (171kB)
[ivy:resolve] .. (0kB)
[ivy:resolve] 	[SUCCESSFUL ] org.apache.thrift#libfb303;0.7.0!libfb303.jar (1001ms)
[ivy:report] Processing <https://builds.apache.org/job/Hive-0.9.1-SNAPSHOT-h0.21/30/artifact/hive/build/ivy/resolution-cache/org.apache.hive-hive-serde-default.xml>
to <https://builds.apache.org/job/Hive-0.9.1-SNAPSHOT-h0.21/30/artifact/hive/build/ivy/report/org.apache.hive-hive-serde-default.html>

ivy-retrieve:
     [echo] Project: serde

dynamic-serde:

compile:
     [echo] Project: serde
    [javac] Compiling 280 source files to <https://builds.apache.org/job/Hive-0.9.1-SNAPSHOT-h0.21/30/artifact/hive/build/serde/classes>
    [javac] Note: Some input files use unchecked or unsafe operations.
    [javac] Note: Recompile with -Xlint:unchecked for details.
    [javac] Creating empty <https://builds.apache.org/job/Hive-0.9.1-SNAPSHOT-h0.21/30/artifact/hive/build/serde/classes/org/apache/hadoop/hive/serde2/typeinfo/package-info.class>

jar:
     [echo] Project: serde
      [jar] Building jar: <https://builds.apache.org/job/Hive-0.9.1-SNAPSHOT-h0.21/30/artifact/hive/build/serde/hive-serde-0.9.1-SNAPSHOT.jar>
:: delivering :: org.apache.hive#hive-serde;0.9.1-SNAPSHOT :: 0.9.1-SNAPSHOT :: integration
:: Mon May 28 16:12:55 UTC 2012
	delivering ivy file to <https://builds.apache.org/job/Hive-0.9.1-SNAPSHOT-h0.21/30/artifact/hive/build/serde/ivy-0.9.1-SNAPSHOT.xml>
:: publishing :: org.apache.hive#hive-serde
	published hive-serde to /home/jenkins/.ivy2/local/org.apache.hive/hive-serde/0.9.1-SNAPSHOT/jars/hive-serde.jar
	published ivy to /home/jenkins/.ivy2/local/org.apache.hive/hive-serde/0.9.1-SNAPSHOT/ivys/ivy.xml

create-dirs:
     [echo] Project: metastore
     [copy] Warning: <https://builds.apache.org/job/Hive-0.9.1-SNAPSHOT-h0.21/ws/hive/metastore/src/test/resources>
does not exist.

init:
     [echo] Project: metastore

metastore-init:
     [echo] Project: metastore
    [mkdir] Created dir: <https://builds.apache.org/job/Hive-0.9.1-SNAPSHOT-h0.21/30/artifact/hive/build/metastore/gen/antlr/gen-java/org/apache/hadoop/hive/metastore/parser>

ivy-init-settings:
     [echo] Project: metastore

ivy-resolve:
     [echo] Project: metastore
[ivy:resolve] :: loading settings :: file = <https://builds.apache.org/job/Hive-0.9.1-SNAPSHOT-h0.21/ws/hive/ivy/ivysettings.xml>
[ivy:resolve] downloading /home/jenkins/.ivy2/local/org.apache.hive/hive-serde/0.9.1-SNAPSHOT/jars/hive-serde.jar
...
[ivy:resolve] ......... (507kB)
[ivy:resolve] .. (0kB)
[ivy:resolve] 	[SUCCESSFUL ] org.apache.hive#hive-serde;0.9.1-SNAPSHOT!hive-serde.jar (7ms)
[ivy:resolve] downloading http://repo1.maven.org/maven2/org/antlr/antlr/3.0.1/antlr-3.0.1.jar
...
[ivy:resolve] ......................... (549kB)
[ivy:resolve] .. (0kB)
[ivy:resolve] 	[SUCCESSFUL ] org.antlr#antlr;3.0.1!antlr.jar (1140ms)
[ivy:resolve] downloading http://repo1.maven.org/maven2/org/antlr/antlr-runtime/3.0.1/antlr-runtime-3.0.1.jar
...
[ivy:resolve] ..... (102kB)
[ivy:resolve] .. (0kB)
[ivy:resolve] 	[SUCCESSFUL ] org.antlr#antlr-runtime;3.0.1!antlr-runtime.jar (1004ms)
[ivy:resolve] downloading http://repo1.maven.org/maven2/commons-dbcp/commons-dbcp/1.4/commons-dbcp-1.4.jar
...
[ivy:resolve] .... (156kB)
[ivy:resolve] .. (0kB)
[ivy:resolve] 	[SUCCESSFUL ] commons-dbcp#commons-dbcp;1.4!commons-dbcp.jar (972ms)
[ivy:resolve] downloading http://repo1.maven.org/maven2/commons-pool/commons-pool/1.5.4/commons-pool-1.5.4.jar
...
[ivy:resolve] .... (93kB)
[ivy:resolve] .. (0kB)
[ivy:resolve] 	[SUCCESSFUL ] commons-pool#commons-pool;1.5.4!commons-pool.jar (999ms)
[ivy:resolve] downloading http://repo1.maven.org/maven2/org/datanucleus/datanucleus-connectionpool/2.0.3/datanucleus-connectionpool-2.0.3.jar
...
[ivy:resolve] .. (16kB)
[ivy:resolve] .. (0kB)
[ivy:resolve] 	[SUCCESSFUL ] org.datanucleus#datanucleus-connectionpool;2.0.3!datanucleus-connectionpool.jar
(1251ms)
[ivy:resolve] downloading http://repo1.maven.org/maven2/org/datanucleus/datanucleus-core/2.0.3/datanucleus-core-2.0.3.jar
...
[ivy:resolve] ............................................................................
(1955kB)
[ivy:resolve] .. (0kB)
[ivy:resolve] 	[SUCCESSFUL ] org.datanucleus#datanucleus-core;2.0.3!datanucleus-core.jar (1980ms)
[ivy:resolve] downloading http://repo1.maven.org/maven2/org/datanucleus/datanucleus-enhancer/2.0.3/datanucleus-enhancer-2.0.3.jar
...
[ivy:resolve] ...... (183kB)
[ivy:resolve] .. (0kB)
[ivy:resolve] 	[SUCCESSFUL ] org.datanucleus#datanucleus-enhancer;2.0.3!datanucleus-enhancer.jar
(1103ms)
[ivy:resolve] downloading http://repo1.maven.org/maven2/org/datanucleus/datanucleus-rdbms/2.0.3/datanucleus-rdbms-2.0.3.jar
...
[ivy:resolve] ................................................ (1196kB)
[ivy:resolve] .. (0kB)
[ivy:resolve] 	[SUCCESSFUL ] org.datanucleus#datanucleus-rdbms;2.0.3!datanucleus-rdbms.jar
(1790ms)
[ivy:resolve] downloading http://www.datanucleus.org/downloads/maven2/javax/jdo/jdo2-api/2.3-ec/jdo2-api-2.3-ec.jar
...
[ivy:resolve] .............. (193kB)
[ivy:resolve] .. (0kB)
[ivy:resolve] 	[SUCCESSFUL ] javax.jdo#jdo2-api;2.3-ec!jdo2-api.jar (1859ms)
[ivy:resolve] downloading http://repo1.maven.org/maven2/org/apache/derby/derby/10.4.2.0/derby-10.4.2.0.jar
...
[ivy:resolve] ..............................................................................................................................................
(2389kB)
[ivy:resolve] .. (0kB)
[ivy:resolve] 	[SUCCESSFUL ] org.apache.derby#derby;10.4.2.0!derby.jar (1427ms)
[ivy:resolve] downloading http://repo1.maven.org/maven2/asm/asm/3.1/asm-3.1.jar ...
[ivy:resolve] ... (42kB)
[ivy:resolve] .. (0kB)
[ivy:resolve] 	[SUCCESSFUL ] asm#asm;3.1!asm.jar (1068ms)
[ivy:resolve] downloading http://repo1.maven.org/maven2/org/antlr/stringtemplate/3.1-b1/stringtemplate-3.1-b1.jar
...
[ivy:resolve] ............. (224kB)
[ivy:resolve] .. (0kB)
[ivy:resolve] 	[SUCCESSFUL ] org.antlr#stringtemplate;3.1-b1!stringtemplate.jar (1007ms)
[ivy:resolve] downloading http://repo1.maven.org/maven2/antlr/antlr/2.7.7/antlr-2.7.7.jar
...
[ivy:resolve] ............................ (434kB)
[ivy:resolve] .. (0kB)
[ivy:resolve] 	[SUCCESSFUL ] antlr#antlr;2.7.7!antlr.jar (1239ms)
[ivy:report] Processing <https://builds.apache.org/job/Hive-0.9.1-SNAPSHOT-h0.21/30/artifact/hive/build/ivy/resolution-cache/org.apache.hive-hive-metastore-default.xml>
to <https://builds.apache.org/job/Hive-0.9.1-SNAPSHOT-h0.21/30/artifact/hive/build/ivy/report/org.apache.hive-hive-metastore-default.html>

ivy-retrieve:
     [echo] Project: metastore

BUILD FAILED
<https://builds.apache.org/job/Hive-0.9.1-SNAPSHOT-h0.21/ws/hive/build.xml>:302: The
following error occurred while executing this line:
<https://builds.apache.org/job/Hive-0.9.1-SNAPSHOT-h0.21/ws/hive/build.xml>:152: The
following error occurred while executing this line:
<https://builds.apache.org/job/Hive-0.9.1-SNAPSHOT-h0.21/ws/hive/build-common.xml>:135:
impossible to ivy retrieve: java.lang.RuntimeException: problem during retrieve of org.apache.hive#hive-metastore:
java.io.FileNotFoundException: /home/jenkins/.ivy2/cache/org.datanucleus/datanucleus-core/jars/datanucleus-core-2.0.3.jar
(No such file or directory)
	at org.apache.ivy.core.retrieve.RetrieveEngine.retrieve(RetrieveEngine.java:206)
	at org.apache.ivy.Ivy.retrieve(Ivy.java:540)
	at org.apache.ivy.ant.IvyRetrieve.doExecute(IvyRetrieve.java:59)
	at org.apache.ivy.ant.IvyTask.execute(IvyTask.java:277)
	at org.apache.tools.ant.UnknownElement.execute(UnknownElement.java:291)
	at sun.reflect.GeneratedMethodAccessor4.invoke(Unknown Source)
	at sun.reflect.DelegatingMethodAccessorImpl.invoke(DelegatingMethodAccessorImpl.java:25)
	at java.lang.reflect.Method.invoke(Method.java:597)
	at org.apache.tools.ant.dispatch.DispatchUtils.execute(DispatchUtils.java:106)
	at org.apache.tools.ant.Task.perform(Task.java:348)
	at org.apache.tools.ant.Target.execute(Target.java:390)
	at org.apache.tools.ant.Target.performTasks(Target.java:411)
	at org.apache.tools.ant.Project.executeSortedTargets(Project.java:1397)
	at org.apache.tools.ant.helper.SingleCheckExecutor.executeTargets(SingleCheckExecutor.java:38)
	at org.apache.tools.ant.Project.executeTargets(Project.java:1249)
	at org.apache.tools.ant.taskdefs.Ant.execute(Ant.java:442)
	at org.apache.tools.ant.taskdefs.SubAnt.execute(SubAnt.java:302)
	at org.apache.tools.ant.taskdefs.SubAnt.execute(SubAnt.java:221)
	at org.apache.tools.ant.UnknownElement.execute(UnknownElement.java:291)
	at sun.reflect.GeneratedMethodAccessor4.invoke(Unknown Source)
	at sun.reflect.DelegatingMethodAccessorImpl.invoke(DelegatingMethodAccessorImpl.java:25)
	at java.lang.reflect.Method.invoke(Method.java:597)
	at org.apache.tools.ant.dispatch.DispatchUtils.execute(DispatchUtils.java:106)
	at org.apache.tools.ant.Task.perform(Task.java:348)
	at org.apache.tools.ant.taskdefs.Sequential.execute(Sequential.java:68)
	at org.apache.tools.ant.UnknownElement.execute(UnknownElement.java:291)
	at sun.reflect.GeneratedMethodAccessor4.invoke(Unknown Source)
	at sun.reflect.DelegatingMethodAccessorImpl.invoke(DelegatingMethodAccessorImpl.java:25)
	at java.lang.reflect.Method.invoke(Method.java:597)
	at org.apache.tools.ant.dispatch.DispatchUtils.execute(DispatchUtils.java:106)
	at org.apache.tools.ant.Task.perform(Task.java:348)
	at org.apache.tools.ant.taskdefs.MacroInstance.execute(MacroInstance.java:398)
	at org.apache.tools.ant.UnknownElement.execute(UnknownElement.java:291)
	at sun.reflect.GeneratedMethodAccessor4.invoke(Unknown Source)
	at sun.reflect.DelegatingMethodAccessorImpl.invoke(DelegatingMethodAccessorImpl.java:25)
	at java.lang.reflect.Method.invoke(Method.java:597)
	at org.apache.tools.ant.dispatch.DispatchUtils.execute(DispatchUtils.java:106)
	at org.apache.tools.ant.Task.perform(Task.java:348)
	at org.apache.tools.ant.Target.execute(Target.java:390)
	at org.apache.tools.ant.Target.performTasks(Target.java:411)
	at org.apache.tools.ant.Project.executeSortedTargets(Project.java:1397)
	at org.apache.tools.ant.Project.executeTarget(Project.java:1366)
	at org.apache.tools.ant.helper.DefaultExecutor.executeTargets(DefaultExecutor.java:41)
	at org.apache.tools.ant.Project.executeTargets(Project.java:1249)
	at org.apache.tools.ant.Main.runBuild(Main.java:801)
	at org.apache.tools.ant.Main.startAnt(Main.java:218)
	at org.apache.tools.ant.launch.Launcher.run(Launcher.java:280)
	at org.apache.tools.ant.launch.Launcher.main(Launcher.java:109)
Caused by: java.io.FileNotFoundException: /home/jenkins/.ivy2/cache/org.datanucleus/datanucleus-core/jars/datanucleus-core-2.0.3.jar
(No such file or directory)
	at java.io.FileInputStream.open(Native Method)
	at java.io.FileInputStream.<init>(FileInputStream.java:120)
	at org.apache.ivy.util.FileUtil.copy(FileUtil.java:122)
	at org.apache.ivy.core.retrieve.RetrieveEngine.retrieve(RetrieveEngine.java:140)
	... 47 more

Total time: 7 minutes 54 seconds
Build step 'Invoke Ant' marked build as failure
Archiving artifacts
Recording test results

Mime
View raw message