hive-dev mailing list archives

Site index · List index
Message view « Date » · « Thread »
Top « Date » · « Thread »
From Apache Jenkins Server <jenk...@builds.apache.org>
Subject Build failed in Jenkins: Hive-0.9.1-SNAPSHOT-h0.21 #17
Date Tue, 15 May 2012 16:14:13 GMT
See <https://builds.apache.org/job/Hive-0.9.1-SNAPSHOT-h0.21/17/>

------------------------------------------
[...truncated 5829 lines...]
[ivy:resolve] downloading http://repo1.maven.org/maven2/org/apache/avro/avro/1.5.3/avro-1.5.3.jar
...
[ivy:resolve] ........... (257kB)
[ivy:resolve] .. (0kB)
[ivy:resolve] 	[SUCCESSFUL ] org.apache.avro#avro;1.5.3!avro.jar (2228ms)
[ivy:resolve] downloading http://repo1.maven.org/maven2/org/apache/avro/avro-ipc/1.5.3/avro-ipc-1.5.3.jar
...
[ivy:resolve] ..... (164kB)
[ivy:resolve] .. (0kB)
[ivy:resolve] 	[SUCCESSFUL ] org.apache.avro#avro-ipc;1.5.3!avro-ipc.jar (2204ms)
[ivy:resolve] downloading http://repo1.maven.org/maven2/com/google/protobuf/protobuf-java/2.4.0a/protobuf-java-2.4.0a.jar
...
[ivy:resolve] ............... (439kB)
[ivy:resolve] .. (0kB)
[ivy:resolve] 	[SUCCESSFUL ] com.google.protobuf#protobuf-java;2.4.0a!protobuf-java.jar (2690ms)
[ivy:resolve] downloading http://repo1.maven.org/maven2/com/googlecode/json-simple/json-simple/1.1/json-simple-1.1.jar
...
[ivy:resolve] ... (15kB)
[ivy:resolve] .. (0kB)
[ivy:resolve] downloading http://repo1.maven.org/maven2/org/codehaus/jettison/jettison/1.1/jettison-1.1.jar
...
[ivy:resolve] ... (66kB)
[ivy:resolve] .. (0kB)
[ivy:resolve] downloading http://repo1.maven.org/maven2/com/sun/xml/bind/jaxb-impl/2.2.3-1/jaxb-impl-2.2.3-1.jar
...
[ivy:resolve] ..................................... (869kB)
[ivy:resolve] downloading http://repo1.maven.org/maven2/org/codehaus/jackson/jackson-core-asl/1.7.1/jackson-core-asl-1.7.1.jar
...
[ivy:resolve] ....... (202kB)
[ivy:resolve] .. (0kB)
[ivy:resolve] 	[SUCCESSFUL ] org.codehaus.jackson#jackson-core-asl;1.7.1!jackson-core-asl.jar
(2281ms)
[ivy:resolve] downloading http://repo1.maven.org/maven2/org/codehaus/jackson/jackson-jaxrs/1.7.1/jackson-jaxrs-1.7.1.jar
...
[ivy:resolve] ... (17kB)
[ivy:resolve] .. (0kB)
[ivy:resolve] 	[SUCCESSFUL ] org.codehaus.jackson#jackson-jaxrs;1.7.1!jackson-jaxrs.jar (2458ms)
[ivy:resolve] downloading http://repo1.maven.org/maven2/stax/stax-api/1.0.1/stax-api-1.0.1.jar
...
[ivy:resolve] ... (25kB)
[ivy:resolve] .. (0kB)
[ivy:resolve] downloading http://repo1.maven.org/maven2/javax/xml/bind/jaxb-api/2.2.2/jaxb-api-2.2.2.jar
...
[ivy:resolve] ..... (102kB)
[ivy:resolve] .. (0kB)
[ivy:resolve] downloading http://repo1.maven.org/maven2/javax/activation/activation/1.1/activation-1.1.jar
...
[ivy:resolve] ... (61kB)
[ivy:resolve] .. (0kB)
[ivy:resolve] downloading http://repo1.maven.org/maven2/com/thoughtworks/paranamer/paranamer/2.3/paranamer-2.3.jar
...
[ivy:resolve] ... (28kB)
[ivy:resolve] .. (0kB)
[ivy:resolve] 	[SUCCESSFUL ] com.thoughtworks.paranamer#paranamer;2.3!paranamer.jar (1948ms)
[ivy:resolve] downloading http://repo1.maven.org/maven2/org/xerial/snappy/snappy-java/1.0.3.2/snappy-java-1.0.3.2.jar
...
[ivy:resolve] ................................ (972kB)
[ivy:resolve] downloading http://repo1.maven.org/maven2/org/jboss/netty/netty/3.2.3.Final/netty-3.2.3.Final.jar
...
[ivy:resolve] ....................................... (767kB)
[ivy:resolve] .. (0kB)
[ivy:resolve] downloading http://repo1.maven.org/maven2/org/apache/velocity/velocity/1.7/velocity-1.7.jar
...
[ivy:resolve] ................ (438kB)
[ivy:resolve] .. (0kB)
[ivy:resolve] downloading http://repo1.maven.org/maven2/org/apache/hadoop/hadoop-yarn-common/0.23.1/hadoop-yarn-common-0.23.1.jar
...
[ivy:resolve] ............................................... (1056kB)
[ivy:resolve] downloading http://repo1.maven.org/maven2/org/apache/hadoop/hadoop-annotations/0.23.1/hadoop-annotations-0.23.1.jar
...
[ivy:resolve] .. (16kB)
[ivy:resolve] .. (0kB)
[ivy:resolve] 	[SUCCESSFUL ] org.apache.hadoop#hadoop-annotations;0.23.1!hadoop-annotations.jar
(2385ms)
[ivy:resolve] downloading http://repo1.maven.org/maven2/com/google/inject/extensions/guice-servlet/3.0/guice-servlet-3.0.jar
...
[ivy:resolve] ... (63kB)
[ivy:resolve] .. (0kB)
[ivy:resolve] 	[SUCCESSFUL ] com.google.inject.extensions#guice-servlet;3.0!guice-servlet.jar
(1779ms)
[ivy:resolve] downloading http://repo1.maven.org/maven2/junit/junit/4.8.2/junit-4.8.2.jar
...
[ivy:resolve] ......... (231kB)
[ivy:resolve] .. (0kB)
[ivy:resolve] 	[SUCCESSFUL ] junit#junit;4.8.2!junit.jar (1553ms)
[ivy:resolve] downloading http://repo1.maven.org/maven2/com/cenqua/clover/clover/3.0.2/clover-3.0.2.jar
...
[ivy:resolve] .................................................................................................................................................................................................................................................................................
[ivy:resolve] ...................................................................................................................................................................................................................................................................
(11446kB)
[ivy:resolve] .. (0kB)
[ivy:resolve] 	[SUCCESSFUL ] com.cenqua.clover#clover;3.0.2!clover.jar (4798ms)
[ivy:resolve] downloading http://repo1.maven.org/maven2/com/sun/jersey/jersey-test-framework/jersey-test-framework-grizzly2/1.8/jersey-test-framework-grizzly2-1.8.jar
...
[ivy:resolve] .. (12kB)
[ivy:resolve] .. (0kB)
[ivy:resolve] downloading http://repo1.maven.org/maven2/com/sun/jersey/contribs/jersey-guice/1.8/jersey-guice-1.8.jar
...
[ivy:resolve] ... (14kB)
[ivy:resolve] .. (0kB)
[ivy:resolve] downloading http://repo1.maven.org/maven2/jdiff/jdiff/1.0.9/jdiff-1.0.9.jar
...
[ivy:resolve] ..... (126kB)
[ivy:resolve] downloading http://repo1.maven.org/maven2/javax/inject/javax.inject/1/javax.inject-1.jar
...
[ivy:resolve] .. (2kB)
[ivy:resolve] .. (0kB)
[ivy:resolve] 	[SUCCESSFUL ] javax.inject#javax.inject;1!javax.inject.jar (2380ms)
[ivy:resolve] downloading http://repo1.maven.org/maven2/aopalliance/aopalliance/1.0/aopalliance-1.0.jar
...
[ivy:resolve] .. (4kB)
[ivy:resolve] .. (0kB)
[ivy:resolve] 	[SUCCESSFUL ] aopalliance#aopalliance;1.0!aopalliance.jar (2208ms)
[ivy:resolve] downloading http://repo1.maven.org/maven2/org/sonatype/sisu/inject/cglib/2.2.1-v20090111/cglib-2.2.1-v20090111.jar
...
[ivy:resolve] ......... (272kB)
[ivy:resolve] .. (0kB)
[ivy:resolve] 	[SUCCESSFUL ] org.sonatype.sisu.inject#cglib;2.2.1-v20090111!cglib.jar (1688ms)
[ivy:resolve] 
[ivy:resolve] :: problems summary ::
[ivy:resolve] :::: WARNINGS
[ivy:resolve] 	problem while downloading module descriptor: http://repo1.maven.org/maven2/org/apache/hadoop/hadoop-hdfs/0.23.1/hadoop-hdfs-0.23.1.pom:
/home/jenkins/.ivy2/cache/org.apache.hadoop/hadoop-hdfs/ivy-0.23.1.xml.original.part (No such
file or directory) (1985ms)
[ivy:resolve] 		module not found: org.apache.hadoop#hadoop-hdfs;0.23.1
[ivy:resolve] 	==== local: tried
[ivy:resolve] 	  /home/jenkins/.ivy2/local/org.apache.hadoop/hadoop-hdfs/0.23.1/ivys/ivy.xml
[ivy:resolve] 	  -- artifact org.apache.hadoop#hadoop-hdfs;0.23.1!hadoop-hdfs.jar:
[ivy:resolve] 	  /home/jenkins/.ivy2/local/org.apache.hadoop/hadoop-hdfs/0.23.1/jars/hadoop-hdfs.jar
[ivy:resolve] 	==== apache-snapshot: tried
[ivy:resolve] 	  https://repository.apache.org/content/repositories/snapshots/org/apache/hadoop/hadoop-hdfs/0.23.1/hadoop-hdfs-0.23.1.pom
[ivy:resolve] 	  -- artifact org.apache.hadoop#hadoop-hdfs;0.23.1!hadoop-hdfs.jar:
[ivy:resolve] 	  https://repository.apache.org/content/repositories/snapshots/org/apache/hadoop/hadoop-hdfs/0.23.1/hadoop-hdfs-0.23.1.jar
[ivy:resolve] 	==== maven2: tried
[ivy:resolve] 	  http://repo1.maven.org/maven2/org/apache/hadoop/hadoop-hdfs/0.23.1/hadoop-hdfs-0.23.1.pom
[ivy:resolve] 	==== datanucleus-repo: tried
[ivy:resolve] 	  -- artifact org.apache.hadoop#hadoop-hdfs;0.23.1!hadoop-hdfs.jar:
[ivy:resolve] 	  http://www.datanucleus.org/downloads/maven2/org/apache/hadoop/hadoop-hdfs/0.23.1/hadoop-hdfs-0.23.1.jar
[ivy:resolve] 	==== hadoop-source: tried
[ivy:resolve] 	  -- artifact org.apache.hadoop#hadoop-hdfs;0.23.1!hadoop-hdfs.jar:
[ivy:resolve] 	  http://mirror.facebook.net/facebook/hive-deps/hadoop/core/hadoop-hdfs-0.23.1/hadoop-hdfs-0.23.1.jar
[ivy:resolve] 	==== hadoop-source2: tried
[ivy:resolve] 	  -- artifact org.apache.hadoop#hadoop-hdfs;0.23.1!hadoop-hdfs.jar:
[ivy:resolve] 	  http://archive.cloudera.com/hive-deps/hadoop/core/hadoop-hdfs-0.23.1/hadoop-hdfs-0.23.1.jar
[ivy:resolve] 	problem while downloading module descriptor: http://repo1.maven.org/maven2/org/apache/hadoop/hadoop-archives/0.23.1/hadoop-archives-0.23.1.pom:
/home/jenkins/.ivy2/cache/org.apache.hadoop/hadoop-archives/ivy-0.23.1.xml.original.part (No
such file or directory) (2006ms)
[ivy:resolve] 		module not found: org.apache.hadoop#hadoop-archives;0.23.1
[ivy:resolve] 	==== local: tried
[ivy:resolve] 	  /home/jenkins/.ivy2/local/org.apache.hadoop/hadoop-archives/0.23.1/ivys/ivy.xml
[ivy:resolve] 	  -- artifact org.apache.hadoop#hadoop-archives;0.23.1!hadoop-archives.jar:
[ivy:resolve] 	  /home/jenkins/.ivy2/local/org.apache.hadoop/hadoop-archives/0.23.1/jars/hadoop-archives.jar
[ivy:resolve] 	==== apache-snapshot: tried
[ivy:resolve] 	  https://repository.apache.org/content/repositories/snapshots/org/apache/hadoop/hadoop-archives/0.23.1/hadoop-archives-0.23.1.pom
[ivy:resolve] 	  -- artifact org.apache.hadoop#hadoop-archives;0.23.1!hadoop-archives.jar:
[ivy:resolve] 	  https://repository.apache.org/content/repositories/snapshots/org/apache/hadoop/hadoop-archives/0.23.1/hadoop-archives-0.23.1.jar
[ivy:resolve] 	==== maven2: tried
[ivy:resolve] 	  http://repo1.maven.org/maven2/org/apache/hadoop/hadoop-archives/0.23.1/hadoop-archives-0.23.1.pom
[ivy:resolve] 	==== datanucleus-repo: tried
[ivy:resolve] 	  -- artifact org.apache.hadoop#hadoop-archives;0.23.1!hadoop-archives.jar:
[ivy:resolve] 	  http://www.datanucleus.org/downloads/maven2/org/apache/hadoop/hadoop-archives/0.23.1/hadoop-archives-0.23.1.jar
[ivy:resolve] 	==== hadoop-source: tried
[ivy:resolve] 	  -- artifact org.apache.hadoop#hadoop-archives;0.23.1!hadoop-archives.jar:
[ivy:resolve] 	  http://mirror.facebook.net/facebook/hive-deps/hadoop/core/hadoop-archives-0.23.1/hadoop-archives-0.23.1.jar
[ivy:resolve] 	==== hadoop-source2: tried
[ivy:resolve] 	  -- artifact org.apache.hadoop#hadoop-archives;0.23.1!hadoop-archives.jar:
[ivy:resolve] 	  http://archive.cloudera.com/hive-deps/hadoop/core/hadoop-archives-0.23.1/hadoop-archives-0.23.1.jar
[ivy:resolve] 		[FAILED     ] org.apache.hadoop#hadoop-common;0.23.1!hadoop-common.jar: /home/jenkins/.ivy2/cache/org.apache.hadoop/hadoop-common/jars/hadoop-common-0.23.1.jar.part
(No such file or directory) (3327ms)
[ivy:resolve] 		[FAILED     ] tomcat#jasper-runtime;5.5.23!jasper-runtime.jar: /home/jenkins/.ivy2/cache/tomcat/jasper-runtime/jars/jasper-runtime-5.5.23.jar.part
(No such file or directory) (2448ms)
[ivy:resolve] 		[FAILED     ] javax.servlet.jsp#jsp-api;2.1!jsp-api.jar: /home/jenkins/.ivy2/cache/javax.servlet.jsp/jsp-api/jars/jsp-api-2.1.jar.part
(No such file or directory) (2458ms)
[ivy:resolve] 		[FAILED     ] commons-logging#commons-logging-api;1.1!commons-logging-api.jar:
/home/jenkins/.ivy2/cache/commons-logging/commons-logging-api/jars/commons-logging-api-1.1.jar.part
(No such file or directory) (2207ms)
[ivy:resolve] 		[FAILED     ] log4j#log4j;1.2.15!log4j.jar: Downloaded file size doesn't match
expected Content Length for http://repo1.maven.org/maven2/log4j/log4j/1.2.15/log4j-1.2.15.jar.
Please retry. (1443ms)
[ivy:resolve] 		[FAILED     ] log4j#log4j;1.2.15!log4j.jar:  (0ms)
[ivy:resolve] 	==== local: tried
[ivy:resolve] 	  /home/jenkins/.ivy2/local/log4j/log4j/1.2.15/jars/log4j.jar
[ivy:resolve] 	==== apache-snapshot: tried
[ivy:resolve] 	  https://repository.apache.org/content/repositories/snapshots/log4j/log4j/1.2.15/log4j-1.2.15.jar
[ivy:resolve] 	==== maven2: tried
[ivy:resolve] 	  http://repo1.maven.org/maven2/log4j/log4j/1.2.15/log4j-1.2.15.jar
[ivy:resolve] 	==== datanucleus-repo: tried
[ivy:resolve] 	  http://www.datanucleus.org/downloads/maven2/log4j/log4j/1.2.15/log4j-1.2.15.jar
[ivy:resolve] 	==== hadoop-source: tried
[ivy:resolve] 	  http://mirror.facebook.net/facebook/hive-deps/hadoop/core/log4j-1.2.15/log4j-1.2.15.jar
[ivy:resolve] 	==== hadoop-source2: tried
[ivy:resolve] 	  http://archive.cloudera.com/hive-deps/hadoop/core/log4j-1.2.15/log4j-1.2.15.jar
[ivy:resolve] 		[FAILED     ] org.slf4j#slf4j-api;1.6.1!slf4j-api.jar: /home/jenkins/.ivy2/cache/org.slf4j/slf4j-api/jars/slf4j-api-1.6.1.jar.part
(No such file or directory) (2454ms)
[ivy:resolve] 		[FAILED     ] com.googlecode.json-simple#json-simple;1.1!json-simple.jar:
/home/jenkins/.ivy2/cache/com.googlecode.json-simple/json-simple/jars/json-simple-1.1.jar.part
(No such file or directory) (2451ms)
[ivy:resolve] 		[FAILED     ] org.codehaus.jettison#jettison;1.1!jettison.jar(bundle): /home/jenkins/.ivy2/cache/org.codehaus.jettison/jettison/bundles/jettison-1.1.jar.part
(No such file or directory) (2208ms)
[ivy:resolve] 		[FAILED     ] com.sun.xml.bind#jaxb-impl;2.2.3-1!jaxb-impl.jar: Downloaded
file size doesn't match expected Content Length for http://repo1.maven.org/maven2/com/sun/xml/bind/jaxb-impl/2.2.3-1/jaxb-impl-2.2.3-1.jar.
Please retry. (1358ms)
[ivy:resolve] 		[FAILED     ] com.sun.xml.bind#jaxb-impl;2.2.3-1!jaxb-impl.jar:  (0ms)
[ivy:resolve] 	==== local: tried
[ivy:resolve] 	  /home/jenkins/.ivy2/local/com.sun.xml.bind/jaxb-impl/2.2.3-1/jars/jaxb-impl.jar
[ivy:resolve] 	==== apache-snapshot: tried
[ivy:resolve] 	  https://repository.apache.org/content/repositories/snapshots/com/sun/xml/bind/jaxb-impl/2.2.3-1/jaxb-impl-2.2.3-1.jar
[ivy:resolve] 	==== maven2: tried
[ivy:resolve] 	  http://repo1.maven.org/maven2/com/sun/xml/bind/jaxb-impl/2.2.3-1/jaxb-impl-2.2.3-1.jar
[ivy:resolve] 	==== datanucleus-repo: tried
[ivy:resolve] 	  http://www.datanucleus.org/downloads/maven2/com/sun/xml/bind/jaxb-impl/2.2.3-1/jaxb-impl-2.2.3-1.jar
[ivy:resolve] 	==== hadoop-source: tried
[ivy:resolve] 	  http://mirror.facebook.net/facebook/hive-deps/hadoop/core/jaxb-impl-2.2.3-1/jaxb-impl-2.2.3-1.jar
[ivy:resolve] 	==== hadoop-source2: tried
[ivy:resolve] 	  http://archive.cloudera.com/hive-deps/hadoop/core/jaxb-impl-2.2.3-1/jaxb-impl-2.2.3-1.jar
[ivy:resolve] 		[FAILED     ] stax#stax-api;1.0.1!stax-api.jar: /home/jenkins/.ivy2/cache/stax/stax-api/jars/stax-api-1.0.1.jar.part
(No such file or directory) (2207ms)
[ivy:resolve] 		[FAILED     ] javax.xml.bind#jaxb-api;2.2.2!jaxb-api.jar: /home/jenkins/.ivy2/cache/javax.xml.bind/jaxb-api/jars/jaxb-api-2.2.2.jar.part
(No such file or directory) (2460ms)
[ivy:resolve] 		[FAILED     ] javax.activation#activation;1.1!activation.jar: /home/jenkins/.ivy2/cache/javax.activation/activation/jars/activation-1.1.jar.part
(No such file or directory) (2468ms)
[ivy:resolve] 		[FAILED     ] org.xerial.snappy#snappy-java;1.0.3.2!snappy-java.jar(bundle):
Downloaded file size doesn't match expected Content Length for http://repo1.maven.org/maven2/org/xerial/snappy/snappy-java/1.0.3.2/snappy-java-1.0.3.2.jar.
Please retry. (1553ms)
[ivy:resolve] 		[FAILED     ] org.xerial.snappy#snappy-java;1.0.3.2!snappy-java.jar(bundle):
 (0ms)
[ivy:resolve] 	==== local: tried
[ivy:resolve] 	  /home/jenkins/.ivy2/local/org.xerial.snappy/snappy-java/1.0.3.2/bundles/snappy-java.jar
[ivy:resolve] 	==== apache-snapshot: tried
[ivy:resolve] 	  https://repository.apache.org/content/repositories/snapshots/org/xerial/snappy/snappy-java/1.0.3.2/snappy-java-1.0.3.2.jar
[ivy:resolve] 	==== maven2: tried
[ivy:resolve] 	  http://repo1.maven.org/maven2/org/xerial/snappy/snappy-java/1.0.3.2/snappy-java-1.0.3.2.jar
[ivy:resolve] 	==== datanucleus-repo: tried
[ivy:resolve] 	  http://www.datanucleus.org/downloads/maven2/org/xerial/snappy/snappy-java/1.0.3.2/snappy-java-1.0.3.2.jar
[ivy:resolve] 	==== hadoop-source: tried
[ivy:resolve] 	  http://mirror.facebook.net/facebook/hive-deps/hadoop/core/snappy-java-1.0.3.2/snappy-java-1.0.3.2.jar
[ivy:resolve] 	==== hadoop-source2: tried
[ivy:resolve] 	  http://archive.cloudera.com/hive-deps/hadoop/core/snappy-java-1.0.3.2/snappy-java-1.0.3.2.jar
[ivy:resolve] 		[FAILED     ] org.jboss.netty#netty;3.2.3.Final!netty.jar(bundle): /home/jenkins/.ivy2/cache/org.jboss.netty/netty/bundles/netty-3.2.3.Final.jar.part
(No such file or directory) (1842ms)
[ivy:resolve] 		[FAILED     ] org.apache.velocity#velocity;1.7!velocity.jar: /home/jenkins/.ivy2/cache/org.apache.velocity/velocity/jars/velocity-1.7.jar.part
(No such file or directory) (2466ms)
[ivy:resolve] 		[FAILED     ] org.apache.hadoop#hadoop-yarn-common;0.23.1!hadoop-yarn-common.jar:
Downloaded file size doesn't match expected Content Length for http://repo1.maven.org/maven2/org/apache/hadoop/hadoop-yarn-common/0.23.1/hadoop-yarn-common-0.23.1.jar.
Please retry. (1576ms)
[ivy:resolve] 		[FAILED     ] org.apache.hadoop#hadoop-yarn-common;0.23.1!hadoop-yarn-common.jar:
 (0ms)
[ivy:resolve] 	==== local: tried
[ivy:resolve] 	  /home/jenkins/.ivy2/local/org.apache.hadoop/hadoop-yarn-common/0.23.1/jars/hadoop-yarn-common.jar
[ivy:resolve] 	==== apache-snapshot: tried
[ivy:resolve] 	  https://repository.apache.org/content/repositories/snapshots/org/apache/hadoop/hadoop-yarn-common/0.23.1/hadoop-yarn-common-0.23.1.jar
[ivy:resolve] 	==== maven2: tried
[ivy:resolve] 	  http://repo1.maven.org/maven2/org/apache/hadoop/hadoop-yarn-common/0.23.1/hadoop-yarn-common-0.23.1.jar
[ivy:resolve] 	==== datanucleus-repo: tried
[ivy:resolve] 	  http://www.datanucleus.org/downloads/maven2/org/apache/hadoop/hadoop-yarn-common/0.23.1/hadoop-yarn-common-0.23.1.jar
[ivy:resolve] 	==== hadoop-source: tried
[ivy:resolve] 	  http://mirror.facebook.net/facebook/hive-deps/hadoop/core/hadoop-yarn-common-0.23.1/hadoop-yarn-common-0.23.1.jar
[ivy:resolve] 	==== hadoop-source2: tried
[ivy:resolve] 	  http://archive.cloudera.com/hive-deps/hadoop/core/hadoop-yarn-common-0.23.1/hadoop-yarn-common-0.23.1.jar
[ivy:resolve] 		[FAILED     ] com.sun.jersey.jersey-test-framework#jersey-test-framework-grizzly2;1.8!jersey-test-framework-grizzly2.jar:
/home/jenkins/.ivy2/cache/com.sun.jersey.jersey-test-framework/jersey-test-framework-grizzly2/jars/jersey-test-framework-grizzly2-1.8.jar.part
(No such file or directory) (2354ms)
[ivy:resolve] 		[FAILED     ] com.sun.jersey.contribs#jersey-guice;1.8!jersey-guice.jar: /home/jenkins/.ivy2/cache/com.sun.jersey.contribs/jersey-guice/jars/jersey-guice-1.8.jar.part
(No such file or directory) (1760ms)
[ivy:resolve] 		[FAILED     ] jdiff#jdiff;1.0.9!jdiff.jar: Downloaded file size doesn't match
expected Content Length for http://repo1.maven.org/maven2/jdiff/jdiff/1.0.9/jdiff-1.0.9.jar.
Please retry. (1258ms)
[ivy:resolve] 		[FAILED     ] jdiff#jdiff;1.0.9!jdiff.jar:  (0ms)
[ivy:resolve] 	==== local: tried
[ivy:resolve] 	  /home/jenkins/.ivy2/local/jdiff/jdiff/1.0.9/jars/jdiff.jar
[ivy:resolve] 	==== apache-snapshot: tried
[ivy:resolve] 	  https://repository.apache.org/content/repositories/snapshots/jdiff/jdiff/1.0.9/jdiff-1.0.9.jar
[ivy:resolve] 	==== maven2: tried
[ivy:resolve] 	  http://repo1.maven.org/maven2/jdiff/jdiff/1.0.9/jdiff-1.0.9.jar
[ivy:resolve] 	==== datanucleus-repo: tried
[ivy:resolve] 	  http://www.datanucleus.org/downloads/maven2/jdiff/jdiff/1.0.9/jdiff-1.0.9.jar
[ivy:resolve] 	==== hadoop-source: tried
[ivy:resolve] 	  http://mirror.facebook.net/facebook/hive-deps/hadoop/core/jdiff-1.0.9/jdiff-1.0.9.jar
[ivy:resolve] 	==== hadoop-source2: tried
[ivy:resolve] 	  http://archive.cloudera.com/hive-deps/hadoop/core/jdiff-1.0.9/jdiff-1.0.9.jar
[ivy:resolve] 		::::::::::::::::::::::::::::::::::::::::::::::
[ivy:resolve] 		::          UNRESOLVED DEPENDENCIES         ::
[ivy:resolve] 		::::::::::::::::::::::::::::::::::::::::::::::
[ivy:resolve] 		:: org.apache.hadoop#hadoop-hdfs;0.23.1: not found
[ivy:resolve] 		:: org.apache.hadoop#hadoop-archives;0.23.1: not found
[ivy:resolve] 		::::::::::::::::::::::::::::::::::::::::::::::
[ivy:resolve] 		::::::::::::::::::::::::::::::::::::::::::::::
[ivy:resolve] 		::              FAILED DOWNLOADS            ::
[ivy:resolve] 		:: ^ see resolution messages for details  ^ ::
[ivy:resolve] 		::::::::::::::::::::::::::::::::::::::::::::::
[ivy:resolve] 		:: com.sun.xml.bind#jaxb-impl;2.2.3-1!jaxb-impl.jar
[ivy:resolve] 		:: log4j#log4j;1.2.15!log4j.jar
[ivy:resolve] 		:: org.xerial.snappy#snappy-java;1.0.3.2!snappy-java.jar(bundle)
[ivy:resolve] 		:: org.apache.hadoop#hadoop-yarn-common;0.23.1!hadoop-yarn-common.jar
[ivy:resolve] 		:: jdiff#jdiff;1.0.9!jdiff.jar
[ivy:resolve] 		::::::::::::::::::::::::::::::::::::::::::::::
[ivy:resolve] 
[ivy:resolve] :: USE VERBOSE OR DEBUG MESSAGE LEVEL FOR MORE DETAILS

BUILD FAILED
<https://builds.apache.org/job/Hive-0.9.1-SNAPSHOT-h0.21/ws/hive/build.xml>:302: The
following error occurred while executing this line:
<https://builds.apache.org/job/Hive-0.9.1-SNAPSHOT-h0.21/ws/hive/build.xml>:152: The
following error occurred while executing this line:
<https://builds.apache.org/job/Hive-0.9.1-SNAPSHOT-h0.21/ws/hive/shims/build.xml>:85:
The following error occurred while executing this line:
<https://builds.apache.org/job/Hive-0.9.1-SNAPSHOT-h0.21/ws/hive/shims/build.xml>:88:
The following error occurred while executing this line:
<https://builds.apache.org/job/Hive-0.9.1-SNAPSHOT-h0.21/ws/hive/shims/build.xml>:60:
The following error occurred while executing this line:
<https://builds.apache.org/job/Hive-0.9.1-SNAPSHOT-h0.21/ws/hive/build-common.xml>:164:
impossible to resolve dependencies:
	resolve failed - see output for details

Total time: 7 minutes 25 seconds
Build step 'Invoke Ant' marked build as failure
Archiving artifacts
Recording test results

Mime
View raw message