hive-dev mailing list archives

Site index · List index
Message view « Date » · « Thread »
Top « Date » · « Thread »
From Apache Jenkins Server <jenk...@builds.apache.org>
Subject Build failed in Jenkins: Hive-0.9.1-SNAPSHOT-h0.21-keepgoing=false #26
Date Thu, 24 May 2012 16:09:53 GMT
See <https://builds.apache.org/job/Hive-0.9.1-SNAPSHOT-h0.21-keepgoing=false/26/>

------------------------------------------
[...truncated 5576 lines...]
[ivy:resolve] 	[SUCCESSFUL ] commons-net#commons-net;1.4.1!commons-net.jar (2001ms)
[ivy:resolve] downloading http://repo1.maven.org/maven2/org/mortbay/jetty/jetty/6.1.14/jetty-6.1.14.jar
...
[ivy:resolve] ...........................................................................................................
(504kB)
[ivy:resolve] .. (0kB)
[ivy:resolve] 	[SUCCESSFUL ] org.mortbay.jetty#jetty;6.1.14!jetty.jar (1999ms)
[ivy:resolve] downloading http://repo1.maven.org/maven2/org/mortbay/jetty/jetty-util/6.1.14/jetty-util-6.1.14.jar
...
[ivy:resolve] ........................... (159kB)
[ivy:resolve] .. (0kB)
[ivy:resolve] 	[SUCCESSFUL ] org.mortbay.jetty#jetty-util;6.1.14!jetty-util.jar (1998ms)
[ivy:resolve] downloading http://repo1.maven.org/maven2/tomcat/jasper-runtime/5.5.12/jasper-runtime-5.5.12.jar
...
[ivy:resolve] .................... (74kB)
[ivy:resolve] .. (0kB)
[ivy:resolve] 	[SUCCESSFUL ] tomcat#jasper-runtime;5.5.12!jasper-runtime.jar (1900ms)
[ivy:resolve] downloading http://repo1.maven.org/maven2/tomcat/jasper-compiler/5.5.12/jasper-compiler-5.5.12.jar
...
[ivy:resolve] ..............................................................................
(395kB)
[ivy:resolve] .. (0kB)
[ivy:resolve] 	[SUCCESSFUL ] tomcat#jasper-compiler;5.5.12!jasper-compiler.jar (2503ms)
[ivy:resolve] downloading http://repo1.maven.org/maven2/org/mortbay/jetty/jsp-api-2.1/6.1.14/jsp-api-2.1-6.1.14.jar
...
[ivy:resolve] .......................... (131kB)
[ivy:resolve] .. (0kB)
[ivy:resolve] 	[SUCCESSFUL ] org.mortbay.jetty#jsp-api-2.1;6.1.14!jsp-api-2.1.jar (1996ms)
[ivy:resolve] downloading http://repo1.maven.org/maven2/org/mortbay/jetty/jsp-2.1/6.1.14/jsp-2.1-6.1.14.jar
...
[ivy:resolve] ......................................................................................................................................................................................
(1000kB)
[ivy:resolve] .. (0kB)
[ivy:resolve] 	[SUCCESSFUL ] org.mortbay.jetty#jsp-2.1;6.1.14!jsp-2.1.jar (2759ms)
[ivy:resolve] downloading http://repo1.maven.org/maven2/commons-el/commons-el/1.0/commons-el-1.0.jar
...
[ivy:resolve] ................. (109kB)
[ivy:resolve] .. (0kB)
[ivy:resolve] 	[SUCCESSFUL ] commons-el#commons-el;1.0!commons-el.jar (1991ms)
[ivy:resolve] downloading http://repo1.maven.org/maven2/net/java/dev/jets3t/jets3t/0.7.1/jets3t-0.7.1.jar
...
[ivy:resolve] ......................................................................... (368kB)
[ivy:resolve] .. (0kB)
[ivy:resolve] 	[SUCCESSFUL ] net.java.dev.jets3t#jets3t;0.7.1!jets3t.jar (2250ms)
[ivy:resolve] downloading http://repo1.maven.org/maven2/org/mortbay/jetty/servlet-api-2.5/6.1.14/servlet-api-2.5-6.1.14.jar
...
[ivy:resolve] ........................... (129kB)
[ivy:resolve] .. (0kB)
[ivy:resolve] 	[SUCCESSFUL ] org.mortbay.jetty#servlet-api-2.5;6.1.14!servlet-api-2.5.jar
(2245ms)
[ivy:resolve] downloading http://repo1.maven.org/maven2/net/sf/kosmosfs/kfs/0.3/kfs-0.3.jar
...
[ivy:resolve] .... (11kB)
[ivy:resolve] .. (0kB)
[ivy:resolve] 	[SUCCESSFUL ] net.sf.kosmosfs#kfs;0.3!kfs.jar (1807ms)
[ivy:resolve] downloading http://repo1.maven.org/maven2/junit/junit/4.5/junit-4.5.jar ...
[ivy:resolve] ............................................ (194kB)
[ivy:resolve] .. (0kB)
[ivy:resolve] 	[SUCCESSFUL ] junit#junit;4.5!junit.jar (2440ms)
[ivy:resolve] downloading http://repo1.maven.org/maven2/hsqldb/hsqldb/1.8.0.10/hsqldb-1.8.0.10.jar
...
[ivy:resolve] ...............................................................................................................................
(690kB)
[ivy:resolve] .. (0kB)
[ivy:resolve] 	[SUCCESSFUL ] hsqldb#hsqldb;1.8.0.10!hsqldb.jar (2754ms)
[ivy:resolve] downloading http://repo1.maven.org/maven2/oro/oro/2.0.8/oro-2.0.8.jar ...
[ivy:resolve] ................... (63kB)
[ivy:resolve] .. (0kB)
[ivy:resolve] 	[SUCCESSFUL ] oro#oro;2.0.8!oro.jar (2241ms)
[ivy:resolve] downloading http://repo1.maven.org/maven2/org/eclipse/jdt/core/3.1.1/core-3.1.1.jar
...
[ivy:resolve] .................................................................................................................................................................................................................................................................................................................................................................................................................................................................................................................................................................................................................
(3483kB)
[ivy:resolve] .. (0kB)
[ivy:resolve] 	[SUCCESSFUL ] org.eclipse.jdt#core;3.1.1!core.jar (2959ms)
[ivy:resolve] downloading http://repo1.maven.org/maven2/ant/ant/1.6.5/ant-1.6.5.jar ...
[ivy:resolve] .......................................................................................................................................................
(1009kB)
[ivy:resolve] .. (0kB)
[ivy:resolve] 	[SUCCESSFUL ] ant#ant;1.6.5!ant.jar (2226ms)
[ivy:resolve] downloading http://repo1.maven.org/maven2/commons-logging/commons-logging/1.1.1/commons-logging-1.1.1.jar
...
[ivy:resolve] ........... (59kB)
[ivy:resolve] .. (0kB)
[ivy:resolve] 	[SUCCESSFUL ] commons-logging#commons-logging;1.1.1!commons-logging.jar (1987ms)
[ivy:resolve] downloading http://repo1.maven.org/maven2/org/apache/ftpserver/ftplet-api/1.0.0/ftplet-api-1.0.0.jar
...
[ivy:resolve] ......... (22kB)
[ivy:resolve] .. (0kB)
[ivy:resolve] 	[SUCCESSFUL ] org.apache.ftpserver#ftplet-api;1.0.0!ftplet-api.jar(bundle)
(1748ms)
[ivy:resolve] downloading http://repo1.maven.org/maven2/org/apache/mina/mina-core/2.0.0-M5/mina-core-2.0.0-M5.jar
...
[ivy:resolve] .........................................................................................................................
(622kB)
[ivy:resolve] .. (0kB)
[ivy:resolve] 	[SUCCESSFUL ] org.apache.mina#mina-core;2.0.0-M5!mina-core.jar(bundle) (2095ms)
[ivy:resolve] downloading http://repo1.maven.org/maven2/org/apache/ftpserver/ftpserver-core/1.0.0/ftpserver-core-1.0.0.jar
...
[ivy:resolve] ...................................... (264kB)
[ivy:resolve] .. (0kB)
[ivy:resolve] 	[SUCCESSFUL ] org.apache.ftpserver#ftpserver-core;1.0.0!ftpserver-core.jar(bundle)
(2208ms)
[ivy:resolve] downloading http://repo1.maven.org/maven2/org/apache/ftpserver/ftpserver-deprecated/1.0.0-M2/ftpserver-deprecated-1.0.0-M2.jar
...
[ivy:resolve] .......... (31kB)
[ivy:resolve] .. (0kB)
[ivy:resolve] 	[SUCCESSFUL ] org.apache.ftpserver#ftpserver-deprecated;1.0.0-M2!ftpserver-deprecated.jar
(1997ms)
[ivy:resolve] downloading http://repo1.maven.org/maven2/org/slf4j/slf4j-api/1.5.2/slf4j-api-1.5.2.jar
...
[ivy:resolve] ....... (16kB)
[ivy:resolve] .. (0kB)
[ivy:resolve] 	[SUCCESSFUL ] org.slf4j#slf4j-api;1.5.2!slf4j-api.jar (1996ms)
[ivy:resolve] 
[ivy:resolve] :: problems summary ::
[ivy:resolve] :::: WARNINGS
[ivy:resolve] 	impossible to put metadata file in cache: http://repo1.maven.org/maven2/net/sf/kosmosfs/kfs/0.3/kfs-0.3.pom
(0.3). java.io.FileNotFoundException: /home/jenkins/.ivy2/cache/net.sf.kosmosfs/kfs/ivy-0.3.xml.original
(No such file or directory)
[ivy:resolve] 
[ivy:resolve] :: USE VERBOSE OR DEBUG MESSAGE LEVEL FOR MORE DETAILS

ivy-retrieve-hadoop-shim:
     [echo] Project: shims
    [javac] Compiling 16 source files to <https://builds.apache.org/job/Hive-0.9.1-SNAPSHOT-h0.21-keepgoing=false/26/artifact/hive/build/shims/classes>
    [javac] Note: Some input files use or override a deprecated API.
    [javac] Note: Recompile with -Xlint:deprecation for details.
    [javac] Note: <https://builds.apache.org/job/Hive-0.9.1-SNAPSHOT-h0.21-keepgoing=false/ws/hive/shims/src/0.20/java/org/apache/hadoop/hive/shims/Hadoop20Shims.java>
uses unchecked or unsafe operations.
    [javac] Note: Recompile with -Xlint:unchecked for details.
     [echo] Building shims 0.20S

build_shims:
     [echo] Project: shims
     [echo] Compiling <https://builds.apache.org/job/Hive-0.9.1-SNAPSHOT-h0.21-keepgoing=false/ws/hive/shims/src/common/java;/home/jenkins/jenkins-slave/workspace/Hive-0.9.1-SNAPSHOT-h0.21-keepgoing=false/hive/shims/src/common-secure/java;/home/jenkins/jenkins-slave/workspace/Hive-0.9.1-SNAPSHOT-h0.21-keepgoing=false/hive/shims/src/0.20S/java>
against hadoop 1.0.0 (<https://builds.apache.org/job/Hive-0.9.1-SNAPSHOT-h0.21-keepgoing=false/26/artifact/hive/build/hadoopcore/hadoop-1.0.0)>

ivy-init-settings:
     [echo] Project: shims

ivy-resolve-hadoop-shim:
     [echo] Project: shims
[ivy:resolve] :: loading settings :: file = <https://builds.apache.org/job/Hive-0.9.1-SNAPSHOT-h0.21-keepgoing=false/ws/hive/ivy/ivysettings.xml>
[ivy:resolve] downloading http://repo1.maven.org/maven2/org/apache/hadoop/hadoop-core/1.0.0/hadoop-core-1.0.0.jar
...
[ivy:resolve] ................................................................................................................................................................................................................................................................................................................................................................................................................................................................................................................................................................................................
(3652kB)
[ivy:resolve] .. (0kB)
[ivy:resolve] 	[SUCCESSFUL ] org.apache.hadoop#hadoop-core;1.0.0!hadoop-core.jar (2023ms)
[ivy:resolve] downloading http://repo1.maven.org/maven2/org/apache/hadoop/hadoop-tools/1.0.0/hadoop-tools-1.0.0.jar
...
[ivy:resolve] ....................................... (281kB)
[ivy:resolve] .. (0kB)
[ivy:resolve] 	[SUCCESSFUL ] org.apache.hadoop#hadoop-tools;1.0.0!hadoop-tools.jar (1930ms)
[ivy:resolve] downloading http://repo1.maven.org/maven2/commons-codec/commons-codec/1.4/commons-codec-1.4.jar
...
[ivy:resolve] ........... (56kB)
[ivy:resolve] .. (0kB)
[ivy:resolve] 	[SUCCESSFUL ] commons-codec#commons-codec;1.4!commons-codec.jar (1495ms)
[ivy:resolve] downloading http://repo1.maven.org/maven2/org/apache/commons/commons-math/2.1/commons-math-2.1.jar
...
[ivy:resolve] .................................................................................................................................................................
(812kB)
[ivy:resolve] .. (0kB)
[ivy:resolve] downloading http://repo1.maven.org/maven2/commons-configuration/commons-configuration/1.6/commons-configuration-1.6.jar
...
[ivy:resolve] .................................................... (291kB)
[ivy:resolve] .. (0kB)
[ivy:resolve] 	[SUCCESSFUL ] commons-configuration#commons-configuration;1.6!commons-configuration.jar
(1815ms)
[ivy:resolve] downloading http://repo1.maven.org/maven2/org/mortbay/jetty/jetty/6.1.26/jetty-6.1.26.jar
...
[ivy:resolve] ............................................................................................................
(527kB)
[ivy:resolve] .. (0kB)
[ivy:resolve] 	[SUCCESSFUL ] org.mortbay.jetty#jetty;6.1.26!jetty.jar (2081ms)
[ivy:resolve] downloading http://repo1.maven.org/maven2/org/mortbay/jetty/jetty-util/6.1.26/jetty-util-6.1.26.jar
...
[ivy:resolve] ................................. (172kB)
[ivy:resolve] .. (0kB)
[ivy:resolve] 	[SUCCESSFUL ] org.mortbay.jetty#jetty-util;6.1.26!jetty-util.jar (2223ms)
[ivy:resolve] downloading http://repo1.maven.org/maven2/org/codehaus/jackson/jackson-mapper-asl/1.0.1/jackson-mapper-asl-1.0.1.jar
...
[ivy:resolve] .................................................... (264kB)
[ivy:resolve] .. (0kB)
[ivy:resolve] 	[SUCCESSFUL ] org.codehaus.jackson#jackson-mapper-asl;1.0.1!jackson-mapper-asl.jar
(2025ms)
[ivy:resolve] downloading http://repo1.maven.org/maven2/commons-collections/commons-collections/3.2.1/commons-collections-3.2.1.jar
...
[ivy:resolve] .....................................................................................................................
(561kB)
[ivy:resolve] .. (0kB)
[ivy:resolve] downloading http://repo1.maven.org/maven2/commons-digester/commons-digester/1.8/commons-digester-1.8.jar
...
[ivy:resolve] ............................. (140kB)
[ivy:resolve] .. (0kB)
[ivy:resolve] downloading http://repo1.maven.org/maven2/commons-beanutils/commons-beanutils-core/1.8.0/commons-beanutils-core-1.8.0.jar
...
[ivy:resolve] ....................................... (201kB)
[ivy:resolve] .. (0kB)
[ivy:resolve] downloading http://repo1.maven.org/maven2/commons-beanutils/commons-beanutils/1.7.0/commons-beanutils-1.7.0.jar
...
[ivy:resolve] ............................................. (184kB)
[ivy:resolve] .. (0kB)
[ivy:resolve] downloading http://repo1.maven.org/maven2/org/codehaus/jackson/jackson-core-asl/1.0.1/jackson-core-asl-1.0.1.jar
...
[ivy:resolve] ........................ (132kB)
[ivy:resolve] .. (0kB)
[ivy:resolve] 	[SUCCESSFUL ] org.codehaus.jackson#jackson-core-asl;1.0.1!jackson-core-asl.jar
(1749ms)
[ivy:resolve] 
[ivy:resolve] :: problems summary ::
[ivy:resolve] :::: WARNINGS
[ivy:resolve] 	problem while downloading module descriptor: http://repo1.maven.org/maven2/org/mortbay/jetty/servlet-api/2.5-20081211/servlet-api-2.5-20081211.pom:
/home/jenkins/.ivy2/cache/org.mortbay.jetty/servlet-api/ivy-2.5-20081211.xml.original.part
(No such file or directory) (1999ms)
[ivy:resolve] 		module not found: org.mortbay.jetty#servlet-api;2.5-20081211
[ivy:resolve] 	==== local: tried
[ivy:resolve] 	  /home/jenkins/.ivy2/local/org.mortbay.jetty/servlet-api/2.5-20081211/ivys/ivy.xml
[ivy:resolve] 	  -- artifact org.mortbay.jetty#servlet-api;2.5-20081211!servlet-api.jar:
[ivy:resolve] 	  /home/jenkins/.ivy2/local/org.mortbay.jetty/servlet-api/2.5-20081211/jars/servlet-api.jar
[ivy:resolve] 	==== apache-snapshot: tried
[ivy:resolve] 	  https://repository.apache.org/content/repositories/snapshots/org/mortbay/jetty/servlet-api/2.5-20081211/servlet-api-2.5-20081211.pom
[ivy:resolve] 	  -- artifact org.mortbay.jetty#servlet-api;2.5-20081211!servlet-api.jar:
[ivy:resolve] 	  https://repository.apache.org/content/repositories/snapshots/org/mortbay/jetty/servlet-api/2.5-20081211/servlet-api-2.5-20081211.jar
[ivy:resolve] 	==== maven2: tried
[ivy:resolve] 	  http://repo1.maven.org/maven2/org/mortbay/jetty/servlet-api/2.5-20081211/servlet-api-2.5-20081211.pom
[ivy:resolve] 	==== datanucleus-repo: tried
[ivy:resolve] 	  -- artifact org.mortbay.jetty#servlet-api;2.5-20081211!servlet-api.jar:
[ivy:resolve] 	  http://www.datanucleus.org/downloads/maven2/org/mortbay/jetty/servlet-api/2.5-20081211/servlet-api-2.5-20081211.jar
[ivy:resolve] 	==== hadoop-source: tried
[ivy:resolve] 	  -- artifact org.mortbay.jetty#servlet-api;2.5-20081211!servlet-api.jar:
[ivy:resolve] 	  http://mirror.facebook.net/facebook/hive-deps/hadoop/core/servlet-api-2.5-20081211/servlet-api-2.5-20081211.jar
[ivy:resolve] 	==== hadoop-source2: tried
[ivy:resolve] 	  -- artifact org.mortbay.jetty#servlet-api;2.5-20081211!servlet-api.jar:
[ivy:resolve] 	  http://archive.cloudera.com/hive-deps/hadoop/core/servlet-api-2.5-20081211/servlet-api-2.5-20081211.jar
[ivy:resolve] 	problem while downloading module descriptor: http://repo1.maven.org/maven2/org/apache/hadoop/hadoop-test/1.0.0/hadoop-test-1.0.0.pom:
/home/jenkins/.ivy2/cache/org.apache.hadoop/hadoop-test/ivy-1.0.0.xml.original.part (No such
file or directory) (2000ms)
[ivy:resolve] 		module not found: org.apache.hadoop#hadoop-test;1.0.0
[ivy:resolve] 	==== local: tried
[ivy:resolve] 	  /home/jenkins/.ivy2/local/org.apache.hadoop/hadoop-test/1.0.0/ivys/ivy.xml
[ivy:resolve] 	  -- artifact org.apache.hadoop#hadoop-test;1.0.0!hadoop-test.jar:
[ivy:resolve] 	  /home/jenkins/.ivy2/local/org.apache.hadoop/hadoop-test/1.0.0/jars/hadoop-test.jar
[ivy:resolve] 	==== apache-snapshot: tried
[ivy:resolve] 	  https://repository.apache.org/content/repositories/snapshots/org/apache/hadoop/hadoop-test/1.0.0/hadoop-test-1.0.0.pom
[ivy:resolve] 	  -- artifact org.apache.hadoop#hadoop-test;1.0.0!hadoop-test.jar:
[ivy:resolve] 	  https://repository.apache.org/content/repositories/snapshots/org/apache/hadoop/hadoop-test/1.0.0/hadoop-test-1.0.0.jar
[ivy:resolve] 	==== maven2: tried
[ivy:resolve] 	  http://repo1.maven.org/maven2/org/apache/hadoop/hadoop-test/1.0.0/hadoop-test-1.0.0.pom
[ivy:resolve] 	==== datanucleus-repo: tried
[ivy:resolve] 	  -- artifact org.apache.hadoop#hadoop-test;1.0.0!hadoop-test.jar:
[ivy:resolve] 	  http://www.datanucleus.org/downloads/maven2/org/apache/hadoop/hadoop-test/1.0.0/hadoop-test-1.0.0.jar
[ivy:resolve] 	==== hadoop-source: tried
[ivy:resolve] 	  -- artifact org.apache.hadoop#hadoop-test;1.0.0!hadoop-test.jar:
[ivy:resolve] 	  http://mirror.facebook.net/facebook/hive-deps/hadoop/core/hadoop-test-1.0.0/hadoop-test-1.0.0.jar
[ivy:resolve] 	==== hadoop-source2: tried
[ivy:resolve] 	  -- artifact org.apache.hadoop#hadoop-test;1.0.0!hadoop-test.jar:
[ivy:resolve] 	  http://archive.cloudera.com/hive-deps/hadoop/core/hadoop-test-1.0.0/hadoop-test-1.0.0.jar
[ivy:resolve] 		[FAILED     ] org.apache.commons#commons-math;2.1!commons-math.jar: invalid
sha1: expected=b3c4bdc2778ddccceb8da2acec3e37bfa41303e9 computed=3109b99161fa4f944ecc2f67deda0ff717035596
(2253ms)
[ivy:resolve] 		[FAILED     ] org.apache.commons#commons-math;2.1!commons-math.jar:  (0ms)
[ivy:resolve] 	==== local: tried
[ivy:resolve] 	  /home/jenkins/.ivy2/local/org.apache.commons/commons-math/2.1/jars/commons-math.jar
[ivy:resolve] 	==== apache-snapshot: tried
[ivy:resolve] 	  https://repository.apache.org/content/repositories/snapshots/org/apache/commons/commons-math/2.1/commons-math-2.1.jar
[ivy:resolve] 	==== maven2: tried
[ivy:resolve] 	  http://repo1.maven.org/maven2/org/apache/commons/commons-math/2.1/commons-math-2.1.jar
[ivy:resolve] 	==== datanucleus-repo: tried
[ivy:resolve] 	  http://www.datanucleus.org/downloads/maven2/org/apache/commons/commons-math/2.1/commons-math-2.1.jar
[ivy:resolve] 	==== hadoop-source: tried
[ivy:resolve] 	  http://mirror.facebook.net/facebook/hive-deps/hadoop/core/commons-math-2.1/commons-math-2.1.jar
[ivy:resolve] 	==== hadoop-source2: tried
[ivy:resolve] 	  http://archive.cloudera.com/hive-deps/hadoop/core/commons-math-2.1/commons-math-2.1.jar
[ivy:resolve] 		[FAILED     ] commons-collections#commons-collections;3.2.1!commons-collections.jar:
/home/jenkins/.ivy2/cache/commons-collections/commons-collections/jars/commons-collections-3.2.1.jar.part
(No such file or directory) (1962ms)
[ivy:resolve] 		[FAILED     ] commons-digester#commons-digester;1.8!commons-digester.jar:
/home/jenkins/.ivy2/cache/commons-digester/commons-digester/jars/commons-digester-1.8.jar.part
(No such file or directory) (2010ms)
[ivy:resolve] 		[FAILED     ] commons-beanutils#commons-beanutils-core;1.8.0!commons-beanutils-core.jar:
/home/jenkins/.ivy2/cache/commons-beanutils/commons-beanutils-core/jars/commons-beanutils-core-1.8.0.jar.part
(No such file or directory) (1986ms)
[ivy:resolve] 		[FAILED     ] commons-beanutils#commons-beanutils;1.7.0!commons-beanutils.jar:
/home/jenkins/.ivy2/cache/commons-beanutils/commons-beanutils/jars/commons-beanutils-1.7.0.jar.part
(No such file or directory) (1999ms)
[ivy:resolve] 		::::::::::::::::::::::::::::::::::::::::::::::
[ivy:resolve] 		::          UNRESOLVED DEPENDENCIES         ::
[ivy:resolve] 		::::::::::::::::::::::::::::::::::::::::::::::
[ivy:resolve] 		:: org.mortbay.jetty#servlet-api;2.5-20081211: not found
[ivy:resolve] 		:: org.apache.hadoop#hadoop-test;1.0.0: not found
[ivy:resolve] 		::::::::::::::::::::::::::::::::::::::::::::::
[ivy:resolve] 		::::::::::::::::::::::::::::::::::::::::::::::
[ivy:resolve] 		::              FAILED DOWNLOADS            ::
[ivy:resolve] 		:: ^ see resolution messages for details  ^ ::
[ivy:resolve] 		::::::::::::::::::::::::::::::::::::::::::::::
[ivy:resolve] 		:: org.apache.commons#commons-math;2.1!commons-math.jar
[ivy:resolve] 		::::::::::::::::::::::::::::::::::::::::::::::
[ivy:resolve] 
[ivy:resolve] :: USE VERBOSE OR DEBUG MESSAGE LEVEL FOR MORE DETAILS

BUILD FAILED
<https://builds.apache.org/job/Hive-0.9.1-SNAPSHOT-h0.21-keepgoing=false/ws/hive/build.xml>:302:
The following error occurred while executing this line:
<https://builds.apache.org/job/Hive-0.9.1-SNAPSHOT-h0.21-keepgoing=false/ws/hive/build.xml>:152:
The following error occurred while executing this line:
<https://builds.apache.org/job/Hive-0.9.1-SNAPSHOT-h0.21-keepgoing=false/ws/hive/shims/build.xml>:85:
The following error occurred while executing this line:
<https://builds.apache.org/job/Hive-0.9.1-SNAPSHOT-h0.21-keepgoing=false/ws/hive/shims/build.xml>:88:
The following error occurred while executing this line:
<https://builds.apache.org/job/Hive-0.9.1-SNAPSHOT-h0.21-keepgoing=false/ws/hive/shims/build.xml>:60:
The following error occurred while executing this line:
<https://builds.apache.org/job/Hive-0.9.1-SNAPSHOT-h0.21-keepgoing=false/ws/hive/build-common.xml>:164:
impossible to resolve dependencies:
	resolve failed - see output for details

Total time: 5 minutes 15 seconds
Build step 'Invoke Ant' marked build as failure
Archiving artifacts
Recording test results

Mime
View raw message