hive-dev mailing list archives

Site index · List index
Message view « Date » · « Thread »
Top « Date » · « Thread »
From Apache Jenkins Server <jenk...@builds.apache.org>
Subject Build failed in Jenkins: Hive-0.9.1-SNAPSHOT-h0.21-keepgoing=false #17
Date Tue, 15 May 2012 16:14:13 GMT
See <https://builds.apache.org/job/Hive-0.9.1-SNAPSHOT-h0.21-keepgoing=false/17/>

------------------------------------------
[...truncated 5842 lines...]
[ivy:resolve] downloading http://repo1.maven.org/maven2/org/apache/avro/avro/1.5.3/avro-1.5.3.jar
...
[ivy:resolve] ......... (257kB)
[ivy:resolve] .. (0kB)
[ivy:resolve] 	[SUCCESSFUL ] org.apache.avro#avro;1.5.3!avro.jar (2279ms)
[ivy:resolve] downloading http://repo1.maven.org/maven2/org/apache/avro/avro-ipc/1.5.3/avro-ipc-1.5.3.jar
...
[ivy:resolve] ..... (164kB)
[ivy:resolve] .. (0kB)
[ivy:resolve] 	[SUCCESSFUL ] org.apache.avro#avro-ipc;1.5.3!avro-ipc.jar (2256ms)
[ivy:resolve] downloading http://repo1.maven.org/maven2/com/google/protobuf/protobuf-java/2.4.0a/protobuf-java-2.4.0a.jar
...
[ivy:resolve] ...................... (439kB)
[ivy:resolve] .. (0kB)
[ivy:resolve] 	[SUCCESSFUL ] com.google.protobuf#protobuf-java;2.4.0a!protobuf-java.jar (2215ms)
[ivy:resolve] downloading http://repo1.maven.org/maven2/org/apache/hadoop/hadoop-auth/0.23.1/hadoop-auth-0.23.1.jar
...
[ivy:resolve] ... (41kB)
[ivy:resolve] .. (0kB)
[ivy:resolve] 	[SUCCESSFUL ] org.apache.hadoop#hadoop-auth;0.23.1!hadoop-auth.jar (1817ms)
[ivy:resolve] downloading http://repo1.maven.org/maven2/com/googlecode/json-simple/json-simple/1.1/json-simple-1.1.jar
...
[ivy:resolve] ... (15kB)
[ivy:resolve] .. (0kB)
[ivy:resolve] 	[SUCCESSFUL ] com.googlecode.json-simple#json-simple;1.1!json-simple.jar (1925ms)
[ivy:resolve] downloading http://repo1.maven.org/maven2/org/codehaus/jettison/jettison/1.1/jettison-1.1.jar
...
[ivy:resolve] ... (66kB)
[ivy:resolve] .. (0kB)
[ivy:resolve] 	[SUCCESSFUL ] org.codehaus.jettison#jettison;1.1!jettison.jar(bundle) (1999ms)
[ivy:resolve] downloading http://repo1.maven.org/maven2/com/sun/xml/bind/jaxb-impl/2.2.3-1/jaxb-impl-2.2.3-1.jar
...
[ivy:resolve] ....................................... (869kB)
[ivy:resolve] .. (0kB)
[ivy:resolve] downloading http://repo1.maven.org/maven2/org/codehaus/jackson/jackson-core-asl/1.7.1/jackson-core-asl-1.7.1.jar
...
[ivy:resolve] ........ (202kB)
[ivy:resolve] .. (0kB)
[ivy:resolve] 	[SUCCESSFUL ] org.codehaus.jackson#jackson-core-asl;1.7.1!jackson-core-asl.jar
(1246ms)
[ivy:resolve] downloading http://repo1.maven.org/maven2/org/codehaus/jackson/jackson-jaxrs/1.7.1/jackson-jaxrs-1.7.1.jar
...
[ivy:resolve] ... (17kB)
[ivy:resolve] .. (0kB)
[ivy:resolve] 	[SUCCESSFUL ] org.codehaus.jackson#jackson-jaxrs;1.7.1!jackson-jaxrs.jar (1996ms)
[ivy:resolve] downloading http://repo1.maven.org/maven2/org/codehaus/jackson/jackson-xc/1.7.1/jackson-xc-1.7.1.jar
...
[ivy:resolve] ... (30kB)
[ivy:resolve] .. (0kB)
[ivy:resolve] 	[SUCCESSFUL ] org.codehaus.jackson#jackson-xc;1.7.1!jackson-xc.jar (2000ms)
[ivy:resolve] downloading http://repo1.maven.org/maven2/stax/stax-api/1.0.1/stax-api-1.0.1.jar
...
[ivy:resolve] ... (25kB)
[ivy:resolve] .. (0kB)
[ivy:resolve] 	[SUCCESSFUL ] stax#stax-api;1.0.1!stax-api.jar (2293ms)
[ivy:resolve] downloading http://repo1.maven.org/maven2/javax/xml/bind/jaxb-api/2.2.2/jaxb-api-2.2.2.jar
...
[ivy:resolve] ..... (102kB)
[ivy:resolve] .. (0kB)
[ivy:resolve] 	[SUCCESSFUL ] javax.xml.bind#jaxb-api;2.2.2!jaxb-api.jar (1955ms)
[ivy:resolve] downloading http://repo1.maven.org/maven2/javax/activation/activation/1.1/activation-1.1.jar
...
[ivy:resolve] ... (61kB)
[ivy:resolve] .. (0kB)
[ivy:resolve] 	[SUCCESSFUL ] javax.activation#activation;1.1!activation.jar (2001ms)
[ivy:resolve] downloading http://repo1.maven.org/maven2/com/thoughtworks/paranamer/paranamer/2.3/paranamer-2.3.jar
...
[ivy:resolve] ... (28kB)
[ivy:resolve] .. (0kB)
[ivy:resolve] 	[SUCCESSFUL ] com.thoughtworks.paranamer#paranamer;2.3!paranamer.jar (1996ms)
[ivy:resolve] downloading http://repo1.maven.org/maven2/org/xerial/snappy/snappy-java/1.0.3.2/snappy-java-1.0.3.2.jar
...
[ivy:resolve] ................................... (972kB)
[ivy:resolve] .. (0kB)
[ivy:resolve] downloading http://repo1.maven.org/maven2/org/jboss/netty/netty/3.2.3.Final/netty-3.2.3.Final.jar
...
[ivy:resolve] ............................... (767kB)
[ivy:resolve] .. (0kB)
[ivy:resolve] 	[SUCCESSFUL ] org.jboss.netty#netty;3.2.3.Final!netty.jar(bundle) (1831ms)
[ivy:resolve] downloading http://repo1.maven.org/maven2/org/apache/velocity/velocity/1.7/velocity-1.7.jar
...
[ivy:resolve] ................... (438kB)
[ivy:resolve] .. (0kB)
[ivy:resolve] 	[SUCCESSFUL ] org.apache.velocity#velocity;1.7!velocity.jar (1732ms)
[ivy:resolve] downloading http://repo1.maven.org/maven2/org/apache/hadoop/hadoop-yarn-common/0.23.1/hadoop-yarn-common-0.23.1.jar
...
[ivy:resolve] ................................................ (1056kB)
[ivy:resolve] .. (0kB)
[ivy:resolve] downloading http://repo1.maven.org/maven2/org/apache/hadoop/hadoop-annotations/0.23.1/hadoop-annotations-0.23.1.jar
...
[ivy:resolve] .. (16kB)
[ivy:resolve] .. (0kB)
[ivy:resolve] 	[SUCCESSFUL ] org.apache.hadoop#hadoop-annotations;0.23.1!hadoop-annotations.jar
(1072ms)
[ivy:resolve] downloading http://repo1.maven.org/maven2/com/google/inject/extensions/guice-servlet/3.0/guice-servlet-3.0.jar
...
[ivy:resolve] ... (63kB)
[ivy:resolve] .. (0kB)
[ivy:resolve] 	[SUCCESSFUL ] com.google.inject.extensions#guice-servlet;3.0!guice-servlet.jar
(1986ms)
[ivy:resolve] downloading http://repo1.maven.org/maven2/com/cenqua/clover/clover/3.0.2/clover-3.0.2.jar
...
[ivy:resolve] ....................................................................................................................................................................................................................................................................................................................................................................................................................................................................................................
[ivy:resolve] ................................ (11446kB)
[ivy:resolve] .. (0kB)
[ivy:resolve] 	[SUCCESSFUL ] com.cenqua.clover#clover;3.0.2!clover.jar (3467ms)
[ivy:resolve] downloading http://repo1.maven.org/maven2/org/apache/hadoop/hadoop-yarn-api/0.23.1/hadoop-yarn-api-0.23.1.jar
...
[ivy:resolve] ........................................... (870kB)
[ivy:resolve] .. (0kB)
[ivy:resolve] 	[SUCCESSFUL ] org.apache.hadoop#hadoop-yarn-api;0.23.1!hadoop-yarn-api.jar
(1414ms)
[ivy:resolve] downloading http://repo1.maven.org/maven2/commons-io/commons-io/2.1/commons-io-2.1.jar
...
[ivy:resolve] ............ (159kB)
[ivy:resolve] .. (0kB)
[ivy:resolve] 	[SUCCESSFUL ] commons-io#commons-io;2.1!commons-io.jar (986ms)
[ivy:resolve] downloading http://repo1.maven.org/maven2/com/google/inject/guice/3.0/guice-3.0.jar
...
[ivy:resolve] .................................................... (693kB)
[ivy:resolve] .. (0kB)
[ivy:resolve] 	[SUCCESSFUL ] com.google.inject#guice;3.0!guice.jar (1250ms)
[ivy:resolve] downloading http://repo1.maven.org/maven2/com/sun/jersey/jersey-test-framework/jersey-test-framework-grizzly2/1.8/jersey-test-framework-grizzly2-1.8.jar
...
[ivy:resolve] ... (12kB)
[ivy:resolve] .. (0kB)
[ivy:resolve] 	[SUCCESSFUL ] com.sun.jersey.jersey-test-framework#jersey-test-framework-grizzly2;1.8!jersey-test-framework-grizzly2.jar
(2008ms)
[ivy:resolve] downloading http://repo1.maven.org/maven2/com/sun/jersey/contribs/jersey-guice/1.8/jersey-guice-1.8.jar
...
[ivy:resolve] ... (14kB)
[ivy:resolve] .. (0kB)
[ivy:resolve] 	[SUCCESSFUL ] com.sun.jersey.contribs#jersey-guice;1.8!jersey-guice.jar (1981ms)
[ivy:resolve] downloading http://repo1.maven.org/maven2/jdiff/jdiff/1.0.9/jdiff-1.0.9.jar
...
[ivy:resolve] ..... (126kB)
[ivy:resolve] .. (0kB)
[ivy:resolve] downloading http://repo1.maven.org/maven2/javax/inject/javax.inject/1/javax.inject-1.jar
...
[ivy:resolve] .. (2kB)
[ivy:resolve] .. (0kB)
[ivy:resolve] 	[SUCCESSFUL ] javax.inject#javax.inject;1!javax.inject.jar (1250ms)
[ivy:resolve] downloading http://repo1.maven.org/maven2/aopalliance/aopalliance/1.0/aopalliance-1.0.jar
...
[ivy:resolve] .. (4kB)
[ivy:resolve] .. (0kB)
[ivy:resolve] 	[SUCCESSFUL ] aopalliance#aopalliance;1.0!aopalliance.jar (1998ms)
[ivy:resolve] downloading http://repo1.maven.org/maven2/org/sonatype/sisu/inject/cglib/2.2.1-v20090111/cglib-2.2.1-v20090111.jar
...
[ivy:resolve] ......... (272kB)
[ivy:resolve] .. (0kB)
[ivy:resolve] 	[SUCCESSFUL ] org.sonatype.sisu.inject#cglib;2.2.1-v20090111!cglib.jar (2252ms)
[ivy:resolve] 
[ivy:resolve] :: problems summary ::
[ivy:resolve] :::: WARNINGS
[ivy:resolve] 	impossible to put metadata file in cache: http://repo1.maven.org/maven2/org/apache/hadoop/hadoop-project/0.23.1/hadoop-project-0.23.1.pom
(0.23.1). java.io.FileNotFoundException: /home/jenkins/.ivy2/cache/org.apache.hadoop/hadoop-project/ivy-0.23.1.xml.original
(No such file or directory)
[ivy:resolve] 	impossible to put metadata file in cache: http://repo1.maven.org/maven2/org/apache/hadoop/hadoop-project-dist/0.23.1/hadoop-project-dist-0.23.1.pom
(0.23.1). java.io.FileNotFoundException: /home/jenkins/.ivy2/cache/org.apache.hadoop/hadoop-project-dist/ivy-0.23.1.xml.original
(No such file or directory)
[ivy:resolve] 	impossible to put metadata file in cache: http://repo1.maven.org/maven2/org/apache/hadoop/hadoop-common/0.23.1/hadoop-common-0.23.1.pom
(0.23.1). java.io.FileNotFoundException: /home/jenkins/.ivy2/cache/org.apache.hadoop/hadoop-common/ivy-0.23.1.xml.original
(No such file or directory)
[ivy:resolve] 	problem while downloading module descriptor: http://repo1.maven.org/maven2/junit/junit/4.8.2/junit-4.8.2.pom:
/home/jenkins/.ivy2/cache/junit/junit/ivy-4.8.2.xml.original.part (No such file or directory)
(2000ms)
[ivy:resolve] 		module not found: junit#junit;4.8.2
[ivy:resolve] 	==== local: tried
[ivy:resolve] 	  /home/jenkins/.ivy2/local/junit/junit/4.8.2/ivys/ivy.xml
[ivy:resolve] 	  -- artifact junit#junit;4.8.2!junit.jar:
[ivy:resolve] 	  /home/jenkins/.ivy2/local/junit/junit/4.8.2/jars/junit.jar
[ivy:resolve] 	==== apache-snapshot: tried
[ivy:resolve] 	  https://repository.apache.org/content/repositories/snapshots/junit/junit/4.8.2/junit-4.8.2.pom
[ivy:resolve] 	  -- artifact junit#junit;4.8.2!junit.jar:
[ivy:resolve] 	  https://repository.apache.org/content/repositories/snapshots/junit/junit/4.8.2/junit-4.8.2.jar
[ivy:resolve] 	==== maven2: tried
[ivy:resolve] 	  http://repo1.maven.org/maven2/junit/junit/4.8.2/junit-4.8.2.pom
[ivy:resolve] 	==== datanucleus-repo: tried
[ivy:resolve] 	  -- artifact junit#junit;4.8.2!junit.jar:
[ivy:resolve] 	  http://www.datanucleus.org/downloads/maven2/junit/junit/4.8.2/junit-4.8.2.jar
[ivy:resolve] 	==== hadoop-source: tried
[ivy:resolve] 	  -- artifact junit#junit;4.8.2!junit.jar:
[ivy:resolve] 	  http://mirror.facebook.net/facebook/hive-deps/hadoop/core/junit-4.8.2/junit-4.8.2.jar
[ivy:resolve] 	==== hadoop-source2: tried
[ivy:resolve] 	  -- artifact junit#junit;4.8.2!junit.jar:
[ivy:resolve] 	  http://archive.cloudera.com/hive-deps/hadoop/core/junit-4.8.2/junit-4.8.2.jar
[ivy:resolve] 		[FAILED     ] com.sun.jersey#jersey-core;1.8!jersey-core.jar(bundle): /home/jenkins/.ivy2/cache/com.sun.jersey/jersey-core/bundles/jersey-core-1.8.jar.part
(No such file or directory) (2248ms)
[ivy:resolve] 		[FAILED     ] com.sun.jersey#jersey-json;1.8!jersey-json.jar(bundle): /home/jenkins/.ivy2/cache/com.sun.jersey/jersey-json/bundles/jersey-json-1.8.jar.part
(No such file or directory) (2255ms)
[ivy:resolve] 		[FAILED     ] com.sun.jersey#jersey-server;1.8!jersey-server.jar(bundle):
/home/jenkins/.ivy2/cache/com.sun.jersey/jersey-server/bundles/jersey-server-1.8.jar.part
(No such file or directory) (2063ms)
[ivy:resolve] 		[FAILED     ] tomcat#jasper-compiler;5.5.23!jasper-compiler.jar: /home/jenkins/.ivy2/cache/tomcat/jasper-compiler/jars/jasper-compiler-5.5.23.jar.part
(No such file or directory) (2136ms)
[ivy:resolve] 		[FAILED     ] log4j#log4j;1.2.15!log4j.jar: invalid sha1: expected=f0a0d2e29ed910808c33135a3a5a51bba6358f7b
computed=45adeb75100cc74e72fd8559ee25aeb5aef914da (2283ms)
[ivy:resolve] 		[FAILED     ] log4j#log4j;1.2.15!log4j.jar:  (0ms)
[ivy:resolve] 	==== local: tried
[ivy:resolve] 	  /home/jenkins/.ivy2/local/log4j/log4j/1.2.15/jars/log4j.jar
[ivy:resolve] 	==== apache-snapshot: tried
[ivy:resolve] 	  https://repository.apache.org/content/repositories/snapshots/log4j/log4j/1.2.15/log4j-1.2.15.jar
[ivy:resolve] 	==== maven2: tried
[ivy:resolve] 	  http://repo1.maven.org/maven2/log4j/log4j/1.2.15/log4j-1.2.15.jar
[ivy:resolve] 	==== datanucleus-repo: tried
[ivy:resolve] 	  http://www.datanucleus.org/downloads/maven2/log4j/log4j/1.2.15/log4j-1.2.15.jar
[ivy:resolve] 	==== hadoop-source: tried
[ivy:resolve] 	  http://mirror.facebook.net/facebook/hive-deps/hadoop/core/log4j-1.2.15/log4j-1.2.15.jar
[ivy:resolve] 	==== hadoop-source2: tried
[ivy:resolve] 	  http://archive.cloudera.com/hive-deps/hadoop/core/log4j-1.2.15/log4j-1.2.15.jar
[ivy:resolve] 		[FAILED     ] com.sun.xml.bind#jaxb-impl;2.2.3-1!jaxb-impl.jar: invalid sha1:
expected=56baae106392040a45a06d4a41099173425da1e6 computed=09b6e4f7d96eb22214a2da829d5cfc2b2dd75c8d
(2253ms)
[ivy:resolve] 		[FAILED     ] com.sun.xml.bind#jaxb-impl;2.2.3-1!jaxb-impl.jar:  (0ms)
[ivy:resolve] 	==== local: tried
[ivy:resolve] 	  /home/jenkins/.ivy2/local/com.sun.xml.bind/jaxb-impl/2.2.3-1/jars/jaxb-impl.jar
[ivy:resolve] 	==== apache-snapshot: tried
[ivy:resolve] 	  https://repository.apache.org/content/repositories/snapshots/com/sun/xml/bind/jaxb-impl/2.2.3-1/jaxb-impl-2.2.3-1.jar
[ivy:resolve] 	==== maven2: tried
[ivy:resolve] 	  http://repo1.maven.org/maven2/com/sun/xml/bind/jaxb-impl/2.2.3-1/jaxb-impl-2.2.3-1.jar
[ivy:resolve] 	==== datanucleus-repo: tried
[ivy:resolve] 	  http://www.datanucleus.org/downloads/maven2/com/sun/xml/bind/jaxb-impl/2.2.3-1/jaxb-impl-2.2.3-1.jar
[ivy:resolve] 	==== hadoop-source: tried
[ivy:resolve] 	  http://mirror.facebook.net/facebook/hive-deps/hadoop/core/jaxb-impl-2.2.3-1/jaxb-impl-2.2.3-1.jar
[ivy:resolve] 	==== hadoop-source2: tried
[ivy:resolve] 	  http://archive.cloudera.com/hive-deps/hadoop/core/jaxb-impl-2.2.3-1/jaxb-impl-2.2.3-1.jar
[ivy:resolve] 		[FAILED     ] org.xerial.snappy#snappy-java;1.0.3.2!snappy-java.jar(bundle):
invalid sha1: expected=ac128161763df895bd34b88487f3bb3eb68c50a4 computed=15842fa9777bee6f17687181395025431549451f
(2501ms)
[ivy:resolve] 		[FAILED     ] org.xerial.snappy#snappy-java;1.0.3.2!snappy-java.jar(bundle):
 (0ms)
[ivy:resolve] 	==== local: tried
[ivy:resolve] 	  /home/jenkins/.ivy2/local/org.xerial.snappy/snappy-java/1.0.3.2/bundles/snappy-java.jar
[ivy:resolve] 	==== apache-snapshot: tried
[ivy:resolve] 	  https://repository.apache.org/content/repositories/snapshots/org/xerial/snappy/snappy-java/1.0.3.2/snappy-java-1.0.3.2.jar
[ivy:resolve] 	==== maven2: tried
[ivy:resolve] 	  http://repo1.maven.org/maven2/org/xerial/snappy/snappy-java/1.0.3.2/snappy-java-1.0.3.2.jar
[ivy:resolve] 	==== datanucleus-repo: tried
[ivy:resolve] 	  http://www.datanucleus.org/downloads/maven2/org/xerial/snappy/snappy-java/1.0.3.2/snappy-java-1.0.3.2.jar
[ivy:resolve] 	==== hadoop-source: tried
[ivy:resolve] 	  http://mirror.facebook.net/facebook/hive-deps/hadoop/core/snappy-java-1.0.3.2/snappy-java-1.0.3.2.jar
[ivy:resolve] 	==== hadoop-source2: tried
[ivy:resolve] 	  http://archive.cloudera.com/hive-deps/hadoop/core/snappy-java-1.0.3.2/snappy-java-1.0.3.2.jar
[ivy:resolve] 		[FAILED     ] org.apache.hadoop#hadoop-yarn-common;0.23.1!hadoop-yarn-common.jar:
invalid sha1: expected=32dfd3c91c14a208e290f3a1379587c5178fa5e1 computed=b78e0b585a5d4ea3f32f266c78fe0d71c0cb92bc
(2253ms)
[ivy:resolve] 		[FAILED     ] org.apache.hadoop#hadoop-yarn-common;0.23.1!hadoop-yarn-common.jar:
 (0ms)
[ivy:resolve] 	==== local: tried
[ivy:resolve] 	  /home/jenkins/.ivy2/local/org.apache.hadoop/hadoop-yarn-common/0.23.1/jars/hadoop-yarn-common.jar
[ivy:resolve] 	==== apache-snapshot: tried
[ivy:resolve] 	  https://repository.apache.org/content/repositories/snapshots/org/apache/hadoop/hadoop-yarn-common/0.23.1/hadoop-yarn-common-0.23.1.jar
[ivy:resolve] 	==== maven2: tried
[ivy:resolve] 	  http://repo1.maven.org/maven2/org/apache/hadoop/hadoop-yarn-common/0.23.1/hadoop-yarn-common-0.23.1.jar
[ivy:resolve] 	==== datanucleus-repo: tried
[ivy:resolve] 	  http://www.datanucleus.org/downloads/maven2/org/apache/hadoop/hadoop-yarn-common/0.23.1/hadoop-yarn-common-0.23.1.jar
[ivy:resolve] 	==== hadoop-source: tried
[ivy:resolve] 	  http://mirror.facebook.net/facebook/hive-deps/hadoop/core/hadoop-yarn-common-0.23.1/hadoop-yarn-common-0.23.1.jar
[ivy:resolve] 	==== hadoop-source2: tried
[ivy:resolve] 	  http://archive.cloudera.com/hive-deps/hadoop/core/hadoop-yarn-common-0.23.1/hadoop-yarn-common-0.23.1.jar
[ivy:resolve] 		[FAILED     ] jdiff#jdiff;1.0.9!jdiff.jar: invalid sha1: expected=1793d3db09705c21e2ce39d2692b313bb92d0e75
computed=dbaa3dcfb133a3df2eccacf5d330f5e0392d7151 (2247ms)
[ivy:resolve] 		[FAILED     ] jdiff#jdiff;1.0.9!jdiff.jar:  (0ms)
[ivy:resolve] 	==== local: tried
[ivy:resolve] 	  /home/jenkins/.ivy2/local/jdiff/jdiff/1.0.9/jars/jdiff.jar
[ivy:resolve] 	==== apache-snapshot: tried
[ivy:resolve] 	  https://repository.apache.org/content/repositories/snapshots/jdiff/jdiff/1.0.9/jdiff-1.0.9.jar
[ivy:resolve] 	==== maven2: tried
[ivy:resolve] 	  http://repo1.maven.org/maven2/jdiff/jdiff/1.0.9/jdiff-1.0.9.jar
[ivy:resolve] 	==== datanucleus-repo: tried
[ivy:resolve] 	  http://www.datanucleus.org/downloads/maven2/jdiff/jdiff/1.0.9/jdiff-1.0.9.jar
[ivy:resolve] 	==== hadoop-source: tried
[ivy:resolve] 	  http://mirror.facebook.net/facebook/hive-deps/hadoop/core/jdiff-1.0.9/jdiff-1.0.9.jar
[ivy:resolve] 	==== hadoop-source2: tried
[ivy:resolve] 	  http://archive.cloudera.com/hive-deps/hadoop/core/jdiff-1.0.9/jdiff-1.0.9.jar
[ivy:resolve] 		::::::::::::::::::::::::::::::::::::::::::::::
[ivy:resolve] 		::          UNRESOLVED DEPENDENCIES         ::
[ivy:resolve] 		::::::::::::::::::::::::::::::::::::::::::::::
[ivy:resolve] 		:: junit#junit;4.8.2: not found
[ivy:resolve] 		::::::::::::::::::::::::::::::::::::::::::::::
[ivy:resolve] 		::::::::::::::::::::::::::::::::::::::::::::::
[ivy:resolve] 		::              FAILED DOWNLOADS            ::
[ivy:resolve] 		:: ^ see resolution messages for details  ^ ::
[ivy:resolve] 		::::::::::::::::::::::::::::::::::::::::::::::
[ivy:resolve] 		:: com.sun.xml.bind#jaxb-impl;2.2.3-1!jaxb-impl.jar
[ivy:resolve] 		:: log4j#log4j;1.2.15!log4j.jar
[ivy:resolve] 		:: org.xerial.snappy#snappy-java;1.0.3.2!snappy-java.jar(bundle)
[ivy:resolve] 		:: org.apache.hadoop#hadoop-yarn-common;0.23.1!hadoop-yarn-common.jar
[ivy:resolve] 		:: jdiff#jdiff;1.0.9!jdiff.jar
[ivy:resolve] 		::::::::::::::::::::::::::::::::::::::::::::::
[ivy:resolve] 
[ivy:resolve] :: USE VERBOSE OR DEBUG MESSAGE LEVEL FOR MORE DETAILS

BUILD FAILED
<https://builds.apache.org/job/Hive-0.9.1-SNAPSHOT-h0.21-keepgoing=false/ws/hive/build.xml>:302:
The following error occurred while executing this line:
<https://builds.apache.org/job/Hive-0.9.1-SNAPSHOT-h0.21-keepgoing=false/ws/hive/build.xml>:152:
The following error occurred while executing this line:
<https://builds.apache.org/job/Hive-0.9.1-SNAPSHOT-h0.21-keepgoing=false/ws/hive/shims/build.xml>:85:
The following error occurred while executing this line:
<https://builds.apache.org/job/Hive-0.9.1-SNAPSHOT-h0.21-keepgoing=false/ws/hive/shims/build.xml>:88:
The following error occurred while executing this line:
<https://builds.apache.org/job/Hive-0.9.1-SNAPSHOT-h0.21-keepgoing=false/ws/hive/shims/build.xml>:60:
The following error occurred while executing this line:
<https://builds.apache.org/job/Hive-0.9.1-SNAPSHOT-h0.21-keepgoing=false/ws/hive/build-common.xml>:164:
impossible to resolve dependencies:
	resolve failed - see output for details

Total time: 11 minutes 17 seconds
Build step 'Invoke Ant' marked build as failure
Archiving artifacts
Recording test results

Mime
View raw message