hive-dev mailing list archives

Site index · List index
Message view « Date » · « Thread »
Top « Date » · « Thread »
From Apache Jenkins Server <jenk...@builds.apache.org>
Subject Build failed in Jenkins: Hive-0.9.1-SNAPSHOT-h0.21 #23
Date Mon, 21 May 2012 16:02:45 GMT
See <https://builds.apache.org/job/Hive-0.9.1-SNAPSHOT-h0.21/23/>

------------------------------------------
[...truncated 5317 lines...]
    [mkdir] Created dir: <https://builds.apache.org/job/Hive-0.9.1-SNAPSHOT-h0.21/23/artifact/hive/build/shims/test/classes>
    [mkdir] Created dir: <https://builds.apache.org/job/Hive-0.9.1-SNAPSHOT-h0.21/23/artifact/hive/build/shims/test/resources>
     [copy] Warning: <https://builds.apache.org/job/Hive-0.9.1-SNAPSHOT-h0.21/ws/hive/shims/src/test/resources>
does not exist.

init:
     [echo] Project: shims

create-dirs:
     [echo] Project: common
    [mkdir] Created dir: <https://builds.apache.org/job/Hive-0.9.1-SNAPSHOT-h0.21/23/artifact/hive/build/common>
    [mkdir] Created dir: <https://builds.apache.org/job/Hive-0.9.1-SNAPSHOT-h0.21/23/artifact/hive/build/common/classes>
    [mkdir] Created dir: <https://builds.apache.org/job/Hive-0.9.1-SNAPSHOT-h0.21/23/artifact/hive/build/common/test>
    [mkdir] Created dir: <https://builds.apache.org/job/Hive-0.9.1-SNAPSHOT-h0.21/23/artifact/hive/build/common/test/src>
    [mkdir] Created dir: <https://builds.apache.org/job/Hive-0.9.1-SNAPSHOT-h0.21/23/artifact/hive/build/common/test/classes>
    [mkdir] Created dir: <https://builds.apache.org/job/Hive-0.9.1-SNAPSHOT-h0.21/23/artifact/hive/build/common/test/resources>
     [copy] Copying 2 files to <https://builds.apache.org/job/Hive-0.9.1-SNAPSHOT-h0.21/23/artifact/hive/build/common/test/resources>

init:
     [echo] Project: common

create-dirs:
     [echo] Project: serde
    [mkdir] Created dir: <https://builds.apache.org/job/Hive-0.9.1-SNAPSHOT-h0.21/23/artifact/hive/build/serde>
    [mkdir] Created dir: <https://builds.apache.org/job/Hive-0.9.1-SNAPSHOT-h0.21/23/artifact/hive/build/serde/classes>
    [mkdir] Created dir: <https://builds.apache.org/job/Hive-0.9.1-SNAPSHOT-h0.21/23/artifact/hive/build/serde/test>
    [mkdir] Created dir: <https://builds.apache.org/job/Hive-0.9.1-SNAPSHOT-h0.21/23/artifact/hive/build/serde/test/src>
    [mkdir] Created dir: <https://builds.apache.org/job/Hive-0.9.1-SNAPSHOT-h0.21/23/artifact/hive/build/serde/test/classes>
    [mkdir] Created dir: <https://builds.apache.org/job/Hive-0.9.1-SNAPSHOT-h0.21/23/artifact/hive/build/serde/test/resources>
     [copy] Warning: <https://builds.apache.org/job/Hive-0.9.1-SNAPSHOT-h0.21/ws/hive/serde/src/test/resources>
does not exist.

init:
     [echo] Project: serde

create-dirs:
     [echo] Project: metastore
    [mkdir] Created dir: <https://builds.apache.org/job/Hive-0.9.1-SNAPSHOT-h0.21/23/artifact/hive/build/metastore>
    [mkdir] Created dir: <https://builds.apache.org/job/Hive-0.9.1-SNAPSHOT-h0.21/23/artifact/hive/build/metastore/classes>
    [mkdir] Created dir: <https://builds.apache.org/job/Hive-0.9.1-SNAPSHOT-h0.21/23/artifact/hive/build/metastore/test>
    [mkdir] Created dir: <https://builds.apache.org/job/Hive-0.9.1-SNAPSHOT-h0.21/23/artifact/hive/build/metastore/test/src>
    [mkdir] Created dir: <https://builds.apache.org/job/Hive-0.9.1-SNAPSHOT-h0.21/23/artifact/hive/build/metastore/test/classes>
    [mkdir] Created dir: <https://builds.apache.org/job/Hive-0.9.1-SNAPSHOT-h0.21/23/artifact/hive/build/metastore/test/resources>
     [copy] Warning: <https://builds.apache.org/job/Hive-0.9.1-SNAPSHOT-h0.21/ws/hive/metastore/src/test/resources>
does not exist.

init:
     [echo] Project: metastore

create-dirs:
     [echo] Project: ql
    [mkdir] Created dir: <https://builds.apache.org/job/Hive-0.9.1-SNAPSHOT-h0.21/23/artifact/hive/build/ql>
    [mkdir] Created dir: <https://builds.apache.org/job/Hive-0.9.1-SNAPSHOT-h0.21/23/artifact/hive/build/ql/classes>
    [mkdir] Created dir: <https://builds.apache.org/job/Hive-0.9.1-SNAPSHOT-h0.21/23/artifact/hive/build/ql/test>
    [mkdir] Created dir: <https://builds.apache.org/job/Hive-0.9.1-SNAPSHOT-h0.21/23/artifact/hive/build/ql/test/src>
    [mkdir] Created dir: <https://builds.apache.org/job/Hive-0.9.1-SNAPSHOT-h0.21/23/artifact/hive/build/ql/test/classes>
    [mkdir] Created dir: <https://builds.apache.org/job/Hive-0.9.1-SNAPSHOT-h0.21/23/artifact/hive/build/ql/test/resources>
     [copy] Warning: <https://builds.apache.org/job/Hive-0.9.1-SNAPSHOT-h0.21/ws/hive/ql/src/test/resources>
does not exist.

init:
     [echo] Project: ql

create-dirs:
     [echo] Project: contrib
    [mkdir] Created dir: <https://builds.apache.org/job/Hive-0.9.1-SNAPSHOT-h0.21/23/artifact/hive/build/contrib>
    [mkdir] Created dir: <https://builds.apache.org/job/Hive-0.9.1-SNAPSHOT-h0.21/23/artifact/hive/build/contrib/classes>
    [mkdir] Created dir: <https://builds.apache.org/job/Hive-0.9.1-SNAPSHOT-h0.21/23/artifact/hive/build/contrib/test>
    [mkdir] Created dir: <https://builds.apache.org/job/Hive-0.9.1-SNAPSHOT-h0.21/23/artifact/hive/build/contrib/test/src>
    [mkdir] Created dir: <https://builds.apache.org/job/Hive-0.9.1-SNAPSHOT-h0.21/23/artifact/hive/build/contrib/test/classes>
    [mkdir] Created dir: <https://builds.apache.org/job/Hive-0.9.1-SNAPSHOT-h0.21/23/artifact/hive/build/contrib/test/resources>
     [copy] Warning: <https://builds.apache.org/job/Hive-0.9.1-SNAPSHOT-h0.21/ws/hive/contrib/src/test/resources>
does not exist.

init:
     [echo] Project: contrib

create-dirs:
     [echo] Project: service
    [mkdir] Created dir: <https://builds.apache.org/job/Hive-0.9.1-SNAPSHOT-h0.21/23/artifact/hive/build/service>
    [mkdir] Created dir: <https://builds.apache.org/job/Hive-0.9.1-SNAPSHOT-h0.21/23/artifact/hive/build/service/classes>
    [mkdir] Created dir: <https://builds.apache.org/job/Hive-0.9.1-SNAPSHOT-h0.21/23/artifact/hive/build/service/test>
    [mkdir] Created dir: <https://builds.apache.org/job/Hive-0.9.1-SNAPSHOT-h0.21/23/artifact/hive/build/service/test/src>
    [mkdir] Created dir: <https://builds.apache.org/job/Hive-0.9.1-SNAPSHOT-h0.21/23/artifact/hive/build/service/test/classes>
    [mkdir] Created dir: <https://builds.apache.org/job/Hive-0.9.1-SNAPSHOT-h0.21/23/artifact/hive/build/service/test/resources>
     [copy] Warning: <https://builds.apache.org/job/Hive-0.9.1-SNAPSHOT-h0.21/ws/hive/service/src/test/resources>
does not exist.

init:
     [echo] Project: service

create-dirs:
     [echo] Project: cli
    [mkdir] Created dir: <https://builds.apache.org/job/Hive-0.9.1-SNAPSHOT-h0.21/23/artifact/hive/build/cli>
    [mkdir] Created dir: <https://builds.apache.org/job/Hive-0.9.1-SNAPSHOT-h0.21/23/artifact/hive/build/cli/classes>
    [mkdir] Created dir: <https://builds.apache.org/job/Hive-0.9.1-SNAPSHOT-h0.21/23/artifact/hive/build/cli/test>
    [mkdir] Created dir: <https://builds.apache.org/job/Hive-0.9.1-SNAPSHOT-h0.21/23/artifact/hive/build/cli/test/src>
    [mkdir] Created dir: <https://builds.apache.org/job/Hive-0.9.1-SNAPSHOT-h0.21/23/artifact/hive/build/cli/test/classes>
    [mkdir] Created dir: <https://builds.apache.org/job/Hive-0.9.1-SNAPSHOT-h0.21/23/artifact/hive/build/cli/test/resources>
     [copy] Warning: <https://builds.apache.org/job/Hive-0.9.1-SNAPSHOT-h0.21/ws/hive/cli/src/test/resources>
does not exist.

init:
     [echo] Project: cli

create-dirs:
     [echo] Project: jdbc
    [mkdir] Created dir: <https://builds.apache.org/job/Hive-0.9.1-SNAPSHOT-h0.21/23/artifact/hive/build/jdbc>
    [mkdir] Created dir: <https://builds.apache.org/job/Hive-0.9.1-SNAPSHOT-h0.21/23/artifact/hive/build/jdbc/classes>
    [mkdir] Created dir: <https://builds.apache.org/job/Hive-0.9.1-SNAPSHOT-h0.21/23/artifact/hive/build/jdbc/test>
    [mkdir] Created dir: <https://builds.apache.org/job/Hive-0.9.1-SNAPSHOT-h0.21/23/artifact/hive/build/jdbc/test/src>
    [mkdir] Created dir: <https://builds.apache.org/job/Hive-0.9.1-SNAPSHOT-h0.21/23/artifact/hive/build/jdbc/test/classes>
    [mkdir] Created dir: <https://builds.apache.org/job/Hive-0.9.1-SNAPSHOT-h0.21/23/artifact/hive/build/jdbc/test/resources>
     [copy] Warning: <https://builds.apache.org/job/Hive-0.9.1-SNAPSHOT-h0.21/ws/hive/jdbc/src/test/resources>
does not exist.

init:
     [echo] Project: jdbc

create-dirs:
     [echo] Project: hwi
    [mkdir] Created dir: <https://builds.apache.org/job/Hive-0.9.1-SNAPSHOT-h0.21/23/artifact/hive/build/hwi>
    [mkdir] Created dir: <https://builds.apache.org/job/Hive-0.9.1-SNAPSHOT-h0.21/23/artifact/hive/build/hwi/classes>
    [mkdir] Created dir: <https://builds.apache.org/job/Hive-0.9.1-SNAPSHOT-h0.21/23/artifact/hive/build/hwi/test>
    [mkdir] Created dir: <https://builds.apache.org/job/Hive-0.9.1-SNAPSHOT-h0.21/23/artifact/hive/build/hwi/test/src>
    [mkdir] Created dir: <https://builds.apache.org/job/Hive-0.9.1-SNAPSHOT-h0.21/23/artifact/hive/build/hwi/test/classes>
    [mkdir] Created dir: <https://builds.apache.org/job/Hive-0.9.1-SNAPSHOT-h0.21/23/artifact/hive/build/hwi/test/resources>
     [copy] Warning: <https://builds.apache.org/job/Hive-0.9.1-SNAPSHOT-h0.21/ws/hive/hwi/src/test/resources>
does not exist.

init:
     [echo] Project: hwi

create-dirs:
     [echo] Project: hbase-handler
    [mkdir] Created dir: <https://builds.apache.org/job/Hive-0.9.1-SNAPSHOT-h0.21/23/artifact/hive/build/hbase-handler>
    [mkdir] Created dir: <https://builds.apache.org/job/Hive-0.9.1-SNAPSHOT-h0.21/23/artifact/hive/build/hbase-handler/classes>
    [mkdir] Created dir: <https://builds.apache.org/job/Hive-0.9.1-SNAPSHOT-h0.21/23/artifact/hive/build/hbase-handler/test>
    [mkdir] Created dir: <https://builds.apache.org/job/Hive-0.9.1-SNAPSHOT-h0.21/23/artifact/hive/build/hbase-handler/test/src>
    [mkdir] Created dir: <https://builds.apache.org/job/Hive-0.9.1-SNAPSHOT-h0.21/23/artifact/hive/build/hbase-handler/test/classes>
    [mkdir] Created dir: <https://builds.apache.org/job/Hive-0.9.1-SNAPSHOT-h0.21/23/artifact/hive/build/hbase-handler/test/resources>
     [copy] Warning: <https://builds.apache.org/job/Hive-0.9.1-SNAPSHOT-h0.21/ws/hive/hbase-handler/src/test/resources>
does not exist.

init:
     [echo] Project: hbase-handler

create-dirs:
     [echo] Project: pdk
    [mkdir] Created dir: <https://builds.apache.org/job/Hive-0.9.1-SNAPSHOT-h0.21/23/artifact/hive/build/pdk>
    [mkdir] Created dir: <https://builds.apache.org/job/Hive-0.9.1-SNAPSHOT-h0.21/23/artifact/hive/build/pdk/classes>
    [mkdir] Created dir: <https://builds.apache.org/job/Hive-0.9.1-SNAPSHOT-h0.21/23/artifact/hive/build/pdk/test>
    [mkdir] Created dir: <https://builds.apache.org/job/Hive-0.9.1-SNAPSHOT-h0.21/23/artifact/hive/build/pdk/test/src>
    [mkdir] Created dir: <https://builds.apache.org/job/Hive-0.9.1-SNAPSHOT-h0.21/23/artifact/hive/build/pdk/test/classes>
    [mkdir] Created dir: <https://builds.apache.org/job/Hive-0.9.1-SNAPSHOT-h0.21/23/artifact/hive/build/pdk/test/resources>
     [copy] Warning: <https://builds.apache.org/job/Hive-0.9.1-SNAPSHOT-h0.21/ws/hive/pdk/src/test/resources>
does not exist.

init:
     [echo] Project: pdk

create-dirs:
     [echo] Project: builtins
    [mkdir] Created dir: <https://builds.apache.org/job/Hive-0.9.1-SNAPSHOT-h0.21/23/artifact/hive/build/builtins>
    [mkdir] Created dir: <https://builds.apache.org/job/Hive-0.9.1-SNAPSHOT-h0.21/23/artifact/hive/build/builtins/classes>
    [mkdir] Created dir: <https://builds.apache.org/job/Hive-0.9.1-SNAPSHOT-h0.21/23/artifact/hive/build/builtins/test>
    [mkdir] Created dir: <https://builds.apache.org/job/Hive-0.9.1-SNAPSHOT-h0.21/23/artifact/hive/build/builtins/test/src>
    [mkdir] Created dir: <https://builds.apache.org/job/Hive-0.9.1-SNAPSHOT-h0.21/23/artifact/hive/build/builtins/test/classes>
    [mkdir] Created dir: <https://builds.apache.org/job/Hive-0.9.1-SNAPSHOT-h0.21/23/artifact/hive/build/builtins/test/resources>
     [copy] Warning: <https://builds.apache.org/job/Hive-0.9.1-SNAPSHOT-h0.21/ws/hive/builtins/src/test/resources>
does not exist.

init:
     [echo] Project: builtins

jar:
     [echo] Project: hive

create-dirs:
     [echo] Project: shims
     [copy] Warning: <https://builds.apache.org/job/Hive-0.9.1-SNAPSHOT-h0.21/ws/hive/shims/src/test/resources>
does not exist.

init:
     [echo] Project: shims

ivy-init-settings:
     [echo] Project: shims

ivy-resolve:
     [echo] Project: shims
[ivy:resolve] :: loading settings :: file = <https://builds.apache.org/job/Hive-0.9.1-SNAPSHOT-h0.21/ws/hive/ivy/ivysettings.xml>
[ivy:resolve] downloading http://repo1.maven.org/maven2/org/apache/zookeeper/zookeeper/3.4.3/zookeeper-3.4.3.jar
...
[ivy:resolve] ............................... (749kB)
[ivy:resolve] .. (0kB)
[ivy:resolve] 	[SUCCESSFUL ] org.apache.zookeeper#zookeeper;3.4.3!zookeeper.jar (2666ms)
[ivy:resolve] downloading http://repo1.maven.org/maven2/org/apache/thrift/libthrift/0.7.0/libthrift-0.7.0.jar
...
[ivy:resolve] ............. (294kB)
[ivy:resolve] .. (0kB)
[ivy:resolve] downloading http://repo1.maven.org/maven2/commons-logging/commons-logging/1.0.4/commons-logging-1.0.4.jar
...
[ivy:resolve] ... (37kB)
[ivy:resolve] .. (0kB)
[ivy:resolve] 	[SUCCESSFUL ] commons-logging#commons-logging;1.0.4!commons-logging.jar (1750ms)
[ivy:resolve] downloading http://repo1.maven.org/maven2/commons-logging/commons-logging-api/1.0.4/commons-logging-api-1.0.4.jar
...
[ivy:resolve] ... (25kB)
[ivy:resolve] .. (0kB)
[ivy:resolve] 	[SUCCESSFUL ] commons-logging#commons-logging-api;1.0.4!commons-logging-api.jar
(1994ms)
[ivy:resolve] downloading http://repo1.maven.org/maven2/com/google/guava/guava/r09/guava-r09.jar
...
[ivy:resolve] ..................................................
[ivy:resolve] ...................... (1117kB)
[ivy:resolve] .. (0kB)
[ivy:resolve] downloading http://repo1.maven.org/maven2/org/codehaus/jackson/jackson-core-asl/1.8.8/jackson-core-asl-1.8.8.jar
...
[ivy:resolve] ......... (222kB)
[ivy:resolve] .. (0kB)
[ivy:resolve] 	[SUCCESSFUL ] org.codehaus.jackson#jackson-core-asl;1.8.8!jackson-core-asl.jar
(1917ms)
[ivy:resolve] downloading http://repo1.maven.org/maven2/org/codehaus/jackson/jackson-mapper-asl/1.8.8/jackson-mapper-asl-1.8.8.jar
...
[ivy:resolve] ..................... (652kB)
[ivy:resolve] .. (0kB)
[ivy:resolve] 	[SUCCESSFUL ] org.codehaus.jackson#jackson-mapper-asl;1.8.8!jackson-mapper-asl.jar
(2022ms)
[ivy:resolve] 
[ivy:resolve] :: problems summary ::
[ivy:resolve] :::: WARNINGS
[ivy:resolve] 	impossible to put metadata file in cache: http://repo1.maven.org/maven2/org/apache/zookeeper/zookeeper/3.4.3/zookeeper-3.4.3.pom
(3.4.3). java.io.FileNotFoundException: /home/jenkins/.ivy2/cache/org.apache.zookeeper/zookeeper/ivy-3.4.3.xml.original
(No such file or directory)
[ivy:resolve] 	impossible to put metadata file in cache: http://repo1.maven.org/maven2/org/apache/thrift/libthrift/0.7.0/libthrift-0.7.0.pom
(0.7.0). java.io.FileNotFoundException: /home/jenkins/.ivy2/cache/org.apache.thrift/libthrift/ivy-0.7.0.xml.original
(No such file or directory)
[ivy:resolve] 	impossible to put metadata file in cache: http://repo1.maven.org/maven2/commons-logging/commons-logging/1.0.4/commons-logging-1.0.4.pom
(1.0.4). java.io.FileNotFoundException: /home/jenkins/.ivy2/cache/commons-logging/commons-logging/ivy-1.0.4.xml.original
(No such file or directory)
[ivy:resolve] 	impossible to put metadata file in cache: http://repo1.maven.org/maven2/commons-logging/commons-logging-api/1.0.4/commons-logging-api-1.0.4.pom
(1.0.4). java.io.FileNotFoundException: /home/jenkins/.ivy2/cache/commons-logging/commons-logging-api/ivy-1.0.4.xml.original
(No such file or directory)
[ivy:resolve] 	impossible to put metadata file in cache: http://repo1.maven.org/maven2/com/google/guava/guava/r09/guava-r09.pom
(r09). java.io.FileNotFoundException: /home/jenkins/.ivy2/cache/com.google.guava/guava/ivy-r09.xml.original
(No such file or directory)
[ivy:resolve] 	impossible to put metadata file in cache: http://repo1.maven.org/maven2/org/codehaus/jackson/jackson-core-asl/1.8.8/jackson-core-asl-1.8.8.pom
(1.8.8). java.io.FileNotFoundException: /home/jenkins/.ivy2/cache/org.codehaus.jackson/jackson-core-asl/ivy-1.8.8.xml.original
(No such file or directory)
[ivy:resolve] 		[FAILED     ] org.apache.thrift#libthrift;0.7.0!libthrift.jar: invalid sha1:
expected=b10dbd7c223392bb9bf22cef09ff2eb21515f35c computed=5bd59e16c7bdff54b01154d04a3e7f74885aeb0f
(1990ms)
[ivy:resolve] 		[FAILED     ] org.apache.thrift#libthrift;0.7.0!libthrift.jar:  (0ms)
[ivy:resolve] 	==== local: tried
[ivy:resolve] 	  /home/jenkins/.ivy2/local/org.apache.thrift/libthrift/0.7.0/jars/libthrift.jar
[ivy:resolve] 	==== apache-snapshot: tried
[ivy:resolve] 	  https://repository.apache.org/content/repositories/snapshots/org/apache/thrift/libthrift/0.7.0/libthrift-0.7.0.jar
[ivy:resolve] 	==== maven2: tried
[ivy:resolve] 	  http://repo1.maven.org/maven2/org/apache/thrift/libthrift/0.7.0/libthrift-0.7.0.jar
[ivy:resolve] 	==== datanucleus-repo: tried
[ivy:resolve] 	  http://www.datanucleus.org/downloads/maven2/org/apache/thrift/libthrift/0.7.0/libthrift-0.7.0.jar
[ivy:resolve] 	==== hadoop-source: tried
[ivy:resolve] 	  http://mirror.facebook.net/facebook/hive-deps/hadoop/core/libthrift-0.7.0/libthrift-0.7.0.jar
[ivy:resolve] 	==== hadoop-source2: tried
[ivy:resolve] 	  http://archive.cloudera.com/hive-deps/hadoop/core/libthrift-0.7.0/libthrift-0.7.0.jar
[ivy:resolve] 		[FAILED     ] com.google.guava#guava;r09!guava.jar: impossible to move part
file to definitive one: /home/jenkins/.ivy2/cache/com.google.guava/guava/jars/guava-r09.jar.part
-> /home/jenkins/.ivy2/cache/com.google.guava/guava/jars/guava-r09.jar (2925ms)
[ivy:resolve] 		::::::::::::::::::::::::::::::::::::::::::::::
[ivy:resolve] 		::              FAILED DOWNLOADS            ::
[ivy:resolve] 		:: ^ see resolution messages for details  ^ ::
[ivy:resolve] 		::::::::::::::::::::::::::::::::::::::::::::::
[ivy:resolve] 		:: org.apache.thrift#libthrift;0.7.0!libthrift.jar
[ivy:resolve] 		::::::::::::::::::::::::::::::::::::::::::::::
[ivy:resolve] 
[ivy:resolve] :: USE VERBOSE OR DEBUG MESSAGE LEVEL FOR MORE DETAILS

BUILD FAILED
<https://builds.apache.org/job/Hive-0.9.1-SNAPSHOT-h0.21/ws/hive/build.xml>:302: The
following error occurred while executing this line:
<https://builds.apache.org/job/Hive-0.9.1-SNAPSHOT-h0.21/ws/hive/build.xml>:152: The
following error occurred while executing this line:
<https://builds.apache.org/job/Hive-0.9.1-SNAPSHOT-h0.21/ws/hive/build-common.xml>:125:
impossible to resolve dependencies:
	resolve failed - see output for details

Total time: 1 minute 10 seconds
Build step 'Invoke Ant' marked build as failure
Archiving artifacts
Recording test results

Mime
View raw message