hive-dev mailing list archives

Site index · List index
Message view « Date » · « Thread »
Top « Date » · « Thread »
From Apache Jenkins Server <jenk...@builds.apache.org>
Subject Build failed in Jenkins: Hive-0.9.1-SNAPSHOT-h0.21 #26
Date Thu, 24 May 2012 16:09:52 GMT
See <https://builds.apache.org/job/Hive-0.9.1-SNAPSHOT-h0.21/26/>

------------------------------------------
[...truncated 5452 lines...]
     [echo] Project: hbase-handler

create-dirs:
     [echo] Project: pdk
    [mkdir] Created dir: <https://builds.apache.org/job/Hive-0.9.1-SNAPSHOT-h0.21/26/artifact/hive/build/pdk>
    [mkdir] Created dir: <https://builds.apache.org/job/Hive-0.9.1-SNAPSHOT-h0.21/26/artifact/hive/build/pdk/classes>
    [mkdir] Created dir: <https://builds.apache.org/job/Hive-0.9.1-SNAPSHOT-h0.21/26/artifact/hive/build/pdk/test>
    [mkdir] Created dir: <https://builds.apache.org/job/Hive-0.9.1-SNAPSHOT-h0.21/26/artifact/hive/build/pdk/test/src>
    [mkdir] Created dir: <https://builds.apache.org/job/Hive-0.9.1-SNAPSHOT-h0.21/26/artifact/hive/build/pdk/test/classes>
    [mkdir] Created dir: <https://builds.apache.org/job/Hive-0.9.1-SNAPSHOT-h0.21/26/artifact/hive/build/pdk/test/resources>
     [copy] Warning: <https://builds.apache.org/job/Hive-0.9.1-SNAPSHOT-h0.21/ws/hive/pdk/src/test/resources>
does not exist.

init:
     [echo] Project: pdk

create-dirs:
     [echo] Project: builtins
    [mkdir] Created dir: <https://builds.apache.org/job/Hive-0.9.1-SNAPSHOT-h0.21/26/artifact/hive/build/builtins>
    [mkdir] Created dir: <https://builds.apache.org/job/Hive-0.9.1-SNAPSHOT-h0.21/26/artifact/hive/build/builtins/classes>
    [mkdir] Created dir: <https://builds.apache.org/job/Hive-0.9.1-SNAPSHOT-h0.21/26/artifact/hive/build/builtins/test>
    [mkdir] Created dir: <https://builds.apache.org/job/Hive-0.9.1-SNAPSHOT-h0.21/26/artifact/hive/build/builtins/test/src>
    [mkdir] Created dir: <https://builds.apache.org/job/Hive-0.9.1-SNAPSHOT-h0.21/26/artifact/hive/build/builtins/test/classes>
    [mkdir] Created dir: <https://builds.apache.org/job/Hive-0.9.1-SNAPSHOT-h0.21/26/artifact/hive/build/builtins/test/resources>
     [copy] Warning: <https://builds.apache.org/job/Hive-0.9.1-SNAPSHOT-h0.21/ws/hive/builtins/src/test/resources>
does not exist.

init:
     [echo] Project: builtins

jar:
     [echo] Project: hive

create-dirs:
     [echo] Project: shims
     [copy] Warning: <https://builds.apache.org/job/Hive-0.9.1-SNAPSHOT-h0.21/ws/hive/shims/src/test/resources>
does not exist.

init:
     [echo] Project: shims

ivy-init-settings:
     [echo] Project: shims

ivy-resolve:
     [echo] Project: shims
[ivy:resolve] :: loading settings :: file = <https://builds.apache.org/job/Hive-0.9.1-SNAPSHOT-h0.21/ws/hive/ivy/ivysettings.xml>
[ivy:resolve] downloading http://repo1.maven.org/maven2/org/apache/zookeeper/zookeeper/3.4.3/zookeeper-3.4.3.jar
...
[ivy:resolve] ...........................................................................................................................................................
(749kB)
[ivy:resolve] .. (0kB)
[ivy:resolve] 	[SUCCESSFUL ] org.apache.zookeeper#zookeeper;3.4.3!zookeeper.jar (1977ms)
[ivy:resolve] downloading http://repo1.maven.org/maven2/org/apache/thrift/libthrift/0.7.0/libthrift-0.7.0.jar
...
[ivy:resolve] .............................................................. (294kB)
[ivy:resolve] .. (0kB)
[ivy:resolve] 	[SUCCESSFUL ] org.apache.thrift#libthrift;0.7.0!libthrift.jar (2543ms)
[ivy:resolve] downloading http://repo1.maven.org/maven2/commons-logging/commons-logging/1.0.4/commons-logging-1.0.4.jar
...
[ivy:resolve] ............. (37kB)
[ivy:resolve] .. (0kB)
[ivy:resolve] 	[SUCCESSFUL ] commons-logging#commons-logging;1.0.4!commons-logging.jar (1954ms)
[ivy:resolve] downloading http://repo1.maven.org/maven2/commons-logging/commons-logging-api/1.0.4/commons-logging-api-1.0.4.jar
...
[ivy:resolve] .......... (25kB)
[ivy:resolve] .. (0kB)
[ivy:resolve] 	[SUCCESSFUL ] commons-logging#commons-logging-api;1.0.4!commons-logging-api.jar
(1481ms)
[ivy:resolve] downloading http://repo1.maven.org/maven2/com/google/guava/guava/r09/guava-r09.jar
...
[ivy:resolve] ...................................................................................................................................................................................................................
(1117kB)
[ivy:resolve] .. (0kB)
[ivy:resolve] 	[SUCCESSFUL ] com.google.guava#guava;r09!guava.jar (2259ms)
[ivy:resolve] downloading http://repo1.maven.org/maven2/org/codehaus/jackson/jackson-core-asl/1.8.8/jackson-core-asl-1.8.8.jar
...
[ivy:resolve] ................................... (222kB)
[ivy:resolve] .. (0kB)
[ivy:resolve] 	[SUCCESSFUL ] org.codehaus.jackson#jackson-core-asl;1.8.8!jackson-core-asl.jar
(1755ms)
[ivy:resolve] downloading http://repo1.maven.org/maven2/org/codehaus/jackson/jackson-mapper-asl/1.8.8/jackson-mapper-asl-1.8.8.jar
...
[ivy:resolve] ................................................................................................................................
(652kB)
[ivy:resolve] .. (0kB)
[ivy:resolve] 	[SUCCESSFUL ] org.codehaus.jackson#jackson-mapper-asl;1.8.8!jackson-mapper-asl.jar
(1984ms)
[ivy:report] Processing <https://builds.apache.org/job/Hive-0.9.1-SNAPSHOT-h0.21/26/artifact/hive/build/ivy/resolution-cache/org.apache.hive-hive-shims-default.xml>
to <https://builds.apache.org/job/Hive-0.9.1-SNAPSHOT-h0.21/26/artifact/hive/build/ivy/report/org.apache.hive-hive-shims-default.html>

ivy-retrieve:
     [echo] Project: shims

compile:
     [echo] Project: shims
     [echo] Building shims 0.20

build_shims:
     [echo] Project: shims
     [echo] Compiling <https://builds.apache.org/job/Hive-0.9.1-SNAPSHOT-h0.21/ws/hive/shims/src/common/java;/home/jenkins/jenkins-slave/workspace/Hive-0.9.1-SNAPSHOT-h0.21/hive/shims/src/0.20/java>
against hadoop 0.20.2 (<https://builds.apache.org/job/Hive-0.9.1-SNAPSHOT-h0.21/26/artifact/hive/build/hadoopcore/hadoop-0.20.2)>

ivy-init-settings:
     [echo] Project: shims

ivy-resolve-hadoop-shim:
     [echo] Project: shims
[ivy:resolve] :: loading settings :: file = <https://builds.apache.org/job/Hive-0.9.1-SNAPSHOT-h0.21/ws/hive/ivy/ivysettings.xml>
[ivy:resolve] 
[ivy:resolve] :: problems summary ::
[ivy:resolve] :::: WARNINGS
[ivy:resolve] 	impossible to put metadata file in cache: http://repo1.maven.org/maven2/commons-logging/commons-logging/1.1.1/commons-logging-1.1.1.pom
(1.1.1). java.io.FileNotFoundException: /home/jenkins/.ivy2/cache/commons-logging/commons-logging/ivy-1.1.1.xml.original
(No such file or directory)
[ivy:resolve] 
[ivy:resolve] :: USE VERBOSE OR DEBUG MESSAGE LEVEL FOR MORE DETAILS

ivy-retrieve-hadoop-shim:
     [echo] Project: shims
    [javac] Compiling 16 source files to <https://builds.apache.org/job/Hive-0.9.1-SNAPSHOT-h0.21/26/artifact/hive/build/shims/classes>
    [javac] Note: Some input files use or override a deprecated API.
    [javac] Note: Recompile with -Xlint:deprecation for details.
    [javac] Note: <https://builds.apache.org/job/Hive-0.9.1-SNAPSHOT-h0.21/ws/hive/shims/src/0.20/java/org/apache/hadoop/hive/shims/Hadoop20Shims.java>
uses unchecked or unsafe operations.
    [javac] Note: Recompile with -Xlint:unchecked for details.
     [echo] Building shims 0.20S

build_shims:
     [echo] Project: shims
     [echo] Compiling <https://builds.apache.org/job/Hive-0.9.1-SNAPSHOT-h0.21/ws/hive/shims/src/common/java;/home/jenkins/jenkins-slave/workspace/Hive-0.9.1-SNAPSHOT-h0.21/hive/shims/src/common-secure/java;/home/jenkins/jenkins-slave/workspace/Hive-0.9.1-SNAPSHOT-h0.21/hive/shims/src/0.20S/java>
against hadoop 1.0.0 (<https://builds.apache.org/job/Hive-0.9.1-SNAPSHOT-h0.21/26/artifact/hive/build/hadoopcore/hadoop-1.0.0)>

ivy-init-settings:
     [echo] Project: shims

ivy-resolve-hadoop-shim:
     [echo] Project: shims
[ivy:resolve] :: loading settings :: file = <https://builds.apache.org/job/Hive-0.9.1-SNAPSHOT-h0.21/ws/hive/ivy/ivysettings.xml>
[ivy:resolve] downloading http://repo1.maven.org/maven2/org/apache/hadoop/hadoop-core/1.0.0/hadoop-core-1.0.0.jar
...
[ivy:resolve] .............................................................................................................................................................................................................................................................................................................................................................................................................................................................................................................................................................................................................................
(3652kB)
[ivy:resolve] downloading http://repo1.maven.org/maven2/org/apache/hadoop/hadoop-tools/1.0.0/hadoop-tools-1.0.0.jar
...
[ivy:resolve] ..................................... (281kB)
[ivy:resolve] .. (0kB)
[ivy:resolve] downloading http://repo1.maven.org/maven2/org/apache/hadoop/hadoop-test/1.0.0/hadoop-test-1.0.0.jar
...
[ivy:resolve] ................................................................................................................................................................................................................................................................................................................................................................................................................................
(2471kB)
[ivy:resolve] .. (0kB)
[ivy:resolve] 	[SUCCESSFUL ] org.apache.hadoop#hadoop-test;1.0.0!hadoop-test.jar (2272ms)
[ivy:resolve] downloading http://repo1.maven.org/maven2/org/apache/commons/commons-math/2.1/commons-math-2.1.jar
...
[ivy:resolve] ..................................................................................................................
(812kB)
[ivy:resolve] downloading http://repo1.maven.org/maven2/commons-configuration/commons-configuration/1.6/commons-configuration-1.6.jar
...
[ivy:resolve] ..................................... (291kB)
[ivy:resolve] .. (0kB)
[ivy:resolve] downloading http://repo1.maven.org/maven2/org/mortbay/jetty/jetty/6.1.26/jetty-6.1.26.jar
...
[ivy:resolve] ....................................................................................................................
(527kB)
[ivy:resolve] .. (0kB)
[ivy:resolve] downloading http://repo1.maven.org/maven2/junit/junit/3.8.1/junit-3.8.1.jar
...
[ivy:resolve] .............................. (118kB)
[ivy:resolve] .. (0kB)
[ivy:resolve] 	[SUCCESSFUL ] junit#junit;3.8.1!junit.jar (2206ms)
[ivy:resolve] downloading http://repo1.maven.org/maven2/commons-collections/commons-collections/3.2.1/commons-collections-3.2.1.jar
...
[ivy:resolve] ....................................................................................................................
(561kB)
[ivy:resolve] .. (0kB)
[ivy:resolve] 	[SUCCESSFUL ] commons-collections#commons-collections;3.2.1!commons-collections.jar
(2215ms)
[ivy:resolve] downloading http://repo1.maven.org/maven2/commons-digester/commons-digester/1.8/commons-digester-1.8.jar
...
[ivy:resolve] .......................... (140kB)
[ivy:resolve] .. (0kB)
[ivy:resolve] 	[SUCCESSFUL ] commons-digester#commons-digester;1.8!commons-digester.jar (2243ms)
[ivy:resolve] downloading http://repo1.maven.org/maven2/commons-beanutils/commons-beanutils-core/1.8.0/commons-beanutils-core-1.8.0.jar
...
[ivy:resolve] ......................................... (201kB)
[ivy:resolve] .. (0kB)
[ivy:resolve] 	[SUCCESSFUL ] commons-beanutils#commons-beanutils-core;1.8.0!commons-beanutils-core.jar
(1751ms)
[ivy:resolve] downloading http://repo1.maven.org/maven2/commons-beanutils/commons-beanutils/1.7.0/commons-beanutils-1.7.0.jar
...
[ivy:resolve] ........................... (184kB)
[ivy:resolve] .. (0kB)
[ivy:resolve] 	[SUCCESSFUL ] commons-beanutils#commons-beanutils;1.7.0!commons-beanutils.jar
(1997ms)
[ivy:resolve] downloading http://repo1.maven.org/maven2/org/mortbay/jetty/servlet-api/2.5-20081211/servlet-api-2.5-20081211.jar
...
[ivy:resolve] .......................... (130kB)
[ivy:resolve] .. (0kB)
[ivy:resolve] 	[SUCCESSFUL ] org.mortbay.jetty#servlet-api;2.5-20081211!servlet-api.jar (1999ms)
[ivy:resolve] 
[ivy:resolve] :: problems summary ::
[ivy:resolve] :::: WARNINGS
[ivy:resolve] 	problem while downloading module descriptor: http://repo1.maven.org/maven2/org/mortbay/jetty/jetty-util/6.1.26/jetty-util-6.1.26.pom:
/home/jenkins/.ivy2/cache/org.mortbay.jetty/jetty-util/ivy-6.1.26.xml.original.part (No such
file or directory) (2001ms)
[ivy:resolve] 		module not found: org.mortbay.jetty#jetty-util;6.1.26
[ivy:resolve] 	==== local: tried
[ivy:resolve] 	  /home/jenkins/.ivy2/local/org.mortbay.jetty/jetty-util/6.1.26/ivys/ivy.xml
[ivy:resolve] 	  -- artifact org.mortbay.jetty#jetty-util;6.1.26!jetty-util.jar:
[ivy:resolve] 	  /home/jenkins/.ivy2/local/org.mortbay.jetty/jetty-util/6.1.26/jars/jetty-util.jar
[ivy:resolve] 	==== apache-snapshot: tried
[ivy:resolve] 	  https://repository.apache.org/content/repositories/snapshots/org/mortbay/jetty/jetty-util/6.1.26/jetty-util-6.1.26.pom
[ivy:resolve] 	  -- artifact org.mortbay.jetty#jetty-util;6.1.26!jetty-util.jar:
[ivy:resolve] 	  https://repository.apache.org/content/repositories/snapshots/org/mortbay/jetty/jetty-util/6.1.26/jetty-util-6.1.26.jar
[ivy:resolve] 	==== maven2: tried
[ivy:resolve] 	  http://repo1.maven.org/maven2/org/mortbay/jetty/jetty-util/6.1.26/jetty-util-6.1.26.pom
[ivy:resolve] 	==== datanucleus-repo: tried
[ivy:resolve] 	  -- artifact org.mortbay.jetty#jetty-util;6.1.26!jetty-util.jar:
[ivy:resolve] 	  http://www.datanucleus.org/downloads/maven2/org/mortbay/jetty/jetty-util/6.1.26/jetty-util-6.1.26.jar
[ivy:resolve] 	==== hadoop-source: tried
[ivy:resolve] 	  -- artifact org.mortbay.jetty#jetty-util;6.1.26!jetty-util.jar:
[ivy:resolve] 	  http://mirror.facebook.net/facebook/hive-deps/hadoop/core/jetty-util-6.1.26/jetty-util-6.1.26.jar
[ivy:resolve] 	==== hadoop-source2: tried
[ivy:resolve] 	  -- artifact org.mortbay.jetty#jetty-util;6.1.26!jetty-util.jar:
[ivy:resolve] 	  http://archive.cloudera.com/hive-deps/hadoop/core/jetty-util-6.1.26/jetty-util-6.1.26.jar
[ivy:resolve] 	problem while downloading module descriptor: http://repo1.maven.org/maven2/org/codehaus/jackson/jackson-mapper-asl/1.0.1/jackson-mapper-asl-1.0.1.pom:
/home/jenkins/.ivy2/cache/org.codehaus.jackson/jackson-mapper-asl/ivy-1.0.1.xml.original.part
(No such file or directory) (1999ms)
[ivy:resolve] 		module not found: org.codehaus.jackson#jackson-mapper-asl;1.0.1
[ivy:resolve] 	==== local: tried
[ivy:resolve] 	  /home/jenkins/.ivy2/local/org.codehaus.jackson/jackson-mapper-asl/1.0.1/ivys/ivy.xml
[ivy:resolve] 	  -- artifact org.codehaus.jackson#jackson-mapper-asl;1.0.1!jackson-mapper-asl.jar:
[ivy:resolve] 	  /home/jenkins/.ivy2/local/org.codehaus.jackson/jackson-mapper-asl/1.0.1/jars/jackson-mapper-asl.jar
[ivy:resolve] 	==== apache-snapshot: tried
[ivy:resolve] 	  https://repository.apache.org/content/repositories/snapshots/org/codehaus/jackson/jackson-mapper-asl/1.0.1/jackson-mapper-asl-1.0.1.pom
[ivy:resolve] 	  -- artifact org.codehaus.jackson#jackson-mapper-asl;1.0.1!jackson-mapper-asl.jar:
[ivy:resolve] 	  https://repository.apache.org/content/repositories/snapshots/org/codehaus/jackson/jackson-mapper-asl/1.0.1/jackson-mapper-asl-1.0.1.jar
[ivy:resolve] 	==== maven2: tried
[ivy:resolve] 	  http://repo1.maven.org/maven2/org/codehaus/jackson/jackson-mapper-asl/1.0.1/jackson-mapper-asl-1.0.1.pom
[ivy:resolve] 	==== datanucleus-repo: tried
[ivy:resolve] 	  -- artifact org.codehaus.jackson#jackson-mapper-asl;1.0.1!jackson-mapper-asl.jar:
[ivy:resolve] 	  http://www.datanucleus.org/downloads/maven2/org/codehaus/jackson/jackson-mapper-asl/1.0.1/jackson-mapper-asl-1.0.1.jar
[ivy:resolve] 	==== hadoop-source: tried
[ivy:resolve] 	  -- artifact org.codehaus.jackson#jackson-mapper-asl;1.0.1!jackson-mapper-asl.jar:
[ivy:resolve] 	  http://mirror.facebook.net/facebook/hive-deps/hadoop/core/jackson-mapper-asl-1.0.1/jackson-mapper-asl-1.0.1.jar
[ivy:resolve] 	==== hadoop-source2: tried
[ivy:resolve] 	  -- artifact org.codehaus.jackson#jackson-mapper-asl;1.0.1!jackson-mapper-asl.jar:
[ivy:resolve] 	  http://archive.cloudera.com/hive-deps/hadoop/core/jackson-mapper-asl-1.0.1/jackson-mapper-asl-1.0.1.jar
[ivy:resolve] 		[FAILED     ] org.apache.hadoop#hadoop-core;1.0.0!hadoop-core.jar: Downloaded
file size doesn't match expected Content Length for http://repo1.maven.org/maven2/org/apache/hadoop/hadoop-core/1.0.0/hadoop-core-1.0.0.jar.
Please retry. (1697ms)
[ivy:resolve] 		[FAILED     ] org.apache.hadoop#hadoop-tools;1.0.0!hadoop-tools.jar: /home/jenkins/.ivy2/cache/org.apache.hadoop/hadoop-tools/jars/hadoop-tools-1.0.0.jar.part
(No such file or directory) (1929ms)
[ivy:resolve] 		[FAILED     ] org.apache.commons#commons-math;2.1!commons-math.jar: Downloaded
file size doesn't match expected Content Length for http://repo1.maven.org/maven2/org/apache/commons/commons-math/2.1/commons-math-2.1.jar.
Please retry. (1260ms)
[ivy:resolve] 		[FAILED     ] org.apache.commons#commons-math;2.1!commons-math.jar:  (0ms)
[ivy:resolve] 	==== local: tried
[ivy:resolve] 	  /home/jenkins/.ivy2/local/org.apache.commons/commons-math/2.1/jars/commons-math.jar
[ivy:resolve] 	==== apache-snapshot: tried
[ivy:resolve] 	  https://repository.apache.org/content/repositories/snapshots/org/apache/commons/commons-math/2.1/commons-math-2.1.jar
[ivy:resolve] 	==== maven2: tried
[ivy:resolve] 	  http://repo1.maven.org/maven2/org/apache/commons/commons-math/2.1/commons-math-2.1.jar
[ivy:resolve] 	==== datanucleus-repo: tried
[ivy:resolve] 	  http://www.datanucleus.org/downloads/maven2/org/apache/commons/commons-math/2.1/commons-math-2.1.jar
[ivy:resolve] 	==== hadoop-source: tried
[ivy:resolve] 	  http://mirror.facebook.net/facebook/hive-deps/hadoop/core/commons-math-2.1/commons-math-2.1.jar
[ivy:resolve] 	==== hadoop-source2: tried
[ivy:resolve] 	  http://archive.cloudera.com/hive-deps/hadoop/core/commons-math-2.1/commons-math-2.1.jar
[ivy:resolve] 		[FAILED     ] commons-configuration#commons-configuration;1.6!commons-configuration.jar:
/home/jenkins/.ivy2/cache/commons-configuration/commons-configuration/jars/commons-configuration-1.6.jar.part
(No such file or directory) (1884ms)
[ivy:resolve] 		[FAILED     ] org.mortbay.jetty#jetty;6.1.26!jetty.jar: /home/jenkins/.ivy2/cache/org.mortbay.jetty/jetty/jars/jetty-6.1.26.jar.part
(No such file or directory) (2562ms)
[ivy:resolve] 		::::::::::::::::::::::::::::::::::::::::::::::
[ivy:resolve] 		::          UNRESOLVED DEPENDENCIES         ::
[ivy:resolve] 		::::::::::::::::::::::::::::::::::::::::::::::
[ivy:resolve] 		:: org.mortbay.jetty#jetty-util;6.1.26: not found
[ivy:resolve] 		:: org.codehaus.jackson#jackson-mapper-asl;1.0.1: not found
[ivy:resolve] 		::::::::::::::::::::::::::::::::::::::::::::::
[ivy:resolve] 		::::::::::::::::::::::::::::::::::::::::::::::
[ivy:resolve] 		::              FAILED DOWNLOADS            ::
[ivy:resolve] 		:: ^ see resolution messages for details  ^ ::
[ivy:resolve] 		::::::::::::::::::::::::::::::::::::::::::::::
[ivy:resolve] 		:: org.apache.commons#commons-math;2.1!commons-math.jar
[ivy:resolve] 		::::::::::::::::::::::::::::::::::::::::::::::
[ivy:resolve] 
[ivy:resolve] :: USE VERBOSE OR DEBUG MESSAGE LEVEL FOR MORE DETAILS

BUILD FAILED
<https://builds.apache.org/job/Hive-0.9.1-SNAPSHOT-h0.21/ws/hive/build.xml>:302: The
following error occurred while executing this line:
<https://builds.apache.org/job/Hive-0.9.1-SNAPSHOT-h0.21/ws/hive/build.xml>:152: The
following error occurred while executing this line:
<https://builds.apache.org/job/Hive-0.9.1-SNAPSHOT-h0.21/ws/hive/shims/build.xml>:85:
The following error occurred while executing this line:
<https://builds.apache.org/job/Hive-0.9.1-SNAPSHOT-h0.21/ws/hive/shims/build.xml>:88:
The following error occurred while executing this line:
<https://builds.apache.org/job/Hive-0.9.1-SNAPSHOT-h0.21/ws/hive/shims/build.xml>:60:
The following error occurred while executing this line:
<https://builds.apache.org/job/Hive-0.9.1-SNAPSHOT-h0.21/ws/hive/build-common.xml>:164:
impossible to resolve dependencies:
	resolve failed - see output for details

Total time: 3 minutes 36 seconds
Build step 'Invoke Ant' marked build as failure
Archiving artifacts
Recording test results

Mime
View raw message