hive-dev mailing list archives

Site index · List index
Message view « Date » · « Thread »
Top « Date » · « Thread »
From Apache Jenkins Server <jenk...@builds.apache.org>
Subject Hive-0.8.1-SNAPSHOT-h0.21 - Build # 158 - Failure
Date Thu, 12 Jan 2012 19:40:59 GMT
Changes for Build #158



10 tests failed.
REGRESSION:  org.apache.hadoop.hive.cli.TestHBaseMinimrCliDriver.testCliDriver_hbase_bulk

Error Message:
Unexpected exception

Stack Trace:
junit.framework.AssertionFailedError: Unexpected exception
	at junit.framework.Assert.fail(Assert.java:50)
	at org.apache.hadoop.hive.cli.TestHBaseMinimrCliDriver.testCliDriver_hbase_bulk(TestHBaseMinimrCliDriver.java:111)
	at sun.reflect.NativeMethodAccessorImpl.invoke0(Native Method)
	at sun.reflect.NativeMethodAccessorImpl.invoke(NativeMethodAccessorImpl.java:39)
	at sun.reflect.DelegatingMethodAccessorImpl.invoke(DelegatingMethodAccessorImpl.java:25)
	at java.lang.reflect.Method.invoke(Method.java:597)
	at junit.framework.TestCase.runTest(TestCase.java:168)
	at junit.framework.TestCase.runBare(TestCase.java:134)
	at junit.framework.TestResult$1.protect(TestResult.java:110)
	at junit.framework.TestResult.runProtected(TestResult.java:128)
	at junit.framework.TestResult.run(TestResult.java:113)
	at junit.framework.TestCase.run(TestCase.java:124)
	at junit.framework.TestSuite.runTest(TestSuite.java:243)
	at junit.framework.TestSuite.run(TestSuite.java:238)
	at junit.extensions.TestDecorator.basicRun(TestDecorator.java:24)
	at junit.extensions.TestSetup$1.protect(TestSetup.java:23)
	at junit.framework.TestResult.runProtected(TestResult.java:128)
	at junit.extensions.TestSetup.run(TestSetup.java:27)
	at org.apache.tools.ant.taskdefs.optional.junit.JUnitTestRunner.run(JUnitTestRunner.java:518)
	at org.apache.tools.ant.taskdefs.optional.junit.JUnitTestRunner.launch(JUnitTestRunner.java:1052)
	at org.apache.tools.ant.taskdefs.optional.junit.JUnitTestRunner.main(JUnitTestRunner.java:906)


REGRESSION:  org.apache.hadoop.hive.metastore.TestMarkPartitionRemote.testMarkingPartitionSet

Error Message:
Could not connect to meta store using any of the URIs provided

Stack Trace:
MetaException(message:Could not connect to meta store using any of the URIs provided)
	at org.apache.hadoop.hive.metastore.HiveMetaStoreClient.open(HiveMetaStoreClient.java:200)
	at org.apache.hadoop.hive.metastore.HiveMetaStoreClient.<init>(HiveMetaStoreClient.java:152)
	at org.apache.hadoop.hive.metastore.TestMarkPartition.testMarkingPartitionSet(TestMarkPartition.java:63)
	at sun.reflect.NativeMethodAccessorImpl.invoke0(Native Method)
	at sun.reflect.NativeMethodAccessorImpl.invoke(NativeMethodAccessorImpl.java:39)
	at sun.reflect.DelegatingMethodAccessorImpl.invoke(DelegatingMethodAccessorImpl.java:25)
	at java.lang.reflect.Method.invoke(Method.java:597)
	at junit.framework.TestCase.runTest(TestCase.java:168)
	at junit.framework.TestCase.runBare(TestCase.java:134)
	at junit.framework.TestResult$1.protect(TestResult.java:110)
	at junit.framework.TestResult.runProtected(TestResult.java:128)
	at junit.framework.TestResult.run(TestResult.java:113)
	at junit.framework.TestCase.run(TestCase.java:124)
	at junit.framework.TestSuite.runTest(TestSuite.java:243)
	at junit.framework.TestSuite.run(TestSuite.java:238)
	at org.apache.tools.ant.taskdefs.optional.junit.JUnitTestRunner.run(JUnitTestRunner.java:518)
	at org.apache.tools.ant.taskdefs.optional.junit.JUnitTestRunner.launch(JUnitTestRunner.java:1052)
	at org.apache.tools.ant.taskdefs.optional.junit.JUnitTestRunner.main(JUnitTestRunner.java:906)


REGRESSION:  org.apache.hadoop.hive.metastore.TestMetaStoreEventListener.testListener

Error Message:
Could not connect to meta store using any of the URIs provided

Stack Trace:
MetaException(message:Could not connect to meta store using any of the URIs provided)
	at org.apache.hadoop.hive.metastore.HiveMetaStoreClient.open(HiveMetaStoreClient.java:200)
	at org.apache.hadoop.hive.metastore.HiveMetaStoreClient.<init>(HiveMetaStoreClient.java:152)
	at org.apache.hadoop.hive.metastore.TestMetaStoreEventListener.setUp(TestMetaStoreEventListener.java:88)
	at junit.framework.TestCase.runBare(TestCase.java:132)
	at junit.framework.TestResult$1.protect(TestResult.java:110)
	at junit.framework.TestResult.runProtected(TestResult.java:128)
	at junit.framework.TestResult.run(TestResult.java:113)
	at junit.framework.TestCase.run(TestCase.java:124)
	at junit.framework.TestSuite.runTest(TestSuite.java:243)
	at junit.framework.TestSuite.run(TestSuite.java:238)
	at org.apache.tools.ant.taskdefs.optional.junit.JUnitTestRunner.run(JUnitTestRunner.java:518)
	at org.apache.tools.ant.taskdefs.optional.junit.JUnitTestRunner.launch(JUnitTestRunner.java:1052)
	at org.apache.tools.ant.taskdefs.optional.junit.JUnitTestRunner.main(JUnitTestRunner.java:906)


REGRESSION:  org.apache.hadoop.hive.metastore.TestRemoteHiveMetaStore.testPartitionFilter

Error Message:
null

Stack Trace:
org.apache.thrift.transport.TTransportException
	at org.apache.thrift.transport.TIOStreamTransport.read(TIOStreamTransport.java:132)
	at org.apache.thrift.transport.TTransport.readAll(TTransport.java:84)
	at org.apache.thrift.protocol.TBinaryProtocol.readAll(TBinaryProtocol.java:378)
	at org.apache.thrift.protocol.TBinaryProtocol.readI32(TBinaryProtocol.java:297)
	at org.apache.thrift.protocol.TBinaryProtocol.readMessageBegin(TBinaryProtocol.java:204)
	at org.apache.thrift.TServiceClient.receiveBase(TServiceClient.java:69)
	at org.apache.hadoop.hive.metastore.api.ThriftHiveMetastore$Client.recv_get_partitions_by_filter(ThriftHiveMetastore.java:1389)
	at org.apache.hadoop.hive.metastore.api.ThriftHiveMetastore$Client.get_partitions_by_filter(ThriftHiveMetastore.java:1373)
	at org.apache.hadoop.hive.metastore.HiveMetaStoreClient.listPartitionsByFilter(HiveMetaStoreClient.java:655)
	at org.apache.hadoop.hive.metastore.TestHiveMetaStore.checkFilter(TestHiveMetaStore.java:1722)
	at org.apache.hadoop.hive.metastore.TestHiveMetaStore.testPartitionFilter(TestHiveMetaStore.java:1501)
	at sun.reflect.NativeMethodAccessorImpl.invoke0(Native Method)
	at sun.reflect.NativeMethodAccessorImpl.invoke(NativeMethodAccessorImpl.java:39)
	at sun.reflect.DelegatingMethodAccessorImpl.invoke(DelegatingMethodAccessorImpl.java:25)
	at java.lang.reflect.Method.invoke(Method.java:597)
	at junit.framework.TestCase.runTest(TestCase.java:168)
	at junit.framework.TestCase.runBare(TestCase.java:134)
	at junit.framework.TestResult$1.protect(TestResult.java:110)
	at junit.framework.TestResult.runProtected(TestResult.java:128)
	at junit.framework.TestResult.run(TestResult.java:113)
	at junit.framework.TestCase.run(TestCase.java:124)
	at junit.framework.TestSuite.runTest(TestSuite.java:243)
	at junit.framework.TestSuite.run(TestSuite.java:238)
	at org.apache.tools.ant.taskdefs.optional.junit.JUnitTestRunner.run(JUnitTestRunner.java:518)
	at org.apache.tools.ant.taskdefs.optional.junit.JUnitTestRunner.launch(JUnitTestRunner.java:1052)
	at org.apache.tools.ant.taskdefs.optional.junit.JUnitTestRunner.main(JUnitTestRunner.java:906)


REGRESSION:  org.apache.hadoop.hive.metastore.TestRemoteHiveMetaStore.testFilterSinglePartition

Error Message:
Got exception: org.apache.thrift.transport.TTransportException java.net.SocketException: Broken
pipe

Stack Trace:
MetaException(message:Got exception: org.apache.thrift.transport.TTransportException java.net.SocketException:
Broken pipe)
	at org.apache.hadoop.hive.metastore.MetaStoreUtils.logAndThrowMetaException(MetaStoreUtils.java:784)
	at org.apache.hadoop.hive.metastore.HiveMetaStoreClient.getTables(HiveMetaStoreClient.java:752)
	at org.apache.hadoop.hive.metastore.TestHiveMetaStore.silentDropDatabase(TestHiveMetaStore.java:1413)
	at org.apache.hadoop.hive.metastore.TestHiveMetaStore.testFilterSinglePartition(TestHiveMetaStore.java:1596)
	at sun.reflect.NativeMethodAccessorImpl.invoke0(Native Method)
	at sun.reflect.NativeMethodAccessorImpl.invoke(NativeMethodAccessorImpl.java:39)
	at sun.reflect.DelegatingMethodAccessorImpl.invoke(DelegatingMethodAccessorImpl.java:25)
	at java.lang.reflect.Method.invoke(Method.java:597)
	at junit.framework.TestCase.runTest(TestCase.java:168)
	at junit.framework.TestCase.runBare(TestCase.java:134)
	at junit.framework.TestResult$1.protect(TestResult.java:110)
	at junit.framework.TestResult.runProtected(TestResult.java:128)
	at junit.framework.TestResult.run(TestResult.java:113)
	at junit.framework.TestCase.run(TestCase.java:124)
	at junit.framework.TestSuite.runTest(TestSuite.java:243)
	at junit.framework.TestSuite.run(TestSuite.java:238)
	at org.apache.tools.ant.taskdefs.optional.junit.JUnitTestRunner.run(JUnitTestRunner.java:518)
	at org.apache.tools.ant.taskdefs.optional.junit.JUnitTestRunner.launch(JUnitTestRunner.java:1052)
	at org.apache.tools.ant.taskdefs.optional.junit.JUnitTestRunner.main(JUnitTestRunner.java:906)


REGRESSION:  org.apache.hadoop.hive.metastore.TestRemoteHiveMetaStore.testFilterLastPartition

Error Message:
Got exception: org.apache.thrift.transport.TTransportException java.net.SocketException: Broken
pipe

Stack Trace:
MetaException(message:Got exception: org.apache.thrift.transport.TTransportException java.net.SocketException:
Broken pipe)
	at org.apache.hadoop.hive.metastore.MetaStoreUtils.logAndThrowMetaException(MetaStoreUtils.java:784)
	at org.apache.hadoop.hive.metastore.HiveMetaStoreClient.getTables(HiveMetaStoreClient.java:752)
	at org.apache.hadoop.hive.metastore.TestHiveMetaStore.silentDropDatabase(TestHiveMetaStore.java:1413)
	at org.apache.hadoop.hive.metastore.TestHiveMetaStore.testFilterLastPartition(TestHiveMetaStore.java:1666)
	at sun.reflect.NativeMethodAccessorImpl.invoke0(Native Method)
	at sun.reflect.NativeMethodAccessorImpl.invoke(NativeMethodAccessorImpl.java:39)
	at sun.reflect.DelegatingMethodAccessorImpl.invoke(DelegatingMethodAccessorImpl.java:25)
	at java.lang.reflect.Method.invoke(Method.java:597)
	at junit.framework.TestCase.runTest(TestCase.java:168)
	at junit.framework.TestCase.runBare(TestCase.java:134)
	at junit.framework.TestResult$1.protect(TestResult.java:110)
	at junit.framework.TestResult.runProtected(TestResult.java:128)
	at junit.framework.TestResult.run(TestResult.java:113)
	at junit.framework.TestCase.run(TestCase.java:124)
	at junit.framework.TestSuite.runTest(TestSuite.java:243)
	at junit.framework.TestSuite.run(TestSuite.java:238)
	at org.apache.tools.ant.taskdefs.optional.junit.JUnitTestRunner.run(JUnitTestRunner.java:518)
	at org.apache.tools.ant.taskdefs.optional.junit.JUnitTestRunner.launch(JUnitTestRunner.java:1052)
	at org.apache.tools.ant.taskdefs.optional.junit.JUnitTestRunner.main(JUnitTestRunner.java:906)


REGRESSION:  org.apache.hadoop.hive.metastore.TestRemoteHiveMetaStore.testSynchronized

Error Message:
Got exception: org.apache.thrift.transport.TTransportException java.net.SocketException: Broken
pipe

Stack Trace:
MetaException(message:Got exception: org.apache.thrift.transport.TTransportException java.net.SocketException:
Broken pipe)
	at org.apache.hadoop.hive.metastore.MetaStoreUtils.logAndThrowMetaException(MetaStoreUtils.java:784)
	at org.apache.hadoop.hive.metastore.HiveMetaStoreClient.getAllDatabases(HiveMetaStoreClient.java:593)
	at sun.reflect.NativeMethodAccessorImpl.invoke0(Native Method)
	at sun.reflect.NativeMethodAccessorImpl.invoke(NativeMethodAccessorImpl.java:39)
	at sun.reflect.DelegatingMethodAccessorImpl.invoke(DelegatingMethodAccessorImpl.java:25)
	at java.lang.reflect.Method.invoke(Method.java:597)
	at org.apache.hadoop.hive.metastore.HiveMetaStoreClient$SynchronizedHandler.invoke(HiveMetaStoreClient.java:1170)
	at $Proxy4.getAllDatabases(Unknown Source)
	at org.apache.hadoop.hive.metastore.TestHiveMetaStore.testSynchronized(TestHiveMetaStore.java:1753)
	at sun.reflect.NativeMethodAccessorImpl.invoke0(Native Method)
	at sun.reflect.NativeMethodAccessorImpl.invoke(NativeMethodAccessorImpl.java:39)
	at sun.reflect.DelegatingMethodAccessorImpl.invoke(DelegatingMethodAccessorImpl.java:25)
	at java.lang.reflect.Method.invoke(Method.java:597)
	at junit.framework.TestCase.runTest(TestCase.java:168)
	at junit.framework.TestCase.runBare(TestCase.java:134)
	at junit.framework.TestResult$1.protect(TestResult.java:110)
	at junit.framework.TestResult.runProtected(TestResult.java:128)
	at junit.framework.TestResult.run(TestResult.java:113)
	at junit.framework.TestCase.run(TestCase.java:124)
	at junit.framework.TestSuite.runTest(TestSuite.java:243)
	at junit.framework.TestSuite.run(TestSuite.java:238)
	at org.apache.tools.ant.taskdefs.optional.junit.JUnitTestRunner.run(JUnitTestRunner.java:518)
	at org.apache.tools.ant.taskdefs.optional.junit.JUnitTestRunner.launch(JUnitTestRunner.java:1052)
	at org.apache.tools.ant.taskdefs.optional.junit.JUnitTestRunner.main(JUnitTestRunner.java:906)


REGRESSION:  org.apache.hadoop.hive.metastore.TestRemoteHiveMetaStore.testTableFilter

Error Message:
java.net.SocketException: Broken pipe

Stack Trace:
org.apache.thrift.transport.TTransportException: java.net.SocketException: Broken pipe
	at org.apache.thrift.transport.TIOStreamTransport.write(TIOStreamTransport.java:147)
	at org.apache.thrift.protocol.TBinaryProtocol.writeI32(TBinaryProtocol.java:163)
	at org.apache.thrift.protocol.TBinaryProtocol.writeMessageBegin(TBinaryProtocol.java:91)
	at org.apache.thrift.TServiceClient.sendBase(TServiceClient.java:62)
	at org.apache.hadoop.hive.metastore.api.ThriftHiveMetastore$Client.send_get_table(ThriftHiveMetastore.java:781)
	at org.apache.hadoop.hive.metastore.api.ThriftHiveMetastore$Client.get_table(ThriftHiveMetastore.java:772)
	at org.apache.hadoop.hive.metastore.HiveMetaStoreClient.getTable(HiveMetaStoreClient.java:713)
	at org.apache.hadoop.hive.metastore.HiveMetaStoreClient.dropTable(HiveMetaStoreClient.java:518)
	at org.apache.hadoop.hive.metastore.HiveMetaStoreClient.dropTable(HiveMetaStoreClient.java:490)
	at org.apache.hadoop.hive.metastore.TestHiveMetaStore.testTableFilter(TestHiveMetaStore.java:1768)
	at sun.reflect.NativeMethodAccessorImpl.invoke0(Native Method)
	at sun.reflect.NativeMethodAccessorImpl.invoke(NativeMethodAccessorImpl.java:39)
	at sun.reflect.DelegatingMethodAccessorImpl.invoke(DelegatingMethodAccessorImpl.java:25)
	at java.lang.reflect.Method.invoke(Method.java:597)
	at junit.framework.TestCase.runTest(TestCase.java:168)
	at junit.framework.TestCase.runBare(TestCase.java:134)
	at junit.framework.TestResult$1.protect(TestResult.java:110)
	at junit.framework.TestResult.runProtected(TestResult.java:128)
	at junit.framework.TestResult.run(TestResult.java:113)
	at junit.framework.TestCase.run(TestCase.java:124)
	at junit.framework.TestSuite.runTest(TestSuite.java:243)
	at junit.framework.TestSuite.run(TestSuite.java:238)
	at org.apache.tools.ant.taskdefs.optional.junit.JUnitTestRunner.run(JUnitTestRunner.java:518)
	at org.apache.tools.ant.taskdefs.optional.junit.JUnitTestRunner.launch(JUnitTestRunner.java:1052)
	at org.apache.tools.ant.taskdefs.optional.junit.JUnitTestRunner.main(JUnitTestRunner.java:906)
Caused by: java.net.SocketException: Broken pipe
	at java.net.SocketOutputStream.socketWrite0(Native Method)
	at java.net.SocketOutputStream.socketWrite(SocketOutputStream.java:92)
	at java.net.SocketOutputStream.write(SocketOutputStream.java:136)
	at org.apache.thrift.transport.TIOStreamTransport.write(TIOStreamTransport.java:145)
	... 24 more


REGRESSION:  org.apache.hadoop.hive.cli.TestCliDriver.testCliDriver_add_part_exist

Error Message:
Unexpected exception in setup

Stack Trace:
junit.framework.AssertionFailedError: Unexpected exception in setup
	at junit.framework.Assert.fail(Assert.java:50)
	at org.apache.hadoop.hive.cli.TestCliDriver.setUp(TestCliDriver.java:60)
	at junit.framework.TestCase.runBare(TestCase.java:132)
	at junit.framework.TestResult$1.protect(TestResult.java:110)
	at junit.framework.TestResult.runProtected(TestResult.java:128)
	at junit.framework.TestResult.run(TestResult.java:113)
	at junit.framework.TestCase.run(TestCase.java:124)
	at junit.framework.TestSuite.runTest(TestSuite.java:243)
	at junit.framework.TestSuite.run(TestSuite.java:238)
	at org.apache.tools.ant.taskdefs.optional.junit.JUnitTestRunner.run(JUnitTestRunner.java:518)
	at org.apache.tools.ant.taskdefs.optional.junit.JUnitTestRunner.launch(JUnitTestRunner.java:1052)
	at org.apache.tools.ant.taskdefs.optional.junit.JUnitTestRunner.main(JUnitTestRunner.java:906)


REGRESSION:  org.apache.hadoop.hive.cli.TestCliDriver.testCliDriver_alter1

Error Message:
Unexpected exception in setup

Stack Trace:
junit.framework.AssertionFailedError: Unexpected exception in setup
	at junit.framework.Assert.fail(Assert.java:50)
	at org.apache.hadoop.hive.cli.TestCliDriver.setUp(TestCliDriver.java:60)
	at junit.framework.TestCase.runBare(TestCase.java:132)
	at junit.framework.TestResult$1.protect(TestResult.java:110)
	at junit.framework.TestResult.runProtected(TestResult.java:128)
	at junit.framework.TestResult.run(TestResult.java:113)
	at junit.framework.TestCase.run(TestCase.java:124)
	at junit.framework.TestSuite.runTest(TestSuite.java:243)
	at junit.framework.TestSuite.run(TestSuite.java:238)
	at org.apache.tools.ant.taskdefs.optional.junit.JUnitTestRunner.run(JUnitTestRunner.java:518)
	at org.apache.tools.ant.taskdefs.optional.junit.JUnitTestRunner.launch(JUnitTestRunner.java:1052)
	at org.apache.tools.ant.taskdefs.optional.junit.JUnitTestRunner.main(JUnitTestRunner.java:906)




The Apache Jenkins build system has built Hive-0.8.1-SNAPSHOT-h0.21 (build #158)

Status: Failure

Check console output at https://builds.apache.org/job/Hive-0.8.1-SNAPSHOT-h0.21/158/ to view
the results.

Mime
View raw message