hive-dev mailing list archives

Site index · List index
Message view « Date » · « Thread »
Top « Date » · « Thread »
From Apache Jenkins Server <jenk...@builds.apache.org>
Subject Hive-trunk-h0.21 - Build # 1187 - Still Failing
Date Sat, 07 Jan 2012 19:53:24 GMT
Changes for Build #1154
[cws] HIVE-2631. Make Hive work with Hadoop 1.0.0 (Ashutosh Chauhan via cws)


Changes for Build #1155
[cws] HIVE-BUILD. Update RELEASE_NOTES.txt with 0.8.0 release information (cws)


Changes for Build #1156

Changes for Build #1157

Changes for Build #1158
[namit] HIVE-2602 add support for insert partition overwrite(...) if not
          exists (Chinna Rao Lalam via namit)


Changes for Build #1159

Changes for Build #1160
[cws] HIVE-2005. Implement BETWEEN operator (Navis via cws)


Changes for Build #1161
[jvs] HIVE-2433. add DOAP file for Hive


Changes for Build #1162

Changes for Build #1163

Changes for Build #1164
[heyongqiang] HIVE-2666 [jira] StackOverflowError when using custom UDF in map join
(Kevin Wilfong via Yongqiang He)

Summary:
Resource files are now added to the class path as soon as they are added via the
CLI.  This fixes the stack overflow error mentioned in the JIRA by ensuring a
consistent class loader between serializers and deserializers for the same
query.

Note that now serdes which contain a static block to register themselves are now
registered twice, once when adding the file to the class loader, and once when
an instance of the class is created.  Previously, registering a serde twice
resulted in an exception, to avoid this, I have downgraded it to a warning.

When a custom UDF is used as part of a join which is converted to a map join,
the XMLEncoder enters an infinite loop when serializing the map reduce task for
the second time, as part of sending it to be executed.  This results in a stack
overflow error.

Test Plan:
I ran the unit tests to verify nothing was broken.

I ran several queries which used custom UDFs and involved a join which was
converted to a map join.  I verified these completed successfully consistently

Reviewers: JIRA, heyongqiang

Reviewed By: heyongqiang

CC: heyongqiang, kevinwilfong

Differential Revision: 957

[namit] HIVE-2642 fix Hive-2566 and make union optimization more aggressive
(Yongqiang He via namit)


Changes for Build #1166

Changes for Build #1167

Changes for Build #1168
[heyongqiang] HIVE-2600: Enable/Add type-specific compression for rcfile (Krishna Kumar via
He Yongqiang)


Changes for Build #1169

Changes for Build #1170
[cws] HIVE-1877. Add java_method() as a synonym for the reflect() UDF (Zhenxiao Luo via cws)


Changes for Build #1171

Changes for Build #1172

Changes for Build #1173

Changes for Build #1174

Changes for Build #1175
[hashutosh] HIVE-2681 : SUCESS is misspelled (jonchang via Ashutosh Chauhan)


Changes for Build #1176
[hashutosh] HIVE-2616 : Passing user identity from metastore client to server in non-secure
mode (Ashutosh Chauhan)


Changes for Build #1177

Changes for Build #1178

Changes for Build #1179

Changes for Build #1180

Changes for Build #1181

Changes for Build #1182
[heyongqiang] HIVE-2621:Allow multiple group bys with the same input data and spray keys to
be run on the same reducer. (Kevin via He Yongqiang)


Changes for Build #1184
[namit] HIVE-2690 a bug in 'alter table concatenate' that causes filenames getting
double url encoded (He Yongqiang via namit)


Changes for Build #1185

Changes for Build #1186

Changes for Build #1187



10 tests failed.
REGRESSION:  org.apache.hadoop.hive.cli.TestHBaseMinimrCliDriver.testCliDriver_hbase_bulk

Error Message:
Unexpected exception

Stack Trace:
junit.framework.AssertionFailedError: Unexpected exception
	at junit.framework.Assert.fail(Assert.java:50)
	at org.apache.hadoop.hive.cli.TestHBaseMinimrCliDriver.testCliDriver_hbase_bulk(TestHBaseMinimrCliDriver.java:111)
	at sun.reflect.NativeMethodAccessorImpl.invoke0(Native Method)
	at sun.reflect.NativeMethodAccessorImpl.invoke(NativeMethodAccessorImpl.java:39)
	at sun.reflect.DelegatingMethodAccessorImpl.invoke(DelegatingMethodAccessorImpl.java:25)
	at java.lang.reflect.Method.invoke(Method.java:597)
	at junit.framework.TestCase.runTest(TestCase.java:168)
	at junit.framework.TestCase.runBare(TestCase.java:134)
	at junit.framework.TestResult$1.protect(TestResult.java:110)
	at junit.framework.TestResult.runProtected(TestResult.java:128)
	at junit.framework.TestResult.run(TestResult.java:113)
	at junit.framework.TestCase.run(TestCase.java:124)
	at junit.framework.TestSuite.runTest(TestSuite.java:243)
	at junit.framework.TestSuite.run(TestSuite.java:238)
	at junit.extensions.TestDecorator.basicRun(TestDecorator.java:24)
	at junit.extensions.TestSetup$1.protect(TestSetup.java:23)
	at junit.framework.TestResult.runProtected(TestResult.java:128)
	at junit.extensions.TestSetup.run(TestSetup.java:27)
	at org.apache.tools.ant.taskdefs.optional.junit.JUnitTestRunner.run(JUnitTestRunner.java:518)
	at org.apache.tools.ant.taskdefs.optional.junit.JUnitTestRunner.launch(JUnitTestRunner.java:1052)
	at org.apache.tools.ant.taskdefs.optional.junit.JUnitTestRunner.main(JUnitTestRunner.java:906)


REGRESSION:  org.apache.hadoop.hive.metastore.TestSetUGIOnOnlyClient.testPartition

Error Message:
Database compdb already exists

Stack Trace:
AlreadyExistsException(message:Database compdb already exists)
	at org.apache.hadoop.hive.metastore.api.ThriftHiveMetastore$create_database_result.read(ThriftHiveMetastore.java:6717)
	at org.apache.thrift.TServiceClient.receiveBase(TServiceClient.java:78)
	at org.apache.hadoop.hive.metastore.api.ThriftHiveMetastore$Client.recv_create_database(ThriftHiveMetastore.java:328)
	at org.apache.hadoop.hive.metastore.api.ThriftHiveMetastore$Client.create_database(ThriftHiveMetastore.java:315)
	at org.apache.hadoop.hive.metastore.HiveMetaStoreClient.createDatabase(HiveMetaStoreClient.java:382)
	at org.apache.hadoop.hive.metastore.TestHiveMetaStore.partitionTester(TestHiveMetaStore.java:129)
	at org.apache.hadoop.hive.metastore.TestHiveMetaStore.testPartition(TestHiveMetaStore.java:111)
	at sun.reflect.NativeMethodAccessorImpl.invoke0(Native Method)
	at sun.reflect.NativeMethodAccessorImpl.invoke(NativeMethodAccessorImpl.java:39)
	at sun.reflect.DelegatingMethodAccessorImpl.invoke(DelegatingMethodAccessorImpl.java:25)
	at java.lang.reflect.Method.invoke(Method.java:597)
	at junit.framework.TestCase.runTest(TestCase.java:168)
	at junit.framework.TestCase.runBare(TestCase.java:134)
	at junit.framework.TestResult$1.protect(TestResult.java:110)
	at junit.framework.TestResult.runProtected(TestResult.java:128)
	at junit.framework.TestResult.run(TestResult.java:113)
	at junit.framework.TestCase.run(TestCase.java:124)
	at junit.framework.TestSuite.runTest(TestSuite.java:243)
	at junit.framework.TestSuite.run(TestSuite.java:238)
	at org.apache.tools.ant.taskdefs.optional.junit.JUnitTestRunner.run(JUnitTestRunner.java:518)
	at org.apache.tools.ant.taskdefs.optional.junit.JUnitTestRunner.launch(JUnitTestRunner.java:1052)
	at org.apache.tools.ant.taskdefs.optional.junit.JUnitTestRunner.main(JUnitTestRunner.java:906)


REGRESSION:  org.apache.hadoop.hive.metastore.TestSetUGIOnOnlyClient.testAlterPartition

Error Message:
java.net.SocketTimeoutException: Read timed out

Stack Trace:
org.apache.thrift.transport.TTransportException: java.net.SocketTimeoutException: Read timed
out
	at org.apache.thrift.transport.TIOStreamTransport.read(TIOStreamTransport.java:129)
	at org.apache.thrift.transport.TTransport.readAll(TTransport.java:84)
	at org.apache.thrift.protocol.TBinaryProtocol.readAll(TBinaryProtocol.java:378)
	at org.apache.thrift.protocol.TBinaryProtocol.readI32(TBinaryProtocol.java:297)
	at org.apache.thrift.protocol.TBinaryProtocol.readMessageBegin(TBinaryProtocol.java:204)
	at org.apache.thrift.TServiceClient.receiveBase(TServiceClient.java:69)
	at org.apache.hadoop.hive.metastore.api.ThriftHiveMetastore$Client.recv_drop_table(ThriftHiveMetastore.java:711)
	at org.apache.hadoop.hive.metastore.api.ThriftHiveMetastore$Client.drop_table(ThriftHiveMetastore.java:696)
	at org.apache.hadoop.hive.metastore.HiveMetaStoreClient.dropTable(HiveMetaStoreClient.java:552)
	at org.apache.hadoop.hive.metastore.HiveMetaStoreClient.dropTable(HiveMetaStoreClient.java:511)
	at org.apache.hadoop.hive.metastore.TestHiveMetaStore.testAlterPartition(TestHiveMetaStore.java:442)
	at sun.reflect.NativeMethodAccessorImpl.invoke0(Native Method)
	at sun.reflect.NativeMethodAccessorImpl.invoke(NativeMethodAccessorImpl.java:39)
	at sun.reflect.DelegatingMethodAccessorImpl.invoke(DelegatingMethodAccessorImpl.java:25)
	at java.lang.reflect.Method.invoke(Method.java:597)
	at junit.framework.TestCase.runTest(TestCase.java:168)
	at junit.framework.TestCase.runBare(TestCase.java:134)
	at junit.framework.TestResult$1.protect(TestResult.java:110)
	at junit.framework.TestResult.runProtected(TestResult.java:128)
	at junit.framework.TestResult.run(TestResult.java:113)
	at junit.framework.TestCase.run(TestCase.java:124)
	at junit.framework.TestSuite.runTest(TestSuite.java:243)
	at junit.framework.TestSuite.run(TestSuite.java:238)
	at org.apache.tools.ant.taskdefs.optional.junit.JUnitTestRunner.run(JUnitTestRunner.java:518)
	at org.apache.tools.ant.taskdefs.optional.junit.JUnitTestRunner.launch(JUnitTestRunner.java:1052)
	at org.apache.tools.ant.taskdefs.optional.junit.JUnitTestRunner.main(JUnitTestRunner.java:906)
Caused by: java.net.SocketTimeoutException: Read timed out
	at java.net.SocketInputStream.socketRead0(Native Method)
	at java.net.SocketInputStream.read(SocketInputStream.java:129)
	at org.apache.thrift.transport.TIOStreamTransport.read(TIOStreamTransport.java:127)
	... 25 more


REGRESSION:  org.apache.hadoop.hive.metastore.TestSetUGIOnOnlyClient.testRenamePartition

Error Message:
get_table failed: out of sequence response

Stack Trace:
org.apache.thrift.TApplicationException: get_table failed: out of sequence response
	at org.apache.thrift.TServiceClient.receiveBase(TServiceClient.java:76)
	at org.apache.hadoop.hive.metastore.api.ThriftHiveMetastore$Client.recv_get_table(ThriftHiveMetastore.java:791)
	at org.apache.hadoop.hive.metastore.api.ThriftHiveMetastore$Client.get_table(ThriftHiveMetastore.java:777)
	at org.apache.hadoop.hive.metastore.HiveMetaStoreClient.getTable(HiveMetaStoreClient.java:734)
	at org.apache.hadoop.hive.metastore.HiveMetaStoreClient.dropTable(HiveMetaStoreClient.java:539)
	at org.apache.hadoop.hive.metastore.HiveMetaStoreClient.dropTable(HiveMetaStoreClient.java:511)
	at org.apache.hadoop.hive.metastore.TestHiveMetaStore.testRenamePartition(TestHiveMetaStore.java:538)
	at sun.reflect.NativeMethodAccessorImpl.invoke0(Native Method)
	at sun.reflect.NativeMethodAccessorImpl.invoke(NativeMethodAccessorImpl.java:39)
	at sun.reflect.DelegatingMethodAccessorImpl.invoke(DelegatingMethodAccessorImpl.java:25)
	at java.lang.reflect.Method.invoke(Method.java:597)
	at junit.framework.TestCase.runTest(TestCase.java:168)
	at junit.framework.TestCase.runBare(TestCase.java:134)
	at junit.framework.TestResult$1.protect(TestResult.java:110)
	at junit.framework.TestResult.runProtected(TestResult.java:128)
	at junit.framework.TestResult.run(TestResult.java:113)
	at junit.framework.TestCase.run(TestCase.java:124)
	at junit.framework.TestSuite.runTest(TestSuite.java:243)
	at junit.framework.TestSuite.run(TestSuite.java:238)
	at org.apache.tools.ant.taskdefs.optional.junit.JUnitTestRunner.run(JUnitTestRunner.java:518)
	at org.apache.tools.ant.taskdefs.optional.junit.JUnitTestRunner.launch(JUnitTestRunner.java:1052)
	at org.apache.tools.ant.taskdefs.optional.junit.JUnitTestRunner.main(JUnitTestRunner.java:906)


REGRESSION:  org.apache.hadoop.hive.metastore.TestSetUGIOnOnlyClient.testDatabase

Error Message:
Got exception: org.apache.thrift.transport.TTransportException java.net.SocketTimeoutException:
Read timed out

Stack Trace:
MetaException(message:Got exception: org.apache.thrift.transport.TTransportException java.net.SocketTimeoutException:
Read timed out)
	at org.apache.hadoop.hive.metastore.MetaStoreUtils.logAndThrowMetaException(MetaStoreUtils.java:784)
	at org.apache.hadoop.hive.metastore.HiveMetaStoreClient.getTables(HiveMetaStoreClient.java:773)
	at org.apache.hadoop.hive.metastore.TestHiveMetaStore.silentDropDatabase(TestHiveMetaStore.java:1413)
	at org.apache.hadoop.hive.metastore.TestHiveMetaStore.testDatabase(TestHiveMetaStore.java:657)
	at sun.reflect.NativeMethodAccessorImpl.invoke0(Native Method)
	at sun.reflect.NativeMethodAccessorImpl.invoke(NativeMethodAccessorImpl.java:39)
	at sun.reflect.DelegatingMethodAccessorImpl.invoke(DelegatingMethodAccessorImpl.java:25)
	at java.lang.reflect.Method.invoke(Method.java:597)
	at junit.framework.TestCase.runTest(TestCase.java:168)
	at junit.framework.TestCase.runBare(TestCase.java:134)
	at junit.framework.TestResult$1.protect(TestResult.java:110)
	at junit.framework.TestResult.runProtected(TestResult.java:128)
	at junit.framework.TestResult.run(TestResult.java:113)
	at junit.framework.TestCase.run(TestCase.java:124)
	at junit.framework.TestSuite.runTest(TestSuite.java:243)
	at junit.framework.TestSuite.run(TestSuite.java:238)
	at org.apache.tools.ant.taskdefs.optional.junit.JUnitTestRunner.run(JUnitTestRunner.java:518)
	at org.apache.tools.ant.taskdefs.optional.junit.JUnitTestRunner.launch(JUnitTestRunner.java:1052)
	at org.apache.tools.ant.taskdefs.optional.junit.JUnitTestRunner.main(JUnitTestRunner.java:906)


REGRESSION:  org.apache.hadoop.hive.cli.TestCliDriver.testCliDriver_add_part_exist

Error Message:
Unexpected exception in setup

Stack Trace:
junit.framework.AssertionFailedError: Unexpected exception in setup
	at junit.framework.Assert.fail(Assert.java:50)
	at org.apache.hadoop.hive.cli.TestCliDriver.setUp(TestCliDriver.java:60)
	at junit.framework.TestCase.runBare(TestCase.java:132)
	at junit.framework.TestResult$1.protect(TestResult.java:110)
	at junit.framework.TestResult.runProtected(TestResult.java:128)
	at junit.framework.TestResult.run(TestResult.java:113)
	at junit.framework.TestCase.run(TestCase.java:124)
	at junit.framework.TestSuite.runTest(TestSuite.java:243)
	at junit.framework.TestSuite.run(TestSuite.java:238)
	at org.apache.tools.ant.taskdefs.optional.junit.JUnitTestRunner.run(JUnitTestRunner.java:518)
	at org.apache.tools.ant.taskdefs.optional.junit.JUnitTestRunner.launch(JUnitTestRunner.java:1052)
	at org.apache.tools.ant.taskdefs.optional.junit.JUnitTestRunner.main(JUnitTestRunner.java:906)


REGRESSION:  org.apache.hadoop.hive.cli.TestCliDriver.testCliDriver_alter1

Error Message:
Unexpected exception in setup

Stack Trace:
junit.framework.AssertionFailedError: Unexpected exception in setup
	at junit.framework.Assert.fail(Assert.java:50)
	at org.apache.hadoop.hive.cli.TestCliDriver.setUp(TestCliDriver.java:60)
	at junit.framework.TestCase.runBare(TestCase.java:132)
	at junit.framework.TestResult$1.protect(TestResult.java:110)
	at junit.framework.TestResult.runProtected(TestResult.java:128)
	at junit.framework.TestResult.run(TestResult.java:113)
	at junit.framework.TestCase.run(TestCase.java:124)
	at junit.framework.TestSuite.runTest(TestSuite.java:243)
	at junit.framework.TestSuite.run(TestSuite.java:238)
	at org.apache.tools.ant.taskdefs.optional.junit.JUnitTestRunner.run(JUnitTestRunner.java:518)
	at org.apache.tools.ant.taskdefs.optional.junit.JUnitTestRunner.launch(JUnitTestRunner.java:1052)
	at org.apache.tools.ant.taskdefs.optional.junit.JUnitTestRunner.main(JUnitTestRunner.java:906)


REGRESSION:  org.apache.hadoop.hive.cli.TestMinimrCliDriver.testCliDriver_reduce_deduplicate

Error Message:
Unexpected exception
See build/ql/tmp/hive.log, or try "ant test ... -Dtest.silent=false" to get more logs.

Stack Trace:
junit.framework.AssertionFailedError: Unexpected exception
See build/ql/tmp/hive.log, or try "ant test ... -Dtest.silent=false" to get more logs.
	at junit.framework.Assert.fail(Assert.java:50)
	at org.apache.hadoop.hive.cli.TestMinimrCliDriver.testCliDriver_reduce_deduplicate(TestMinimrCliDriver.java:482)
	at sun.reflect.NativeMethodAccessorImpl.invoke0(Native Method)
	at sun.reflect.NativeMethodAccessorImpl.invoke(NativeMethodAccessorImpl.java:39)
	at sun.reflect.DelegatingMethodAccessorImpl.invoke(DelegatingMethodAccessorImpl.java:25)
	at java.lang.reflect.Method.invoke(Method.java:597)
	at junit.framework.TestCase.runTest(TestCase.java:168)
	at junit.framework.TestCase.runBare(TestCase.java:134)
	at junit.framework.TestResult$1.protect(TestResult.java:110)
	at junit.framework.TestResult.runProtected(TestResult.java:128)
	at junit.framework.TestResult.run(TestResult.java:113)
	at junit.framework.TestCase.run(TestCase.java:124)
	at junit.framework.TestSuite.runTest(TestSuite.java:243)
	at junit.framework.TestSuite.run(TestSuite.java:238)
	at org.apache.tools.ant.taskdefs.optional.junit.JUnitTestRunner.run(JUnitTestRunner.java:518)
	at org.apache.tools.ant.taskdefs.optional.junit.JUnitTestRunner.launch(JUnitTestRunner.java:1052)
	at org.apache.tools.ant.taskdefs.optional.junit.JUnitTestRunner.main(JUnitTestRunner.java:906)


FAILED:  org.apache.hadoop.hive.cli.TestCliDriver.testCliDriver_insert2_overwrite_partitions

Error Message:
Unexpected exception
See build/ql/tmp/hive.log, or try "ant test ... -Dtest.silent=false" to get more logs.

Stack Trace:
junit.framework.AssertionFailedError: Unexpected exception
See build/ql/tmp/hive.log, or try "ant test ... -Dtest.silent=false" to get more logs.
	at junit.framework.Assert.fail(Assert.java:50)
	at org.apache.hadoop.hive.cli.TestCliDriver.testCliDriver_insert2_overwrite_partitions(TestCliDriver.java:17165)
	at sun.reflect.NativeMethodAccessorImpl.invoke0(Native Method)
	at sun.reflect.NativeMethodAccessorImpl.invoke(NativeMethodAccessorImpl.java:39)
	at sun.reflect.DelegatingMethodAccessorImpl.invoke(DelegatingMethodAccessorImpl.java:25)
	at java.lang.reflect.Method.invoke(Method.java:597)
	at junit.framework.TestCase.runTest(TestCase.java:168)
	at junit.framework.TestCase.runBare(TestCase.java:134)
	at junit.framework.TestResult$1.protect(TestResult.java:110)
	at junit.framework.TestResult.runProtected(TestResult.java:128)
	at junit.framework.TestResult.run(TestResult.java:113)
	at junit.framework.TestCase.run(TestCase.java:124)
	at junit.framework.TestSuite.runTest(TestSuite.java:243)
	at junit.framework.TestSuite.run(TestSuite.java:238)
	at org.apache.tools.ant.taskdefs.optional.junit.JUnitTestRunner.run(JUnitTestRunner.java:518)
	at org.apache.tools.ant.taskdefs.optional.junit.JUnitTestRunner.launch(JUnitTestRunner.java:1052)
	at org.apache.tools.ant.taskdefs.optional.junit.JUnitTestRunner.main(JUnitTestRunner.java:906)


FAILED:  org.apache.hadoop.hive.cli.TestCliDriver.testCliDriver_inputddl5

Error Message:
Unexpected exception
See build/ql/tmp/hive.log, or try "ant test ... -Dtest.silent=false" to get more logs.

Stack Trace:
junit.framework.AssertionFailedError: Unexpected exception
See build/ql/tmp/hive.log, or try "ant test ... -Dtest.silent=false" to get more logs.
	at junit.framework.Assert.fail(Assert.java:50)
	at org.apache.hadoop.hive.cli.TestCliDriver.testCliDriver_inputddl5(TestCliDriver.java:16877)
	at sun.reflect.NativeMethodAccessorImpl.invoke0(Native Method)
	at sun.reflect.NativeMethodAccessorImpl.invoke(NativeMethodAccessorImpl.java:39)
	at sun.reflect.DelegatingMethodAccessorImpl.invoke(DelegatingMethodAccessorImpl.java:25)
	at java.lang.reflect.Method.invoke(Method.java:597)
	at junit.framework.TestCase.runTest(TestCase.java:168)
	at junit.framework.TestCase.runBare(TestCase.java:134)
	at junit.framework.TestResult$1.protect(TestResult.java:110)
	at junit.framework.TestResult.runProtected(TestResult.java:128)
	at junit.framework.TestResult.run(TestResult.java:113)
	at junit.framework.TestCase.run(TestCase.java:124)
	at junit.framework.TestSuite.runTest(TestSuite.java:243)
	at junit.framework.TestSuite.run(TestSuite.java:238)
	at org.apache.tools.ant.taskdefs.optional.junit.JUnitTestRunner.run(JUnitTestRunner.java:518)
	at org.apache.tools.ant.taskdefs.optional.junit.JUnitTestRunner.launch(JUnitTestRunner.java:1052)
	at org.apache.tools.ant.taskdefs.optional.junit.JUnitTestRunner.main(JUnitTestRunner.java:906)




The Apache Jenkins build system has built Hive-trunk-h0.21 (build #1187)

Status: Still Failing

Check console output at https://builds.apache.org/job/Hive-trunk-h0.21/1187/ to view the results.

Mime
View raw message