hive-dev mailing list archives

Site index · List index
Message view « Date » · « Thread »
Top « Date » · « Thread »
From Apache Jenkins Server <jenk...@builds.apache.org>
Subject Build failed in Jenkins: Hive-trunk-h0.21 #884
Date Wed, 10 Aug 2011 00:05:29 GMT
See <https://builds.apache.org/job/Hive-trunk-h0.21/884/changes>

Changes:

[nzhang] HIVE-2347. Make Hadoop Job ID available after task finish executing (Kevin Wilfong
via Ning Zhang)

------------------------------------------
[...truncated 33862 lines...]

mvn-taskdef:

maven-publish-artifact:
[artifact:install-provider] Installing provider: org.apache.maven.wagon:wagon-http:jar:1.0-beta-2:runtime
[artifact:deploy] Deploying to https://repository.apache.org/content/repositories/snapshots
[artifact:deploy] [INFO] Retrieving previous build number from apache.snapshots.https
[artifact:deploy] Uploading: org/apache/hive/hive-metastore/0.8.0-SNAPSHOT/hive-metastore-0.8.0-20110810.000515-63.jar
to repository apache.snapshots.https at https://repository.apache.org/content/repositories/snapshots
[artifact:deploy] Transferring 1659K from apache.snapshots.https
[artifact:deploy] Uploaded 1659K
[artifact:deploy] [INFO] Uploading project information for hive-metastore 0.8.0-20110810.000515-63
[artifact:deploy] [INFO] Retrieving previous metadata from apache.snapshots.https
[artifact:deploy] [INFO] Uploading repository metadata for: 'snapshot org.apache.hive:hive-metastore:0.8.0-SNAPSHOT'
[artifact:deploy] [INFO] Retrieving previous metadata from apache.snapshots.https
[artifact:deploy] [INFO] Uploading repository metadata for: 'artifact org.apache.hive:hive-metastore'

ivy-init-dirs:

ivy-download:
      [get] Getting: http://repo2.maven.org/maven2/org/apache/ivy/ivy/2.1.0/ivy-2.1.0.jar
      [get] To: <https://builds.apache.org/job/Hive-trunk-h0.21/ws/hive/build/ivy/lib/ivy-2.1.0.jar>
      [get] Not modified - so not downloaded

ivy-probe-antlib:

ivy-init-antlib:

ivy-init:

ivy-resolve-maven-ant-tasks:
[ivy:resolve] :: loading settings :: file = <https://builds.apache.org/job/Hive-trunk-h0.21/ws/hive/ivy/ivysettings.xml>

ivy-retrieve-maven-ant-tasks:
[ivy:cachepath] DEPRECATED: 'ivy.conf.file' is deprecated, use 'ivy.settings.file' instead
[ivy:cachepath] :: loading settings :: file = <https://builds.apache.org/job/Hive-trunk-h0.21/ws/hive/ivy/ivysettings.xml>

mvn-taskdef:

maven-publish-artifact:
[artifact:install-provider] Installing provider: org.apache.maven.wagon:wagon-http:jar:1.0-beta-2:runtime
[artifact:deploy] Deploying to https://repository.apache.org/content/repositories/snapshots
[artifact:deploy] [INFO] Retrieving previous build number from apache.snapshots.https
[artifact:deploy] Uploading: org/apache/hive/hive-serde/0.8.0-SNAPSHOT/hive-serde-0.8.0-20110810.000518-63.jar
to repository apache.snapshots.https at https://repository.apache.org/content/repositories/snapshots
[artifact:deploy] Transferring 453K from apache.snapshots.https
[artifact:deploy] Uploaded 453K
[artifact:deploy] [INFO] Retrieving previous metadata from apache.snapshots.https
[artifact:deploy] [INFO] Uploading repository metadata for: 'artifact org.apache.hive:hive-serde'
[artifact:deploy] [INFO] Uploading project information for hive-serde 0.8.0-20110810.000518-63
[artifact:deploy] [INFO] Retrieving previous metadata from apache.snapshots.https
[artifact:deploy] [INFO] Uploading repository metadata for: 'snapshot org.apache.hive:hive-serde:0.8.0-SNAPSHOT'

ivy-init-dirs:

ivy-download:
      [get] Getting: http://repo2.maven.org/maven2/org/apache/ivy/ivy/2.1.0/ivy-2.1.0.jar
      [get] To: <https://builds.apache.org/job/Hive-trunk-h0.21/ws/hive/build/ivy/lib/ivy-2.1.0.jar>
      [get] Not modified - so not downloaded

ivy-probe-antlib:

ivy-init-antlib:

ivy-init:

ivy-resolve-maven-ant-tasks:
[ivy:resolve] :: loading settings :: file = <https://builds.apache.org/job/Hive-trunk-h0.21/ws/hive/ivy/ivysettings.xml>

ivy-retrieve-maven-ant-tasks:
[ivy:cachepath] DEPRECATED: 'ivy.conf.file' is deprecated, use 'ivy.settings.file' instead
[ivy:cachepath] :: loading settings :: file = <https://builds.apache.org/job/Hive-trunk-h0.21/ws/hive/ivy/ivysettings.xml>

mvn-taskdef:

maven-publish-artifact:
[artifact:install-provider] Installing provider: org.apache.maven.wagon:wagon-http:jar:1.0-beta-2:runtime
[artifact:deploy] Deploying to https://repository.apache.org/content/repositories/snapshots
[artifact:deploy] [INFO] Retrieving previous build number from apache.snapshots.https
[artifact:deploy] Uploading: org/apache/hive/hive-service/0.8.0-SNAPSHOT/hive-service-0.8.0-20110810.000520-63.jar
to repository apache.snapshots.https at https://repository.apache.org/content/repositories/snapshots
[artifact:deploy] Transferring 170K from apache.snapshots.https
[artifact:deploy] Uploaded 170K
[artifact:deploy] [INFO] Uploading project information for hive-service 0.8.0-20110810.000520-63
[artifact:deploy] [INFO] Retrieving previous metadata from apache.snapshots.https
[artifact:deploy] [INFO] Uploading repository metadata for: 'artifact org.apache.hive:hive-service'
[artifact:deploy] [INFO] Retrieving previous metadata from apache.snapshots.https
[artifact:deploy] [INFO] Uploading repository metadata for: 'snapshot org.apache.hive:hive-service:0.8.0-SNAPSHOT'

ivy-init-dirs:

ivy-download:
      [get] Getting: http://repo2.maven.org/maven2/org/apache/ivy/ivy/2.1.0/ivy-2.1.0.jar
      [get] To: <https://builds.apache.org/job/Hive-trunk-h0.21/ws/hive/build/ivy/lib/ivy-2.1.0.jar>
      [get] Not modified - so not downloaded

ivy-probe-antlib:

ivy-init-antlib:

ivy-init:

ivy-resolve-maven-ant-tasks:
[ivy:resolve] :: loading settings :: file = <https://builds.apache.org/job/Hive-trunk-h0.21/ws/hive/ivy/ivysettings.xml>

ivy-retrieve-maven-ant-tasks:
[ivy:cachepath] DEPRECATED: 'ivy.conf.file' is deprecated, use 'ivy.settings.file' instead
[ivy:cachepath] :: loading settings :: file = <https://builds.apache.org/job/Hive-trunk-h0.21/ws/hive/ivy/ivysettings.xml>

mvn-taskdef:

maven-publish-artifact:
[artifact:install-provider] Installing provider: org.apache.maven.wagon:wagon-http:jar:1.0-beta-2:runtime
[artifact:deploy] Deploying to https://repository.apache.org/content/repositories/snapshots
[artifact:deploy] [INFO] Retrieving previous build number from apache.snapshots.https
[artifact:deploy] Uploading: org/apache/hive/hive-shims/0.8.0-SNAPSHOT/hive-shims-0.8.0-20110810.000523-63.jar
to repository apache.snapshots.https at https://repository.apache.org/content/repositories/snapshots
[artifact:deploy] Transferring 76K from apache.snapshots.https
[artifact:deploy] Uploaded 76K
[artifact:deploy] [INFO] Retrieving previous metadata from apache.snapshots.https
[artifact:deploy] [INFO] Uploading repository metadata for: 'snapshot org.apache.hive:hive-shims:0.8.0-SNAPSHOT'
[artifact:deploy] [INFO] Retrieving previous metadata from apache.snapshots.https
[artifact:deploy] [INFO] Uploading repository metadata for: 'artifact org.apache.hive:hive-shims'
[artifact:deploy] [INFO] Uploading project information for hive-shims 0.8.0-20110810.000523-63

BUILD SUCCESSFUL
Total time: 242 minutes 36 seconds
Archiving artifacts
ERROR: Failed to archive artifacts: hive/build/hive*.tar.gz*
hudson.util.IOException2: java.lang.NoClassDefFoundError: Could not initialize class org.apache.tools.ant.PropertyHelper
	at hudson.FilePath.copyRecursiveTo(FilePath.java:1581)
	at hudson.tasks.ArtifactArchiver.perform(ArtifactArchiver.java:117)
	at hudson.tasks.BuildStepMonitor$1.perform(BuildStepMonitor.java:19)
	at hudson.model.AbstractBuild$AbstractRunner.perform(AbstractBuild.java:662)
	at hudson.model.AbstractBuild$AbstractRunner.performAllBuildSteps(AbstractBuild.java:638)
	at hudson.model.AbstractBuild$AbstractRunner.performAllBuildSteps(AbstractBuild.java:616)
	at hudson.model.Build$RunnerImpl.post2(Build.java:161)
	at hudson.model.AbstractBuild$AbstractRunner.post(AbstractBuild.java:585)
	at hudson.model.Run.run(Run.java:1398)
	at hudson.model.FreeStyleBuild.run(FreeStyleBuild.java:46)
	at hudson.model.ResourceController.execute(ResourceController.java:88)
	at hudson.model.Executor.run(Executor.java:145)
Caused by: java.util.concurrent.ExecutionException: java.lang.NoClassDefFoundError: Could
not initialize class org.apache.tools.ant.PropertyHelper
	at hudson.remoting.Channel$2.adapt(Channel.java:694)
	at hudson.remoting.Channel$2.adapt(Channel.java:689)
	at hudson.remoting.FutureAdapter.get(FutureAdapter.java:55)
	at hudson.FilePath.copyRecursiveTo(FilePath.java:1579)
	... 11 more
Caused by: java.lang.NoClassDefFoundError: Could not initialize class org.apache.tools.ant.PropertyHelper
	at org.apache.tools.ant.Project.getReference(Project.java:1989)
	at org.apache.tools.ant.ComponentHelper.getComponentHelper(ComponentHelper.java:150)
	at org.apache.tools.ant.ComponentHelper.getElementName(ComponentHelper.java:646)
	at org.apache.tools.ant.types.DataType.getDataTypeName(DataType.java:95)
	at org.apache.tools.ant.types.AbstractFileSet.setupDirectoryScanner(AbstractFileSet.java:520)
	at org.apache.tools.ant.types.AbstractFileSet.getDirectoryScanner(AbstractFileSet.java:483)
	at hudson.util.DirScanner$Glob.scan(DirScanner.java:101)
	at hudson.FilePath.writeToTar(FilePath.java:1617)
	at hudson.FilePath.access$900(FilePath.java:164)
	at hudson.FilePath$33.invoke(FilePath.java:1558)
	at hudson.FilePath$33.invoke(FilePath.java:1555)
	at hudson.FilePath$FileCallableWrapper.call(FilePath.java:1979)
	at hudson.remoting.UserRequest.perform(UserRequest.java:118)
	at hudson.remoting.UserRequest.perform(UserRequest.java:48)
	at hudson.remoting.Request$2.run(Request.java:270)
	at java.util.concurrent.Executors$RunnableAdapter.call(Executors.java:441)
	at java.util.concurrent.FutureTask$Sync.innerRun(FutureTask.java:303)
	at java.util.concurrent.FutureTask.run(FutureTask.java:138)
	at java.util.concurrent.ThreadPoolExecutor$Worker.runTask(ThreadPoolExecutor.java:886)
	at java.util.concurrent.ThreadPoolExecutor$Worker.run(ThreadPoolExecutor.java:908)
	at java.lang.Thread.run(Thread.java:619)
Recording test results
ERROR: Failed to archive test reports
hudson.util.IOException2: remote file operation failed: <https://builds.apache.org/job/Hive-trunk-h0.21/ws/>
at hudson.remoting.Channel@a9aae50:ubuntu1
	at hudson.FilePath.act(FilePath.java:754)
	at hudson.FilePath.act(FilePath.java:740)
	at hudson.tasks.junit.JUnitParser.parse(JUnitParser.java:83)
	at hudson.tasks.junit.JUnitResultArchiver.parse(JUnitResultArchiver.java:123)
	at hudson.tasks.junit.JUnitResultArchiver.perform(JUnitResultArchiver.java:135)
	at hudson.tasks.BuildStepMonitor$1.perform(BuildStepMonitor.java:19)
	at hudson.model.AbstractBuild$AbstractRunner.perform(AbstractBuild.java:662)
	at hudson.model.AbstractBuild$AbstractRunner.performAllBuildSteps(AbstractBuild.java:638)
	at hudson.model.AbstractBuild$AbstractRunner.performAllBuildSteps(AbstractBuild.java:616)
	at hudson.model.Build$RunnerImpl.post2(Build.java:161)
	at hudson.model.AbstractBuild$AbstractRunner.post(AbstractBuild.java:585)
	at hudson.model.Run.run(Run.java:1398)
	at hudson.model.FreeStyleBuild.run(FreeStyleBuild.java:46)
	at hudson.model.ResourceController.execute(ResourceController.java:88)
	at hudson.model.Executor.run(Executor.java:145)
Caused by: java.io.IOException: Remote call on ubuntu1 failed
	at hudson.remoting.Channel.call(Channel.java:670)
	at hudson.FilePath.act(FilePath.java:747)
	... 14 more
Caused by: java.lang.NoClassDefFoundError: Could not initialize class org.apache.tools.ant.PropertyHelper
	at org.apache.tools.ant.Project.getReference(Project.java:1989)
	at org.apache.tools.ant.ComponentHelper.getComponentHelper(ComponentHelper.java:150)
	at org.apache.tools.ant.ComponentHelper.getElementName(ComponentHelper.java:646)
	at org.apache.tools.ant.types.DataType.getDataTypeName(DataType.java:95)
	at org.apache.tools.ant.types.AbstractFileSet.setupDirectoryScanner(AbstractFileSet.java:520)
	at org.apache.tools.ant.types.AbstractFileSet.getDirectoryScanner(AbstractFileSet.java:483)
	at org.apache.tools.ant.types.AbstractFileSet.getDirectoryScanner(AbstractFileSet.java:451)
	at hudson.tasks.junit.JUnitParser$ParseResultCallable.invoke(JUnitParser.java:105)
	at hudson.tasks.junit.JUnitParser$ParseResultCallable.invoke(JUnitParser.java:87)
	at hudson.FilePath$FileCallableWrapper.call(FilePath.java:1979)
	at hudson.remoting.UserRequest.perform(UserRequest.java:118)
	at hudson.remoting.UserRequest.perform(UserRequest.java:48)
	at hudson.remoting.Request$2.run(Request.java:270)
	at java.util.concurrent.Executors$RunnableAdapter.call(Executors.java:441)
	at java.util.concurrent.FutureTask$Sync.innerRun(FutureTask.java:303)
	at java.util.concurrent.FutureTask.run(FutureTask.java:138)
	at java.util.concurrent.ThreadPoolExecutor$Worker.runTask(ThreadPoolExecutor.java:886)
	at java.util.concurrent.ThreadPoolExecutor$Worker.run(ThreadPoolExecutor.java:908)
	at java.lang.Thread.run(Thread.java:619)
ERROR: Publisher hudson.plugins.violations.ViolationsPublisher aborted due to exception
hudson.util.IOException2: remote file operation failed: <https://builds.apache.org/job/Hive-trunk-h0.21/ws/>
at hudson.remoting.Channel@a9aae50:ubuntu1
	at hudson.FilePath.act(FilePath.java:754)
	at hudson.FilePath.act(FilePath.java:740)
	at hudson.plugins.violations.ViolationsPublisher.perform(ViolationsPublisher.java:74)
	at hudson.tasks.BuildStepMonitor$3.perform(BuildStepMonitor.java:36)
	at hudson.model.AbstractBuild$AbstractRunner.perform(AbstractBuild.java:662)
	at hudson.model.AbstractBuild$AbstractRunner.performAllBuildSteps(AbstractBuild.java:638)
	at hudson.model.AbstractBuild$AbstractRunner.performAllBuildSteps(AbstractBuild.java:616)
	at hudson.model.Build$RunnerImpl.post2(Build.java:161)
	at hudson.model.AbstractBuild$AbstractRunner.post(AbstractBuild.java:585)
	at hudson.model.Run.run(Run.java:1398)
	at hudson.model.FreeStyleBuild.run(FreeStyleBuild.java:46)
	at hudson.model.ResourceController.execute(ResourceController.java:88)
	at hudson.model.Executor.run(Executor.java:145)
Caused by: java.io.IOException: Remote call on ubuntu1 failed
	at hudson.remoting.Channel.call(Channel.java:670)
	at hudson.FilePath.act(FilePath.java:747)
	... 12 more
Caused by: java.lang.NoClassDefFoundError: Could not initialize class org.apache.tools.ant.PropertyHelper
	at org.apache.tools.ant.Project.getReference(Project.java:1989)
	at org.apache.tools.ant.ComponentHelper.getComponentHelper(ComponentHelper.java:150)
	at org.apache.tools.ant.ComponentHelper.getElementName(ComponentHelper.java:646)
	at org.apache.tools.ant.types.DataType.getDataTypeName(DataType.java:95)
	at org.apache.tools.ant.types.AbstractFileSet.setupDirectoryScanner(AbstractFileSet.java:520)
	at org.apache.tools.ant.types.AbstractFileSet.getDirectoryScanner(AbstractFileSet.java:483)
	at hudson.plugins.violations.ViolationsCollector.findFiles(ViolationsCollector.java:213)
	at hudson.plugins.violations.ViolationsCollector.doType(ViolationsCollector.java:173)
	at hudson.plugins.violations.ViolationsCollector.invoke(ViolationsCollector.java:114)
	at hudson.plugins.violations.ViolationsCollector.invoke(ViolationsCollector.java:25)
	at hudson.FilePath$FileCallableWrapper.call(FilePath.java:1979)
	at hudson.remoting.UserRequest.perform(UserRequest.java:118)
	at hudson.remoting.UserRequest.perform(UserRequest.java:48)
	at hudson.remoting.Request$2.run(Request.java:270)
	at java.util.concurrent.Executors$RunnableAdapter.call(Executors.java:441)
	at java.util.concurrent.FutureTask$Sync.innerRun(FutureTask.java:303)
	at java.util.concurrent.FutureTask.run(FutureTask.java:138)
	at java.util.concurrent.ThreadPoolExecutor$Worker.runTask(ThreadPoolExecutor.java:886)
	at java.util.concurrent.ThreadPoolExecutor$Worker.run(ThreadPoolExecutor.java:908)
	at java.lang.Thread.run(Thread.java:619)
Updating HIVE-2347


Mime
View raw message