hive-dev mailing list archives

Site index · List index
Message view « Date » · « Thread »
Top « Date » · « Thread »
From Apache Jenkins Server <jenk...@builds.apache.org>
Subject Build failed in Jenkins: Hive-trunk-h0.21 #814
Date Thu, 07 Jul 2011 16:04:33 GMT
See <https://builds.apache.org/job/Hive-trunk-h0.21/814/>

------------------------------------------
[...truncated 4740 lines...]
create-dirs:

init:

compile:
     [echo] Compiling: anttasks
    [javac] <https://builds.apache.org/job/Hive-trunk-h0.21/ws/hive/ant/build.xml>:40:
warning: 'includeantruntime' was not set, defaulting to build.sysclasspath=last; set to false
for repeatable builds

deploy-ant-tasks:

create-dirs:

init:

compile:
     [echo] Compiling: anttasks
    [javac] <https://builds.apache.org/job/Hive-trunk-h0.21/ws/hive/ant/build.xml>:40:
warning: 'includeantruntime' was not set, defaulting to build.sysclasspath=last; set to false
for repeatable builds

jar:

init:

dynamic-serde:

ivy-init-dirs:

ivy-download:
      [get] Getting: http://repo2.maven.org/maven2/org/apache/ivy/ivy/2.1.0/ivy-2.1.0.jar
      [get] To: <https://builds.apache.org/job/Hive-trunk-h0.21/ws/hive/build/ivy/lib/ivy-2.1.0.jar>
      [get] Not modified - so not downloaded

ivy-probe-antlib:

ivy-init-antlib:

ivy-init:

ivy-resolve:
[ivy:resolve] :: loading settings :: file = <https://builds.apache.org/job/Hive-trunk-h0.21/ws/hive/ivy/ivysettings.xml>

ivy-retrieve:

compile:
     [echo] Compiling: hive
    [javac] <https://builds.apache.org/job/Hive-trunk-h0.21/ws/hive/serde/build.xml>:52:
warning: 'includeantruntime' was not set, defaulting to build.sysclasspath=last; set to false
for repeatable builds
    [javac] Compiling 236 source files to <https://builds.apache.org/job/Hive-trunk-h0.21/ws/hive/build/serde/classes>
    [javac] Note: Some input files use or override a deprecated API.
    [javac] Note: Recompile with -Xlint:deprecation for details.
    [javac] Note: Some input files use unchecked or unsafe operations.
    [javac] Note: Recompile with -Xlint:unchecked for details.
    [javac] Creating empty <https://builds.apache.org/job/Hive-trunk-h0.21/ws/hive/build/serde/classes/org/apache/hadoop/hive/serde2/typeinfo/package-info.class>

jar:
     [echo] Jar: serde
      [jar] Building jar: <https://builds.apache.org/job/Hive-trunk-h0.21/ws/hive/build/serde/hive-serde-0.8.0-SNAPSHOT.jar>

create-dirs:
    [mkdir] Created dir: <https://builds.apache.org/job/Hive-trunk-h0.21/ws/hive/build/metastore>
    [mkdir] Created dir: <https://builds.apache.org/job/Hive-trunk-h0.21/ws/hive/build/metastore/classes>
    [mkdir] Created dir: <https://builds.apache.org/job/Hive-trunk-h0.21/ws/hive/build/metastore/test>
    [mkdir] Created dir: <https://builds.apache.org/job/Hive-trunk-h0.21/ws/hive/build/metastore/test/src>
    [mkdir] Created dir: <https://builds.apache.org/job/Hive-trunk-h0.21/ws/hive/build/metastore/test/classes>

compile-ant-tasks:

create-dirs:

init:

compile:
     [echo] Compiling: anttasks
    [javac] <https://builds.apache.org/job/Hive-trunk-h0.21/ws/hive/ant/build.xml>:40:
warning: 'includeantruntime' was not set, defaulting to build.sysclasspath=last; set to false
for repeatable builds

deploy-ant-tasks:

create-dirs:

init:

compile:
     [echo] Compiling: anttasks
    [javac] <https://builds.apache.org/job/Hive-trunk-h0.21/ws/hive/ant/build.xml>:40:
warning: 'includeantruntime' was not set, defaulting to build.sysclasspath=last; set to false
for repeatable builds

jar:

init:

metastore-init:
    [mkdir] Created dir: <https://builds.apache.org/job/Hive-trunk-h0.21/ws/hive/build/metastore/gen/antlr/gen-java/org/apache/hadoop/hive/metastore/parser>

build-grammar:
     [echo] Building Grammar <https://builds.apache.org/job/Hive-trunk-h0.21/ws/hive/metastore/src/java/org/apache/hadoop/hive/metastore/parser/Filter.g>
 ....
     [java] ANTLR Parser Generator  Version 3.0.1 (August 13, 2007)  1989-2007

model-compile:
    [javac] <https://builds.apache.org/job/Hive-trunk-h0.21/ws/hive/metastore/build.xml>:69:
warning: 'includeantruntime' was not set, defaulting to build.sysclasspath=last; set to false
for repeatable builds
    [javac] Compiling 18 source files to <https://builds.apache.org/job/Hive-trunk-h0.21/ws/hive/build/metastore/classes>
     [copy] Copying 1 file to <https://builds.apache.org/job/Hive-trunk-h0.21/ws/hive/build/metastore/classes>

ivy-init-dirs:

ivy-download:
      [get] Getting: http://repo2.maven.org/maven2/org/apache/ivy/ivy/2.1.0/ivy-2.1.0.jar
      [get] To: <https://builds.apache.org/job/Hive-trunk-h0.21/ws/hive/build/ivy/lib/ivy-2.1.0.jar>
      [get] Not modified - so not downloaded

ivy-probe-antlib:

ivy-init-antlib:

ivy-init:

ivy-resolve:
[ivy:resolve] :: loading settings :: file = <https://builds.apache.org/job/Hive-trunk-h0.21/ws/hive/ivy/ivysettings.xml>

ivy-retrieve:

core-compile:
     [echo] Compiling: 
    [javac] <https://builds.apache.org/job/Hive-trunk-h0.21/ws/hive/metastore/build.xml>:60:
warning: 'includeantruntime' was not set, defaulting to build.sysclasspath=last; set to false
for repeatable builds
    [javac] Compiling 65 source files to <https://builds.apache.org/job/Hive-trunk-h0.21/ws/hive/build/metastore/classes>
    [javac] Note: <https://builds.apache.org/job/Hive-trunk-h0.21/ws/hive/metastore/src/java/org/apache/hadoop/hive/metastore/MetaStoreUtils.java>
uses or overrides a deprecated API.
    [javac] Note: Recompile with -Xlint:deprecation for details.
    [javac] Note: Some input files use unchecked or unsafe operations.
    [javac] Note: Recompile with -Xlint:unchecked for details.
    [javac] Creating empty <https://builds.apache.org/job/Hive-trunk-h0.21/ws/hive/build/metastore/classes/org/apache/hadoop/hive/metastore/parser/package-info.class>

model-enhance:
[datanucleusenhancer] #
[datanucleusenhancer] # A fatal error has been detected by the Java Runtime Environment:
[datanucleusenhancer] #
[datanucleusenhancer] #  SIGBUS (0x7) at pc=0xf76b47a4, pid=25970, tid=4137679728
[datanucleusenhancer] #
[datanucleusenhancer] # JRE version: 6.0_20-b02
[datanucleusenhancer] # Java VM: Java HotSpot(TM) Server VM (16.3-b01 mixed mode linux-x86
)
[datanucleusenhancer] # Problematic frame:
[datanucleusenhancer] # C  [libc.so.6+0x1117a4]
[datanucleusenhancer] #
[datanucleusenhancer] # An error report file with more information is saved as:
[datanucleusenhancer] # <https://builds.apache.org/job/Hive-trunk-h0.21/ws/hive/metastore/hs_err_pid25970.log>
[datanucleusenhancer] #
[datanucleusenhancer] # If you would like to submit a bug report, please visit:
[datanucleusenhancer] #   http://java.sun.com/webapps/bugreport/crash.jsp
[datanucleusenhancer] #

BUILD FAILED
<https://builds.apache.org/job/Hive-trunk-h0.21/ws/hive/build.xml>:196: The following
error occurred while executing this line:
<https://builds.apache.org/job/Hive-trunk-h0.21/ws/hive/build.xml>:130: The following
error occurred while executing this line:
<https://builds.apache.org/job/Hive-trunk-h0.21/ws/hive/metastore/build.xml>:88: Java
returned: 134

Total time: 40 seconds
Recording test results
ERROR: Failed to archive test reports
hudson.util.IOException2: remote file operation failed: <https://builds.apache.org/job/Hive-trunk-h0.21/ws/>
at hudson.remoting.Channel@7a8e8351:ubuntu1
	at hudson.FilePath.act(FilePath.java:754)
	at hudson.FilePath.act(FilePath.java:740)
	at hudson.tasks.junit.JUnitParser.parse(JUnitParser.java:83)
	at hudson.tasks.junit.JUnitResultArchiver.parse(JUnitResultArchiver.java:123)
	at hudson.tasks.junit.JUnitResultArchiver.perform(JUnitResultArchiver.java:135)
	at hudson.tasks.BuildStepMonitor$1.perform(BuildStepMonitor.java:19)
	at hudson.model.AbstractBuild$AbstractRunner.perform(AbstractBuild.java:662)
	at hudson.model.AbstractBuild$AbstractRunner.performAllBuildSteps(AbstractBuild.java:638)
	at hudson.model.AbstractBuild$AbstractRunner.performAllBuildSteps(AbstractBuild.java:616)
	at hudson.model.Build$RunnerImpl.post2(Build.java:161)
	at hudson.model.AbstractBuild$AbstractRunner.post(AbstractBuild.java:585)
	at hudson.model.Run.run(Run.java:1398)
	at hudson.model.FreeStyleBuild.run(FreeStyleBuild.java:46)
	at hudson.model.ResourceController.execute(ResourceController.java:88)
	at hudson.model.Executor.run(Executor.java:145)
Caused by: java.io.IOException: Remote call on ubuntu1 failed
	at hudson.remoting.Channel.call(Channel.java:670)
	at hudson.FilePath.act(FilePath.java:747)
	... 14 more
Caused by: java.lang.Error: Unable to load resource hudson/tasks/junit/Messages.properties
	at hudson.remoting.RemoteClassLoader.findResource(RemoteClassLoader.java:198)
	at java.lang.ClassLoader.getResource(ClassLoader.java:977)
	at java.lang.Class.getResource(Class.java:2091)
	at org.jvnet.localizer.ResourceBundleHolder.get(ResourceBundleHolder.java:83)
	at org.jvnet.localizer.ResourceBundleHolder.get(ResourceBundleHolder.java:102)
	at org.jvnet.localizer.ResourceBundleHolder.get(ResourceBundleHolder.java:102)
	at org.jvnet.localizer.ResourceBundleHolder.format(ResourceBundleHolder.java:139)
	at hudson.tasks.junit.Messages.JUnitResultArchiver_NoTestReportFound(Messages.java:261)
	at hudson.tasks.junit.JUnitParser$ParseResultCallable.invoke(JUnitParser.java:111)
	at hudson.tasks.junit.JUnitParser$ParseResultCallable.invoke(JUnitParser.java:87)
	at hudson.FilePath$FileCallableWrapper.call(FilePath.java:1979)
	at hudson.remoting.UserRequest.perform(UserRequest.java:118)
	at hudson.remoting.UserRequest.perform(UserRequest.java:48)
	at hudson.remoting.Request$2.run(Request.java:270)
	at java.util.concurrent.Executors$RunnableAdapter.call(Executors.java:471)
	at java.util.concurrent.FutureTask$Sync.innerRun(FutureTask.java:334)
	at java.util.concurrent.FutureTask.run(FutureTask.java:166)
	at java.util.concurrent.ThreadPoolExecutor.runWorker(ThreadPoolExecutor.java:1110)
	at java.util.concurrent.ThreadPoolExecutor$Worker.run(ThreadPoolExecutor.java:603)
	at java.lang.Thread.run(Thread.java:636)
Caused by: java.io.FileNotFoundException: /tmp/hudson-remoting3786668914840270764/hudson/tasks/junit/Messages.properties
(No such file or directory)
	at java.io.FileOutputStream.open(Native Method)
	at java.io.FileOutputStream.<init>(FileOutputStream.java:209)
	at java.io.FileOutputStream.<init>(FileOutputStream.java:160)
	at hudson.remoting.RemoteClassLoader.makeResource(RemoteClassLoader.java:266)
	at hudson.remoting.RemoteClassLoader.findResource(RemoteClassLoader.java:194)
	... 19 more
Archiving artifacts
ERROR: Publisher hudson.plugins.violations.ViolationsPublisher aborted due to exception
hudson.util.IOException2: remote file operation failed: <https://builds.apache.org/job/Hive-trunk-h0.21/ws/>
at hudson.remoting.Channel@7a8e8351:ubuntu1
	at hudson.FilePath.act(FilePath.java:754)
	at hudson.FilePath.act(FilePath.java:740)
	at hudson.plugins.violations.ViolationsPublisher.perform(ViolationsPublisher.java:74)
	at hudson.tasks.BuildStepMonitor$3.perform(BuildStepMonitor.java:36)
	at hudson.model.AbstractBuild$AbstractRunner.perform(AbstractBuild.java:662)
	at hudson.model.AbstractBuild$AbstractRunner.performAllBuildSteps(AbstractBuild.java:638)
	at hudson.model.AbstractBuild$AbstractRunner.performAllBuildSteps(AbstractBuild.java:616)
	at hudson.model.Build$RunnerImpl.post2(Build.java:161)
	at hudson.model.AbstractBuild$AbstractRunner.post(AbstractBuild.java:585)
	at hudson.model.Run.run(Run.java:1398)
	at hudson.model.FreeStyleBuild.run(FreeStyleBuild.java:46)
	at hudson.model.ResourceController.execute(ResourceController.java:88)
	at hudson.model.Executor.run(Executor.java:145)
Caused by: java.io.IOException: Remote call on ubuntu1 failed
	at hudson.remoting.Channel.call(Channel.java:670)
	at hudson.FilePath.act(FilePath.java:747)
	... 12 more
Caused by: java.lang.Error: Unable to load resource hudson/plugins/violations/types/findbugs/findbugs-1.3.3-rc2.messages.xml
	at hudson.remoting.RemoteClassLoader.findResource(RemoteClassLoader.java:198)
	at java.lang.ClassLoader.getResource(ClassLoader.java:977)
	at java.lang.ClassLoader.getResourceAsStream(ClassLoader.java:1159)
	at java.lang.Class.getResourceAsStream(Class.java:2047)
	at hudson.plugins.violations.types.findbugs.FindBugsDescriptor.parseMessages(FindBugsDescriptor.java:97)
	at hudson.plugins.violations.types.findbugs.FindBugsDescriptor.parseMessages(FindBugsDescriptor.java:90)
	at hudson.plugins.violations.types.findbugs.FindBugsDescriptor.<clinit>(FindBugsDescriptor.java:85)
	at hudson.plugins.violations.TypeDescriptor.<clinit>(TypeDescriptor.java:82)
	at hudson.plugins.violations.ViolationsCollector.invoke(ViolationsCollector.java:103)
	at hudson.plugins.violations.ViolationsCollector.invoke(ViolationsCollector.java:25)
	at hudson.FilePath$FileCallableWrapper.call(FilePath.java:1979)
	at hudson.remoting.UserRequest.perform(UserRequest.java:118)
	at hudson.remoting.UserRequest.perform(UserRequest.java:48)
	at hudson.remoting.Request$2.run(Request.java:270)
	at java.util.concurrent.Executors$RunnableAdapter.call(Executors.java:471)
	at java.util.concurrent.FutureTask$Sync.innerRun(FutureTask.java:334)
	at java.util.concurrent.FutureTask.run(FutureTask.java:166)
	at java.util.concurrent.ThreadPoolExecutor.runWorker(ThreadPoolExecutor.java:1110)
	at java.util.concurrent.ThreadPoolExecutor$Worker.run(ThreadPoolExecutor.java:603)
	at java.lang.Thread.run(Thread.java:636)
Caused by: java.io.FileNotFoundException: /tmp/hudson-remoting4071325077868047118/hudson/plugins/violations/types/findbugs/findbugs-1.3.3-rc2.messages.xml
(No such file or directory)
	at java.io.FileOutputStream.open(Native Method)
	at java.io.FileOutputStream.<init>(FileOutputStream.java:209)
	at java.io.FileOutputStream.<init>(FileOutputStream.java:160)
	at hudson.remoting.RemoteClassLoader.makeResource(RemoteClassLoader.java:266)
	at hudson.remoting.RemoteClassLoader.findResource(RemoteClassLoader.java:194)
	... 19 more


Mime
View raw message