hive-dev mailing list archives

Site index · List index
Message view « Date » · « Thread »
Top « Date » · « Thread »
From Apache Jenkins Server <jenk...@builds.apache.org>
Subject Build failed in Jenkins: Hive-trunk-h0.21 #838
Date Thu, 21 Jul 2011 06:57:21 GMT
See <https://builds.apache.org/job/Hive-trunk-h0.21/838/changes>

Changes:

[heyongqiang] HIVE-2209:add support for map comparision in serde layer (Krishna Kumar via
He Yongqiang)

------------------------------------------
[...truncated 20304 lines...]
    [junit] #
    [junit] Running org.apache.hadoop.hive.ql.parse.TestParseNegative
    [junit] Tests run: 1, Failures: 0, Errors: 1, Time elapsed: 0 sec
    [junit] Test org.apache.hadoop.hive.ql.parse.TestParseNegative FAILED (crashed)
    [junit] #
    [junit] # A fatal error has been detected by the Java Runtime Environment:
    [junit] #
    [junit] #  SIGBUS (0x7) at pc=0xf76fd7a4, pid=19865, tid=4137978736
    [junit] #
    [junit] # JRE version: 6.0_20-b02
    [junit] # Java VM: Java HotSpot(TM) Server VM (16.3-b01 mixed mode linux-x86 )
    [junit] # Problematic frame:
    [junit] # C  [libc.so.6+0x1117a4]
    [junit] #
    [junit] # An error report file with more information is saved as:
    [junit] # /x1/jenkins/jenkins-slave/workspace/Hive-trunk-h0.21/hive/ql/hs_err_pid19865.log
    [junit] #
    [junit] # If you would like to submit a bug report, please visit:
    [junit] #   http://java.sun.com/webapps/bugreport/crash.jsp
    [junit] #
    [junit] Running org.apache.hadoop.hive.ql.tool.TestLineageInfo
    [junit] Tests run: 1, Failures: 0, Errors: 1, Time elapsed: 0 sec
    [junit] Test org.apache.hadoop.hive.ql.tool.TestLineageInfo FAILED (crashed)
    [junit] #
    [junit] # A fatal error has been detected by the Java Runtime Environment:
    [junit] #
    [junit] #  SIGBUS (0x7) at pc=0xf76fa7a4, pid=19872, tid=4137966448
    [junit] #
    [junit] # JRE version: 6.0_20-b02
    [junit] # Java VM: Java HotSpot(TM) Server VM (16.3-b01 mixed mode linux-x86 )
    [junit] # Problematic frame:
    [junit] # C  [libc.so.6+0x1117a4]
    [junit] #
    [junit] # An error report file with more information is saved as:
    [junit] # /x1/jenkins/jenkins-slave/workspace/Hive-trunk-h0.21/hive/ql/hs_err_pid19872.log
    [junit] #
    [junit] # If you would like to submit a bug report, please visit:
    [junit] #   http://java.sun.com/webapps/bugreport/crash.jsp
    [junit] #
    [junit] Running org.apache.hadoop.hive.ql.udf.TestUDFDateAdd
    [junit] Tests run: 1, Failures: 0, Errors: 1, Time elapsed: 0 sec
    [junit] Test org.apache.hadoop.hive.ql.udf.TestUDFDateAdd FAILED (crashed)
    [junit] #
    [junit] # A fatal error has been detected by the Java Runtime Environment:
    [junit] #
    [junit] #  SIGBUS (0x7) at pc=0xf76937a4, pid=19879, tid=4137544560
    [junit] #
    [junit] # JRE version: 6.0_20-b02
    [junit] # Java VM: Java HotSpot(TM) Server VM (16.3-b01 mixed mode linux-x86 )
    [junit] # Problematic frame:
    [junit] # C  [libc.so.6+0x1117a4]
    [junit] #
    [junit] # An error report file with more information is saved as:
    [junit] # /x1/jenkins/jenkins-slave/workspace/Hive-trunk-h0.21/hive/ql/hs_err_pid19879.log
    [junit] #
    [junit] # If you would like to submit a bug report, please visit:
    [junit] #   http://java.sun.com/webapps/bugreport/crash.jsp
    [junit] #
    [junit] Running org.apache.hadoop.hive.ql.udf.TestUDFDateDiff
    [junit] Tests run: 1, Failures: 0, Errors: 1, Time elapsed: 0 sec
    [junit] Test org.apache.hadoop.hive.ql.udf.TestUDFDateDiff FAILED (crashed)
    [junit] #
    [junit] # A fatal error has been detected by the Java Runtime Environment:
    [junit] #
    [junit] #  SIGBUS (0x7) at pc=0xf76db7a4, pid=19886, tid=4137839472
    [junit] #
    [junit] # JRE version: 6.0_20-b02
    [junit] # Java VM: Java HotSpot(TM) Server VM (16.3-b01 mixed mode linux-x86 )
    [junit] # Problematic frame:
    [junit] # C  [libc.so.6+0x1117a4]
    [junit] #
    [junit] # An error report file with more information is saved as:
    [junit] # /x1/jenkins/jenkins-slave/workspace/Hive-trunk-h0.21/hive/ql/hs_err_pid19886.log
    [junit] #
    [junit] # If you would like to submit a bug report, please visit:
    [junit] #   http://java.sun.com/webapps/bugreport/crash.jsp
    [junit] #
    [junit] Running org.apache.hadoop.hive.ql.udf.TestUDFDateSub
    [junit] Tests run: 1, Failures: 0, Errors: 1, Time elapsed: 0 sec
    [junit] Test org.apache.hadoop.hive.ql.udf.TestUDFDateSub FAILED (crashed)
    [junit] #
    [junit] # A fatal error has been detected by the Java Runtime Environment:
    [junit] #
    [junit] #  SIGBUS (0x7) at pc=0xf76857a4, pid=19893, tid=4137487216
    [junit] #
    [junit] # JRE version: 6.0_20-b02
    [junit] # Java VM: Java HotSpot(TM) Server VM (16.3-b01 mixed mode linux-x86 )
    [junit] # Problematic frame:
    [junit] # C  [libc.so.6+0x1117a4]
    [junit] #
    [junit] # An error report file with more information is saved as:
    [junit] # /x1/jenkins/jenkins-slave/workspace/Hive-trunk-h0.21/hive/ql/hs_err_pid19893.log
    [junit] #
    [junit] # If you would like to submit a bug report, please visit:
    [junit] #   http://java.sun.com/webapps/bugreport/crash.jsp
    [junit] #
    [junit] Running org.apache.hadoop.hive.ql.util.TestDosToUnix
    [junit] Tests run: 1, Failures: 0, Errors: 1, Time elapsed: 0 sec
    [junit] Test org.apache.hadoop.hive.ql.util.TestDosToUnix FAILED (crashed)
      [for] /x1/jenkins/jenkins-slave/workspace/Hive-trunk-h0.21/hive/ql/build.xml: The following
error occurred while executing this line:
      [for] /x1/jenkins/jenkins-slave/workspace/Hive-trunk-h0.21/hive/build.xml:213: The following
error occurred while executing this line:
      [for] /x1/jenkins/jenkins-slave/workspace/Hive-trunk-h0.21/hive/build-common.xml:482:
Tests failed!

test-conditions:

gen-test:

create-dirs:

compile-ant-tasks:

create-dirs:

init:

compile:
     [echo] Compiling: anttasks
    [javac] /x1/jenkins/jenkins-slave/workspace/Hive-trunk-h0.21/hive/ant/build.xml:40: warning:
'includeantruntime' was not set, defaulting to build.sysclasspath=last; set to false for repeatable
builds

deploy-ant-tasks:

create-dirs:

init:

compile:
     [echo] Compiling: anttasks
    [javac] /x1/jenkins/jenkins-slave/workspace/Hive-trunk-h0.21/hive/ant/build.xml:40: warning:
'includeantruntime' was not set, defaulting to build.sysclasspath=last; set to false for repeatable
builds

jar:

init:

dynamic-serde:

ivy-init-dirs:

ivy-download:
      [get] Getting: http://repo2.maven.org/maven2/org/apache/ivy/ivy/2.1.0/ivy-2.1.0.jar
      [get] To: /x1/jenkins/jenkins-slave/workspace/Hive-trunk-h0.21/hive/build/ivy/lib/ivy-2.1.0.jar
      [get] Not modified - so not downloaded

ivy-probe-antlib:

ivy-init-antlib:

ivy-init:

ivy-resolve:
[ivy:resolve] :: loading settings :: file = /x1/jenkins/jenkins-slave/workspace/Hive-trunk-h0.21/hive/ivy/ivysettings.xml
      [for] /x1/jenkins/jenkins-slave/workspace/Hive-trunk-h0.21/hive/serde/build.xml: The
following error occurred while executing this line:
      [for] /x1/jenkins/jenkins-slave/workspace/Hive-trunk-h0.21/hive/build.xml:213: The following
error occurred while executing this line:
      [for] /x1/jenkins/jenkins-slave/workspace/Hive-trunk-h0.21/hive/build-common.xml:166:
impossible to resolve dependencies:
      [for] 	java.io.IOException: No space left on device

test-conditions:

gen-test:

create-dirs:

compile-ant-tasks:

create-dirs:

init:

compile:
     [echo] Compiling: anttasks
    [javac] /x1/jenkins/jenkins-slave/workspace/Hive-trunk-h0.21/hive/ant/build.xml:40: warning:
'includeantruntime' was not set, defaulting to build.sysclasspath=last; set to false for repeatable
builds

deploy-ant-tasks:

create-dirs:

init:

compile:
     [echo] Compiling: anttasks
    [javac] /x1/jenkins/jenkins-slave/workspace/Hive-trunk-h0.21/hive/ant/build.xml:40: warning:
'includeantruntime' was not set, defaulting to build.sysclasspath=last; set to false for repeatable
builds

jar:

init:

core-compile:
    [javac] /x1/jenkins/jenkins-slave/workspace/Hive-trunk-h0.21/hive/service/build.xml:59:
warning: 'includeantruntime' was not set, defaulting to build.sysclasspath=last; set to false
for repeatable builds

compile:

compile-test:
    [javac] /x1/jenkins/jenkins-slave/workspace/Hive-trunk-h0.21/hive/build-common.xml:338:
warning: 'includeantruntime' was not set, defaulting to build.sysclasspath=last; set to false
for repeatable builds
    [javac] /x1/jenkins/jenkins-slave/workspace/Hive-trunk-h0.21/hive/build-common.xml:351:
warning: 'includeantruntime' was not set, defaulting to build.sysclasspath=last; set to false
for repeatable builds

test-jar:
      [jar] Building MANIFEST-only jar: /x1/jenkins/jenkins-slave/workspace/Hive-trunk-h0.21/hive/build/service/test/test-udfs.jar

test-init:
    [mkdir] Created dir: /x1/jenkins/jenkins-slave/workspace/Hive-trunk-h0.21/hive/build/service/test/data
    [mkdir] Created dir: /x1/jenkins/jenkins-slave/workspace/Hive-trunk-h0.21/hive/build/service/test/logs/clientpositive
    [mkdir] Created dir: /x1/jenkins/jenkins-slave/workspace/Hive-trunk-h0.21/hive/build/service/test/logs/clientnegative
    [mkdir] Created dir: /x1/jenkins/jenkins-slave/workspace/Hive-trunk-h0.21/hive/build/service/test/logs/positive
    [mkdir] Created dir: /x1/jenkins/jenkins-slave/workspace/Hive-trunk-h0.21/hive/build/service/test/logs/negative
    [mkdir] Created dir: /x1/jenkins/jenkins-slave/workspace/Hive-trunk-h0.21/hive/build/service/test/data/warehouse
    [mkdir] Created dir: /x1/jenkins/jenkins-slave/workspace/Hive-trunk-h0.21/hive/build/service/test/data/metadb

test:
    [junit] #
    [junit] # A fatal error has been detected by the Java Runtime Environment:
    [junit] #
    [junit] #  SIGBUS (0x7) at pc=0xf76907a4, pid=19904, tid=4137532272
    [junit] #
    [junit] # JRE version: 6.0_20-b02
    [junit] # Java VM: Java HotSpot(TM) Server VM (16.3-b01 mixed mode linux-x86 )
    [junit] # Problematic frame:
    [junit] # C  [libc.so.6+0x1117a4]
    [junit] #
    [junit] # An error report file with more information is saved as:
    [junit] # /x1/jenkins/jenkins-slave/workspace/Hive-trunk-h0.21/hive/service/hs_err_pid19904.log
    [junit] #
    [junit] # If you would like to submit a bug report, please visit:
    [junit] #   http://java.sun.com/webapps/bugreport/crash.jsp
    [junit] #
    [junit] Testsuite: org.apache.hadoop.hive.service.TestHiveServer
    [junit] Tests run: 1, Failures: 0, Errors: 1, Time elapsed: 0 sec
    [junit] 
    [junit] Testcase: null took 0.002 sec
    [junit] 	Caused an ERROR
    [junit] Forked Java VM exited abnormally. Please note the time in the report does not
reflect the time until the VM exit.
    [junit] junit.framework.AssertionFailedError: Forked Java VM exited abnormally. Please
note the time in the report does not reflect the time until the VM exit.
    [junit] 	at net.sf.antcontrib.logic.ForTask.doSequentialIteration(ForTask.java:259)
    [junit] 	at net.sf.antcontrib.logic.ForTask.doToken(ForTask.java:268)
    [junit] 	at net.sf.antcontrib.logic.ForTask.doTheTasks(ForTask.java:324)
    [junit] 	at net.sf.antcontrib.logic.ForTask.execute(ForTask.java:244)
    [junit] 
    [junit] Running org.apache.hadoop.hive.service.TestHiveServer
    [junit] Tests run: 1, Failures: 0, Errors: 1, Time elapsed: 0 sec
    [junit] Test org.apache.hadoop.hive.service.TestHiveServer FAILED (crashed)
      [for] /x1/jenkins/jenkins-slave/workspace/Hive-trunk-h0.21/hive/service/build.xml: The
following error occurred while executing this line:
      [for] /x1/jenkins/jenkins-slave/workspace/Hive-trunk-h0.21/hive/build.xml:213: The following
error occurred while executing this line:
      [for] /x1/jenkins/jenkins-slave/workspace/Hive-trunk-h0.21/hive/build-common.xml:482:
Tests failed!

BUILD FAILED
/x1/jenkins/jenkins-slave/workspace/Hive-trunk-h0.21/hive/build.xml:208: Keepgoing execution:
4 of 10 iterations failed.

Total time: 152 minutes 52 seconds
Archiving artifacts
Recording test results
Updating HIVE-2209


Mime
View raw message