hive-dev mailing list archives

Site index · List index
Message view « Date » · « Thread »
Top « Date » · « Thread »
From Apache Hudson Server <hud...@hudson.apache.org>
Subject Build failed in Hudson: Hive-trunk-h0.20 #528
Date Thu, 03 Feb 2011 00:05:24 GMT
See <https://hudson.apache.org/hudson/job/Hive-trunk-h0.20/528/changes>

Changes:

[namit] HIVE-1944 Dynamic partition insert creating different directories for the
same partition during merge (Ning Zhang via namit)

------------------------------------------
[...truncated 22323 lines...]
    [junit] Deleted <https://hudson.apache.org/hudson/job/Hive-trunk-h0.20/ws/hive/build/contrib/test/data/warehouse/dest1>
    [junit] diff -a -I file: -I pfile: -I hdfs: -I /tmp/ -I invalidscheme: -I lastUpdateTime
-I lastAccessTime -I [Oo]wner -I CreateTime -I LastAccessTime -I Location -I transient_lastDdlTime
-I last_modified_ -I java.lang.RuntimeException -I at org -I at sun -I at java -I at junit
-I Caused by: -I LOCK_QUERYID: -I grantTime -I [.][.][.] [0-9]* more <https://hudson.apache.org/hudson/job/Hive-trunk-h0.20/ws/hive/build/contrib/test/logs/contribclientpositive/serde_typedbytes2.q.out>
<https://hudson.apache.org/hudson/job/Hive-trunk-h0.20/ws/hive/contrib/src/test/results/clientpositive/serde_typedbytes2.q.out>
    [junit] Done query: serde_typedbytes2.q
    [junit] Begin query: serde_typedbytes3.q
    [junit] Deleted <https://hudson.apache.org/hudson/job/Hive-trunk-h0.20/ws/hive/build/contrib/test/data/warehouse/dest1>
    [junit] diff -a -I file: -I pfile: -I hdfs: -I /tmp/ -I invalidscheme: -I lastUpdateTime
-I lastAccessTime -I [Oo]wner -I CreateTime -I LastAccessTime -I Location -I transient_lastDdlTime
-I last_modified_ -I java.lang.RuntimeException -I at org -I at sun -I at java -I at junit
-I Caused by: -I LOCK_QUERYID: -I grantTime -I [.][.][.] [0-9]* more <https://hudson.apache.org/hudson/job/Hive-trunk-h0.20/ws/hive/build/contrib/test/logs/contribclientpositive/serde_typedbytes3.q.out>
<https://hudson.apache.org/hudson/job/Hive-trunk-h0.20/ws/hive/contrib/src/test/results/clientpositive/serde_typedbytes3.q.out>
    [junit] Done query: serde_typedbytes3.q
    [junit] Begin query: serde_typedbytes4.q
    [junit] Deleted <https://hudson.apache.org/hudson/job/Hive-trunk-h0.20/ws/hive/build/contrib/test/data/warehouse/dest1>
    [junit] diff -a -I file: -I pfile: -I hdfs: -I /tmp/ -I invalidscheme: -I lastUpdateTime
-I lastAccessTime -I [Oo]wner -I CreateTime -I LastAccessTime -I Location -I transient_lastDdlTime
-I last_modified_ -I java.lang.RuntimeException -I at org -I at sun -I at java -I at junit
-I Caused by: -I LOCK_QUERYID: -I grantTime -I [.][.][.] [0-9]* more <https://hudson.apache.org/hudson/job/Hive-trunk-h0.20/ws/hive/build/contrib/test/logs/contribclientpositive/serde_typedbytes4.q.out>
<https://hudson.apache.org/hudson/job/Hive-trunk-h0.20/ws/hive/contrib/src/test/results/clientpositive/serde_typedbytes4.q.out>
    [junit] Done query: serde_typedbytes4.q
    [junit] Begin query: serde_typedbytes5.q
    [junit] dummy
    [junit] Deleted <https://hudson.apache.org/hudson/job/Hive-trunk-h0.20/ws/hive/build/contrib/test/data/warehouse/dest1>
    [junit] diff -a -I file: -I pfile: -I hdfs: -I /tmp/ -I invalidscheme: -I lastUpdateTime
-I lastAccessTime -I [Oo]wner -I CreateTime -I LastAccessTime -I Location -I transient_lastDdlTime
-I last_modified_ -I java.lang.RuntimeException -I at org -I at sun -I at java -I at junit
-I Caused by: -I LOCK_QUERYID: -I grantTime -I [.][.][.] [0-9]* more <https://hudson.apache.org/hudson/job/Hive-trunk-h0.20/ws/hive/build/contrib/test/logs/contribclientpositive/serde_typedbytes5.q.out>
<https://hudson.apache.org/hudson/job/Hive-trunk-h0.20/ws/hive/contrib/src/test/results/clientpositive/serde_typedbytes5.q.out>
    [junit] Done query: serde_typedbytes5.q
    [junit] Begin query: serde_typedbytes6.q
    [junit] diff -a -I file: -I pfile: -I hdfs: -I /tmp/ -I invalidscheme: -I lastUpdateTime
-I lastAccessTime -I [Oo]wner -I CreateTime -I LastAccessTime -I Location -I transient_lastDdlTime
-I last_modified_ -I java.lang.RuntimeException -I at org -I at sun -I at java -I at junit
-I Caused by: -I LOCK_QUERYID: -I grantTime -I [.][.][.] [0-9]* more <https://hudson.apache.org/hudson/job/Hive-trunk-h0.20/ws/hive/build/contrib/test/logs/contribclientpositive/serde_typedbytes6.q.out>
<https://hudson.apache.org/hudson/job/Hive-trunk-h0.20/ws/hive/contrib/src/test/results/clientpositive/serde_typedbytes6.q.out>
    [junit] Done query: serde_typedbytes6.q
    [junit] Begin query: serde_typedbytes_null.q
    [junit] Deleted <https://hudson.apache.org/hudson/job/Hive-trunk-h0.20/ws/hive/build/contrib/test/data/warehouse/table1>
    [junit] diff -a -I file: -I pfile: -I hdfs: -I /tmp/ -I invalidscheme: -I lastUpdateTime
-I lastAccessTime -I [Oo]wner -I CreateTime -I LastAccessTime -I Location -I transient_lastDdlTime
-I last_modified_ -I java.lang.RuntimeException -I at org -I at sun -I at java -I at junit
-I Caused by: -I LOCK_QUERYID: -I grantTime -I [.][.][.] [0-9]* more <https://hudson.apache.org/hudson/job/Hive-trunk-h0.20/ws/hive/build/contrib/test/logs/contribclientpositive/serde_typedbytes_null.q.out>
<https://hudson.apache.org/hudson/job/Hive-trunk-h0.20/ws/hive/contrib/src/test/results/clientpositive/serde_typedbytes_null.q.out>
    [junit] Done query: serde_typedbytes_null.q
    [junit] Begin query: udaf_example_avg.q
    [junit] diff -a -I file: -I pfile: -I hdfs: -I /tmp/ -I invalidscheme: -I lastUpdateTime
-I lastAccessTime -I [Oo]wner -I CreateTime -I LastAccessTime -I Location -I transient_lastDdlTime
-I last_modified_ -I java.lang.RuntimeException -I at org -I at sun -I at java -I at junit
-I Caused by: -I LOCK_QUERYID: -I grantTime -I [.][.][.] [0-9]* more <https://hudson.apache.org/hudson/job/Hive-trunk-h0.20/ws/hive/build/contrib/test/logs/contribclientpositive/udaf_example_avg.q.out>
<https://hudson.apache.org/hudson/job/Hive-trunk-h0.20/ws/hive/contrib/src/test/results/clientpositive/udaf_example_avg.q.out>
    [junit] Done query: udaf_example_avg.q
    [junit] Begin query: udaf_example_group_concat.q
    [junit] diff -a -I file: -I pfile: -I hdfs: -I /tmp/ -I invalidscheme: -I lastUpdateTime
-I lastAccessTime -I [Oo]wner -I CreateTime -I LastAccessTime -I Location -I transient_lastDdlTime
-I last_modified_ -I java.lang.RuntimeException -I at org -I at sun -I at java -I at junit
-I Caused by: -I LOCK_QUERYID: -I grantTime -I [.][.][.] [0-9]* more <https://hudson.apache.org/hudson/job/Hive-trunk-h0.20/ws/hive/build/contrib/test/logs/contribclientpositive/udaf_example_group_concat.q.out>
<https://hudson.apache.org/hudson/job/Hive-trunk-h0.20/ws/hive/contrib/src/test/results/clientpositive/udaf_example_group_concat.q.out>
    [junit] Done query: udaf_example_group_concat.q
    [junit] Begin query: udaf_example_max.q
    [junit] diff -a -I file: -I pfile: -I hdfs: -I /tmp/ -I invalidscheme: -I lastUpdateTime
-I lastAccessTime -I [Oo]wner -I CreateTime -I LastAccessTime -I Location -I transient_lastDdlTime
-I last_modified_ -I java.lang.RuntimeException -I at org -I at sun -I at java -I at junit
-I Caused by: -I LOCK_QUERYID: -I grantTime -I [.][.][.] [0-9]* more <https://hudson.apache.org/hudson/job/Hive-trunk-h0.20/ws/hive/build/contrib/test/logs/contribclientpositive/udaf_example_max.q.out>
<https://hudson.apache.org/hudson/job/Hive-trunk-h0.20/ws/hive/contrib/src/test/results/clientpositive/udaf_example_max.q.out>
    [junit] Done query: udaf_example_max.q
    [junit] Begin query: udaf_example_max_n.q
    [junit] diff -a -I file: -I pfile: -I hdfs: -I /tmp/ -I invalidscheme: -I lastUpdateTime
-I lastAccessTime -I [Oo]wner -I CreateTime -I LastAccessTime -I Location -I transient_lastDdlTime
-I last_modified_ -I java.lang.RuntimeException -I at org -I at sun -I at java -I at junit
-I Caused by: -I LOCK_QUERYID: -I grantTime -I [.][.][.] [0-9]* more <https://hudson.apache.org/hudson/job/Hive-trunk-h0.20/ws/hive/build/contrib/test/logs/contribclientpositive/udaf_example_max_n.q.out>
<https://hudson.apache.org/hudson/job/Hive-trunk-h0.20/ws/hive/contrib/src/test/results/clientpositive/udaf_example_max_n.q.out>
    [junit] Done query: udaf_example_max_n.q
    [junit] Begin query: udaf_example_min.q
    [junit] diff -a -I file: -I pfile: -I hdfs: -I /tmp/ -I invalidscheme: -I lastUpdateTime
-I lastAccessTime -I [Oo]wner -I CreateTime -I LastAccessTime -I Location -I transient_lastDdlTime
-I last_modified_ -I java.lang.RuntimeException -I at org -I at sun -I at java -I at junit
-I Caused by: -I LOCK_QUERYID: -I grantTime -I [.][.][.] [0-9]* more <https://hudson.apache.org/hudson/job/Hive-trunk-h0.20/ws/hive/build/contrib/test/logs/contribclientpositive/udaf_example_min.q.out>
<https://hudson.apache.org/hudson/job/Hive-trunk-h0.20/ws/hive/contrib/src/test/results/clientpositive/udaf_example_min.q.out>
    [junit] Done query: udaf_example_min.q
    [junit] Begin query: udaf_example_min_n.q
    [junit] diff -a -I file: -I pfile: -I hdfs: -I /tmp/ -I invalidscheme: -I lastUpdateTime
-I lastAccessTime -I [Oo]wner -I CreateTime -I LastAccessTime -I Location -I transient_lastDdlTime
-I last_modified_ -I java.lang.RuntimeException -I at org -I at sun -I at java -I at junit
-I Caused by: -I LOCK_QUERYID: -I grantTime -I [.][.][.] [0-9]* more <https://hudson.apache.org/hudson/job/Hive-trunk-h0.20/ws/hive/build/contrib/test/logs/contribclientpositive/udaf_example_min_n.q.out>
<https://hudson.apache.org/hudson/job/Hive-trunk-h0.20/ws/hive/contrib/src/test/results/clientpositive/udaf_example_min_n.q.out>
    [junit] Done query: udaf_example_min_n.q
    [junit] Begin query: udf_example_add.q
    [junit] diff -a -I file: -I pfile: -I hdfs: -I /tmp/ -I invalidscheme: -I lastUpdateTime
-I lastAccessTime -I [Oo]wner -I CreateTime -I LastAccessTime -I Location -I transient_lastDdlTime
-I last_modified_ -I java.lang.RuntimeException -I at org -I at sun -I at java -I at junit
-I Caused by: -I LOCK_QUERYID: -I grantTime -I [.][.][.] [0-9]* more <https://hudson.apache.org/hudson/job/Hive-trunk-h0.20/ws/hive/build/contrib/test/logs/contribclientpositive/udf_example_add.q.out>
<https://hudson.apache.org/hudson/job/Hive-trunk-h0.20/ws/hive/contrib/src/test/results/clientpositive/udf_example_add.q.out>
    [junit] Done query: udf_example_add.q
    [junit] Begin query: udf_example_arraymapstruct.q
    [junit] diff -a -I file: -I pfile: -I hdfs: -I /tmp/ -I invalidscheme: -I lastUpdateTime
-I lastAccessTime -I [Oo]wner -I CreateTime -I LastAccessTime -I Location -I transient_lastDdlTime
-I last_modified_ -I java.lang.RuntimeException -I at org -I at sun -I at java -I at junit
-I Caused by: -I LOCK_QUERYID: -I grantTime -I [.][.][.] [0-9]* more <https://hudson.apache.org/hudson/job/Hive-trunk-h0.20/ws/hive/build/contrib/test/logs/contribclientpositive/udf_example_arraymapstruct.q.out>
<https://hudson.apache.org/hudson/job/Hive-trunk-h0.20/ws/hive/contrib/src/test/results/clientpositive/udf_example_arraymapstruct.q.out>
    [junit] Done query: udf_example_arraymapstruct.q
    [junit] Begin query: udf_example_format.q
    [junit] diff -a -I file: -I pfile: -I hdfs: -I /tmp/ -I invalidscheme: -I lastUpdateTime
-I lastAccessTime -I [Oo]wner -I CreateTime -I LastAccessTime -I Location -I transient_lastDdlTime
-I last_modified_ -I java.lang.RuntimeException -I at org -I at sun -I at java -I at junit
-I Caused by: -I LOCK_QUERYID: -I grantTime -I [.][.][.] [0-9]* more <https://hudson.apache.org/hudson/job/Hive-trunk-h0.20/ws/hive/build/contrib/test/logs/contribclientpositive/udf_example_format.q.out>
<https://hudson.apache.org/hudson/job/Hive-trunk-h0.20/ws/hive/contrib/src/test/results/clientpositive/udf_example_format.q.out>
    [junit] Done query: udf_example_format.q
    [junit] Begin query: udf_row_sequence.q
    [junit] diff -a -I file: -I pfile: -I hdfs: -I /tmp/ -I invalidscheme: -I lastUpdateTime
-I lastAccessTime -I [Oo]wner -I CreateTime -I LastAccessTime -I Location -I transient_lastDdlTime
-I last_modified_ -I java.lang.RuntimeException -I at org -I at sun -I at java -I at junit
-I Caused by: -I LOCK_QUERYID: -I grantTime -I [.][.][.] [0-9]* more <https://hudson.apache.org/hudson/job/Hive-trunk-h0.20/ws/hive/build/contrib/test/logs/contribclientpositive/udf_row_sequence.q.out>
<https://hudson.apache.org/hudson/job/Hive-trunk-h0.20/ws/hive/contrib/src/test/results/clientpositive/udf_row_sequence.q.out>
    [junit] Done query: udf_row_sequence.q
    [junit] Begin query: udtf_explode2.q
    [junit] diff -a -I file: -I pfile: -I hdfs: -I /tmp/ -I invalidscheme: -I lastUpdateTime
-I lastAccessTime -I [Oo]wner -I CreateTime -I LastAccessTime -I Location -I transient_lastDdlTime
-I last_modified_ -I java.lang.RuntimeException -I at org -I at sun -I at java -I at junit
-I Caused by: -I LOCK_QUERYID: -I grantTime -I [.][.][.] [0-9]* more <https://hudson.apache.org/hudson/job/Hive-trunk-h0.20/ws/hive/build/contrib/test/logs/contribclientpositive/udtf_explode2.q.out>
<https://hudson.apache.org/hudson/job/Hive-trunk-h0.20/ws/hive/contrib/src/test/results/clientpositive/udtf_explode2.q.out>
    [junit] Done query: udtf_explode2.q
    [junit] Begin query: udtf_output_on_close.q
    [junit] diff -a -I file: -I pfile: -I hdfs: -I /tmp/ -I invalidscheme: -I lastUpdateTime
-I lastAccessTime -I [Oo]wner -I CreateTime -I LastAccessTime -I Location -I transient_lastDdlTime
-I last_modified_ -I java.lang.RuntimeException -I at org -I at sun -I at java -I at junit
-I Caused by: -I LOCK_QUERYID: -I grantTime -I [.][.][.] [0-9]* more <https://hudson.apache.org/hudson/job/Hive-trunk-h0.20/ws/hive/build/contrib/test/logs/contribclientpositive/udtf_output_on_close.q.out>
<https://hudson.apache.org/hudson/job/Hive-trunk-h0.20/ws/hive/contrib/src/test/results/clientpositive/udtf_output_on_close.q.out>
    [junit] Done query: udtf_output_on_close.q
    [junit] Begin query: url_hook.q
    [junit] junit.framework.AssertionFailedError: Client Execution failed with error code
= 9
    [junit] See build/ql/tmp/hive.log, or try "ant test ... -Dtest.silent=false" to get more
logs.
    [junit] 	at junit.framework.Assert.fail(Assert.java:47)
    [junit] 	at org.apache.hadoop.hive.cli.TestContribCliDriver.testCliDriver_url_hook(TestContribCliDriver.java:1334)
    [junit] 	at sun.reflect.NativeMethodAccessorImpl.invoke0(Native Method)
    [junit] 	at sun.reflect.NativeMethodAccessorImpl.invoke(NativeMethodAccessorImpl.java:39)
    [junit] 	at sun.reflect.DelegatingMethodAccessorImpl.invoke(DelegatingMethodAccessorImpl.java:25)
    [junit] 	at java.lang.reflect.Method.invoke(Method.java:597)
    [junit] 	at junit.framework.TestCase.runTest(TestCase.java:154)
    [junit] 	at junit.framework.TestCase.runBare(TestCase.java:127)
    [junit] 	at junit.framework.TestResult$1.protect(TestResult.java:106)
    [junit] 	at junit.framework.TestResult.runProtected(TestResult.java:124)
    [junit] 	at junit.framework.TestResult.run(TestResult.java:109)
    [junit] 	at junit.framework.TestCase.run(TestCase.java:118)
    [junit] 	at junit.framework.TestSuite.runTest(TestSuite.java:208)
    [junit] 	at junit.framework.TestSuite.run(TestSuite.java:203)
    [junit] 	at org.apache.tools.ant.taskdefs.optional.junit.JUnitTestRunner.run(JUnitTestRunner.java:422)
    [junit] Exception: Client Execution failed with error code = 9
    [junit] 	at org.apache.tools.ant.taskdefs.optional.junit.JUnitTestRunner.launch(JUnitTestRunner.java:931)
    [junit] See build/ql/tmp/hive.log, or try "ant test ... -Dtest.silent=false" to get more
logs.
    [junit] 	at org.apache.tools.ant.taskdefs.optional.junit.JUnitTestRunner.main(JUnitTestRunner.java:785)
    [junit] Cleaning up TestContribCliDriver
    [junit] Tests run: 27, Failures: 1, Errors: 0, Time elapsed: 109.193 sec
    [junit] Test org.apache.hadoop.hive.cli.TestContribCliDriver FAILED
    [junit] Hive history file=<https://hudson.apache.org/hudson/job/Hive-trunk-h0.20/ws/hive/build/contrib/tmp/hive_job_log_hudson_201102021601_1554536559.txt>
    [junit] Hive history file=<https://hudson.apache.org/hudson/job/Hive-trunk-h0.20/ws/hive/build/contrib/tmp/hive_job_log_hudson_201102021601_9413646.txt>
    [junit] PREHOOK: query: LOAD DATA LOCAL INPATH '<https://hudson.apache.org/hudson/job/Hive-trunk-h0.20/ws/hive/data/files/kv1.txt'>
OVERWRITE INTO TABLE srcpart PARTITION (ds='2008-04-08',hr='11')
    [junit] PREHOOK: type: LOAD
    [junit] Copying data from <https://hudson.apache.org/hudson/job/Hive-trunk-h0.20/ws/hive/data/files/kv1.txt>
    [junit] Loading data to table srcpart partition (ds=2008-04-08, hr=11)
    [junit] POSTHOOK: query: LOAD DATA LOCAL INPATH '<https://hudson.apache.org/hudson/job/Hive-trunk-h0.20/ws/hive/data/files/kv1.txt'>
OVERWRITE INTO TABLE srcpart PARTITION (ds='2008-04-08',hr='11')
    [junit] POSTHOOK: type: LOAD
    [junit] POSTHOOK: Output: default@srcpart@ds=2008-04-08/hr=11
    [junit] OK
    [junit] PREHOOK: query: LOAD DATA LOCAL INPATH '<https://hudson.apache.org/hudson/job/Hive-trunk-h0.20/ws/hive/data/files/kv1.txt'>
OVERWRITE INTO TABLE srcpart PARTITION (ds='2008-04-08',hr='12')
    [junit] PREHOOK: type: LOAD
    [junit] Copying data from <https://hudson.apache.org/hudson/job/Hive-trunk-h0.20/ws/hive/data/files/kv1.txt>
    [junit] Loading data to table srcpart partition (ds=2008-04-08, hr=12)
    [junit] POSTHOOK: query: LOAD DATA LOCAL INPATH '<https://hudson.apache.org/hudson/job/Hive-trunk-h0.20/ws/hive/data/files/kv1.txt'>
OVERWRITE INTO TABLE srcpart PARTITION (ds='2008-04-08',hr='12')
    [junit] POSTHOOK: type: LOAD
    [junit] POSTHOOK: Output: default@srcpart@ds=2008-04-08/hr=12
    [junit] OK
    [junit] PREHOOK: query: LOAD DATA LOCAL INPATH '<https://hudson.apache.org/hudson/job/Hive-trunk-h0.20/ws/hive/data/files/kv1.txt'>
OVERWRITE INTO TABLE srcpart PARTITION (ds='2008-04-09',hr='11')
    [junit] PREHOOK: type: LOAD
    [junit] Copying data from <https://hudson.apache.org/hudson/job/Hive-trunk-h0.20/ws/hive/data/files/kv1.txt>
    [junit] Loading data to table srcpart partition (ds=2008-04-09, hr=11)
    [junit] POSTHOOK: query: LOAD DATA LOCAL INPATH '<https://hudson.apache.org/hudson/job/Hive-trunk-h0.20/ws/hive/data/files/kv1.txt'>
OVERWRITE INTO TABLE srcpart PARTITION (ds='2008-04-09',hr='11')
    [junit] POSTHOOK: type: LOAD
    [junit] POSTHOOK: Output: default@srcpart@ds=2008-04-09/hr=11
    [junit] OK
    [junit] PREHOOK: query: LOAD DATA LOCAL INPATH '<https://hudson.apache.org/hudson/job/Hive-trunk-h0.20/ws/hive/data/files/kv1.txt'>
OVERWRITE INTO TABLE srcpart PARTITION (ds='2008-04-09',hr='12')
    [junit] PREHOOK: type: LOAD
    [junit] Copying data from <https://hudson.apache.org/hudson/job/Hive-trunk-h0.20/ws/hive/data/files/kv1.txt>
    [junit] Loading data to table srcpart partition (ds=2008-04-09, hr=12)
    [junit] POSTHOOK: query: LOAD DATA LOCAL INPATH '<https://hudson.apache.org/hudson/job/Hive-trunk-h0.20/ws/hive/data/files/kv1.txt'>
OVERWRITE INTO TABLE srcpart PARTITION (ds='2008-04-09',hr='12')
    [junit] POSTHOOK: type: LOAD
    [junit] POSTHOOK: Output: default@srcpart@ds=2008-04-09/hr=12
    [junit] OK
    [junit] PREHOOK: query: CREATE TABLE srcbucket(key int, value string) CLUSTERED BY (key)
INTO 2 BUCKETS STORED AS TEXTFILE
    [junit] PREHOOK: type: CREATETABLE
    [junit] POSTHOOK: query: CREATE TABLE srcbucket(key int, value string) CLUSTERED BY (key)
INTO 2 BUCKETS STORED AS TEXTFILE
    [junit] POSTHOOK: type: CREATETABLE
    [junit] POSTHOOK: Output: default@srcbucket
    [junit] OK
    [junit] PREHOOK: query: LOAD DATA LOCAL INPATH '<https://hudson.apache.org/hudson/job/Hive-trunk-h0.20/ws/hive/data/files/srcbucket0.txt'>
INTO TABLE srcbucket
    [junit] PREHOOK: type: LOAD
    [junit] Copying data from <https://hudson.apache.org/hudson/job/Hive-trunk-h0.20/ws/hive/data/files/srcbucket0.txt>
    [junit] Loading data to table srcbucket
    [junit] POSTHOOK: query: LOAD DATA LOCAL INPATH '<https://hudson.apache.org/hudson/job/Hive-trunk-h0.20/ws/hive/data/files/srcbucket0.txt'>
INTO TABLE srcbucket
    [junit] POSTHOOK: type: LOAD
    [junit] POSTHOOK: Output: default@srcbucket
    [junit] OK
    [junit] PREHOOK: query: LOAD DATA LOCAL INPATH '<https://hudson.apache.org/hudson/job/Hive-trunk-h0.20/ws/hive/data/files/srcbucket1.txt'>
INTO TABLE srcbucket
    [junit] PREHOOK: type: LOAD
    [junit] Copying data from <https://hudson.apache.org/hudson/job/Hive-trunk-h0.20/ws/hive/data/files/srcbucket1.txt>
    [junit] Loading data to table srcbucket
    [junit] POSTHOOK: query: LOAD DATA LOCAL INPATH '<https://hudson.apache.org/hudson/job/Hive-trunk-h0.20/ws/hive/data/files/srcbucket1.txt'>
INTO TABLE srcbucket
    [junit] POSTHOOK: type: LOAD
    [junit] POSTHOOK: Output: default@srcbucket
    [junit] OK
    [junit] PREHOOK: query: CREATE TABLE srcbucket2(key int, value string) CLUSTERED BY (key)
INTO 4 BUCKETS STORED AS TEXTFILE
    [junit] PREHOOK: type: CREATETABLE
    [junit] POSTHOOK: query: CREATE TABLE srcbucket2(key int, value string) CLUSTERED BY (key)
INTO 4 BUCKETS STORED AS TEXTFILE
    [junit] POSTHOOK: type: CREATETABLE
    [junit] POSTHOOK: Output: default@srcbucket2
    [junit] OK
    [junit] PREHOOK: query: LOAD DATA LOCAL INPATH '<https://hudson.apache.org/hudson/job/Hive-trunk-h0.20/ws/hive/data/files/srcbucket20.txt'>
INTO TABLE srcbucket2
    [junit] PREHOOK: type: LOAD
    [junit] Copying data from <https://hudson.apache.org/hudson/job/Hive-trunk-h0.20/ws/hive/data/files/srcbucket20.txt>
    [junit] Loading data to table srcbucket2
    [junit] POSTHOOK: query: LOAD DATA LOCAL INPATH '<https://hudson.apache.org/hudson/job/Hive-trunk-h0.20/ws/hive/data/files/srcbucket20.txt'>
INTO TABLE srcbucket2
    [junit] POSTHOOK: type: LOAD
    [junit] POSTHOOK: Output: default@srcbucket2
    [junit] OK
    [junit] PREHOOK: query: LOAD DATA LOCAL INPATH '<https://hudson.apache.org/hudson/job/Hive-trunk-h0.20/ws/hive/data/files/srcbucket21.txt'>
INTO TABLE srcbucket2
    [junit] PREHOOK: type: LOAD
    [junit] Copying data from <https://hudson.apache.org/hudson/job/Hive-trunk-h0.20/ws/hive/data/files/srcbucket21.txt>
    [junit] Loading data to table srcbucket2
    [junit] POSTHOOK: query: LOAD DATA LOCAL INPATH '<https://hudson.apache.org/hudson/job/Hive-trunk-h0.20/ws/hive/data/files/srcbucket21.txt'>
INTO TABLE srcbucket2
    [junit] POSTHOOK: type: LOAD
    [junit] POSTHOOK: Output: default@srcbucket2
    [junit] OK
    [junit] PREHOOK: query: LOAD DATA LOCAL INPATH '<https://hudson.apache.org/hudson/job/Hive-trunk-h0.20/ws/hive/data/files/srcbucket22.txt'>
INTO TABLE srcbucket2
    [junit] PREHOOK: type: LOAD
    [junit] Copying data from <https://hudson.apache.org/hudson/job/Hive-trunk-h0.20/ws/hive/data/files/srcbucket22.txt>
    [junit] Loading data to table srcbucket2
    [junit] POSTHOOK: query: LOAD DATA LOCAL INPATH '<https://hudson.apache.org/hudson/job/Hive-trunk-h0.20/ws/hive/data/files/srcbucket22.txt'>
INTO TABLE srcbucket2
    [junit] POSTHOOK: type: LOAD
    [junit] POSTHOOK: Output: default@srcbucket2
    [junit] OK
    [junit] PREHOOK: query: LOAD DATA LOCAL INPATH '<https://hudson.apache.org/hudson/job/Hive-trunk-h0.20/ws/hive/data/files/srcbucket23.txt'>
INTO TABLE srcbucket2
    [junit] PREHOOK: type: LOAD
    [junit] Copying data from <https://hudson.apache.org/hudson/job/Hive-trunk-h0.20/ws/hive/data/files/srcbucket23.txt>
    [junit] Loading data to table srcbucket2
    [junit] POSTHOOK: query: LOAD DATA LOCAL INPATH '<https://hudson.apache.org/hudson/job/Hive-trunk-h0.20/ws/hive/data/files/srcbucket23.txt'>
INTO TABLE srcbucket2
    [junit] POSTHOOK: type: LOAD
    [junit] POSTHOOK: Output: default@srcbucket2
    [junit] OK
    [junit] PREHOOK: query: LOAD DATA LOCAL INPATH '<https://hudson.apache.org/hudson/job/Hive-trunk-h0.20/ws/hive/data/files/kv1.txt'>
INTO TABLE src
    [junit] PREHOOK: type: LOAD
    [junit] Copying data from <https://hudson.apache.org/hudson/job/Hive-trunk-h0.20/ws/hive/data/files/kv1.txt>
    [junit] Loading data to table src
    [junit] POSTHOOK: query: LOAD DATA LOCAL INPATH '<https://hudson.apache.org/hudson/job/Hive-trunk-h0.20/ws/hive/data/files/kv1.txt'>
INTO TABLE src
    [junit] POSTHOOK: type: LOAD
    [junit] POSTHOOK: Output: default@src
    [junit] OK
    [junit] PREHOOK: query: LOAD DATA LOCAL INPATH '<https://hudson.apache.org/hudson/job/Hive-trunk-h0.20/ws/hive/data/files/kv3.txt'>
INTO TABLE src1
    [junit] PREHOOK: type: LOAD
    [junit] Copying data from <https://hudson.apache.org/hudson/job/Hive-trunk-h0.20/ws/hive/data/files/kv3.txt>
    [junit] Loading data to table src1
    [junit] POSTHOOK: query: LOAD DATA LOCAL INPATH '<https://hudson.apache.org/hudson/job/Hive-trunk-h0.20/ws/hive/data/files/kv3.txt'>
INTO TABLE src1
    [junit] POSTHOOK: type: LOAD
    [junit] POSTHOOK: Output: default@src1
    [junit] OK
    [junit] PREHOOK: query: LOAD DATA LOCAL INPATH '<https://hudson.apache.org/hudson/job/Hive-trunk-h0.20/ws/hive/data/files/kv1.seq'>
INTO TABLE src_sequencefile
    [junit] PREHOOK: type: LOAD
    [junit] Copying data from <https://hudson.apache.org/hudson/job/Hive-trunk-h0.20/ws/hive/data/files/kv1.seq>
    [junit] Loading data to table src_sequencefile
    [junit] POSTHOOK: query: LOAD DATA LOCAL INPATH '<https://hudson.apache.org/hudson/job/Hive-trunk-h0.20/ws/hive/data/files/kv1.seq'>
INTO TABLE src_sequencefile
    [junit] POSTHOOK: type: LOAD
    [junit] POSTHOOK: Output: default@src_sequencefile
    [junit] OK
    [junit] PREHOOK: query: LOAD DATA LOCAL INPATH '<https://hudson.apache.org/hudson/job/Hive-trunk-h0.20/ws/hive/data/files/complex.seq'>
INTO TABLE src_thrift
    [junit] PREHOOK: type: LOAD
    [junit] Copying data from <https://hudson.apache.org/hudson/job/Hive-trunk-h0.20/ws/hive/data/files/complex.seq>
    [junit] Loading data to table src_thrift
    [junit] POSTHOOK: query: LOAD DATA LOCAL INPATH '<https://hudson.apache.org/hudson/job/Hive-trunk-h0.20/ws/hive/data/files/complex.seq'>
INTO TABLE src_thrift
    [junit] POSTHOOK: type: LOAD
    [junit] POSTHOOK: Output: default@src_thrift
    [junit] OK
    [junit] PREHOOK: query: LOAD DATA LOCAL INPATH '<https://hudson.apache.org/hudson/job/Hive-trunk-h0.20/ws/hive/data/files/json.txt'>
INTO TABLE src_json
    [junit] PREHOOK: type: LOAD
    [junit] Copying data from <https://hudson.apache.org/hudson/job/Hive-trunk-h0.20/ws/hive/data/files/json.txt>
    [junit] Loading data to table src_json
    [junit] Running org.apache.hadoop.hive.cli.TestContribNegativeCliDriver
    [junit] POSTHOOK: query: LOAD DATA LOCAL INPATH '<https://hudson.apache.org/hudson/job/Hive-trunk-h0.20/ws/hive/data/files/json.txt'>
INTO TABLE src_json
    [junit] POSTHOOK: type: LOAD
    [junit] POSTHOOK: Output: default@src_json
    [junit] OK
    [junit] Begin query: serde_regex.q
    [junit] diff -a -I file: -I pfile: -I hdfs: -I /tmp/ -I invalidscheme: -I lastUpdateTime
-I lastAccessTime -I [Oo]wner -I CreateTime -I LastAccessTime -I Location -I transient_lastDdlTime
-I last_modified_ -I java.lang.RuntimeException -I at org -I at sun -I at java -I at junit
-I Caused by: -I LOCK_QUERYID: -I grantTime -I [.][.][.] [0-9]* more <https://hudson.apache.org/hudson/job/Hive-trunk-h0.20/ws/hive/build/contrib/test/logs/contribclientnegative/serde_regex.q.out>
<https://hudson.apache.org/hudson/job/Hive-trunk-h0.20/ws/hive/contrib/src/test/results/clientnegative/serde_regex.q.out>
    [junit] Done query: serde_regex.q
    [junit] Begin query: udtf_explode2.q
    [junit] diff -a -I file: -I pfile: -I hdfs: -I /tmp/ -I invalidscheme: -I lastUpdateTime
-I lastAccessTime -I [Oo]wner -I CreateTime -I LastAccessTime -I Location -I transient_lastDdlTime
-I last_modified_ -I java.lang.RuntimeException -I at org -I at sun -I at java -I at junit
-I Caused by: -I LOCK_QUERYID: -I grantTime -I [.][.][.] [0-9]* more <https://hudson.apache.org/hudson/job/Hive-trunk-h0.20/ws/hive/build/contrib/test/logs/contribclientnegative/udtf_explode2.q.out>
<https://hudson.apache.org/hudson/job/Hive-trunk-h0.20/ws/hive/contrib/src/test/results/clientnegative/udtf_explode2.q.out>
    [junit] Done query: udtf_explode2.q
    [junit] Cleaning up TestContribNegativeCliDriver
    [junit] Tests run: 3, Failures: 0, Errors: 0, Time elapsed: 2.017 sec
    [junit] Running org.apache.hadoop.hive.contrib.mr.TestGenericMR
    [junit] Tests run: 6, Failures: 0, Errors: 0, Time elapsed: 0.063 sec
    [junit] Running org.apache.hadoop.hive.contrib.serde2.TestRegexSerDe
    [junit] Deserialized row: [127.0.0.1, -, -, [26/May/2009:00:00:00 +0000], "GET /someurl/?track=Blabla(Main)
HTTP/1.1", 200, 5864, -, "Mozilla/5.0 (Windows; U; Windows NT 6.0; en-US) AppleWebKit/525.19
(KHTML, like Gecko) Chrome/1.0.154.65 Safari/525.19"]
    [junit] Tests run: 1, Failures: 0, Errors: 0, Time elapsed: 0.214 sec
    [junit] Running org.apache.hadoop.hive.ql.parse.TestContribParse
    [junit] Hive history file=<https://hudson.apache.org/hudson/job/Hive-trunk-h0.20/ws/hive/build/contrib/tmp/hive_job_log_hudson_201102021601_196226777.txt>
    [junit] Cleaning up TestContribParse
    [junit] Tests run: 1, Failures: 0, Errors: 0, Time elapsed: 3.705 sec
    [junit] Running org.apache.hadoop.hive.ql.parse.TestContribParseNegative
    [junit] Hive history file=<https://hudson.apache.org/hudson/job/Hive-trunk-h0.20/ws/hive/build/contrib/tmp/hive_job_log_hudson_201102021601_896091532.txt>
    [junit] Cleaning up TestContribParseNegative
    [junit] Tests run: 1, Failures: 0, Errors: 0, Time elapsed: 3.597 sec

BUILD FAILED
<https://hudson.apache.org/hudson/job/Hive-trunk-h0.20/ws/hive/build.xml>:213: The following
error occurred while executing this line:
<https://hudson.apache.org/hudson/job/Hive-trunk-h0.20/ws/hive/build.xml>:122: The following
error occurred while executing this line:
<https://hudson.apache.org/hudson/job/Hive-trunk-h0.20/ws/hive/build-common.xml>:454:
Tests failed!

Total time: 180 minutes 8 seconds
Archiving artifacts
Recording test results


Mime
View raw message