hive-dev mailing list archives

Site index · List index
Message view « Date » · « Thread »
Top « Date » · « Thread »
From Apache Hudson Server <hud...@hudson.apache.org>
Subject Build failed in Hudson: Hive-0.7.0-h0.20 #6
Date Thu, 17 Feb 2011 11:43:31 GMT
See <https://hudson.apache.org/hudson/job/Hive-0.7.0-h0.20/6/changes>

Changes:

[cws] HIVE-1928 GRANT/REVOKE should handle privileges as tokens, not identifiers (Jonathan
Natkins via cws)

------------------------------------------
[...truncated 14114 lines...]
    [junit] 	at java.lang.reflect.Method.invoke(Method.java:597)
    [junit] 	at junit.framework.TestCase.runTest(TestCase.java:154)
    [junit] 	at junit.framework.TestCase.runBare(TestCase.java:127)
    [junit] 	at junit.framework.TestResult$1.protect(TestResult.java:106)
    [junit] 	at junit.framework.TestResult.runProtected(TestResult.java:124)
    [junit] 	at junit.framework.TestResult.run(TestResult.java:109)
    [junit] 	at junit.framework.TestCase.run(TestCase.java:118)
    [junit] 	at junit.framework.TestSuite.runTest(TestSuite.java:208)
    [junit] 	at junit.framework.TestSuite.run(TestSuite.java:203)
    [junit] 	at org.apache.tools.ant.taskdefs.optional.junit.JUnitTestRunner.run(JUnitTestRunner.java:422)
    [junit] 	at org.apache.tools.ant.taskdefs.optional.junit.JUnitTestRunner.launch(JUnitTestRunner.java:931)
    [junit] 	at org.apache.tools.ant.taskdefs.optional.junit.JUnitTestRunner.main(JUnitTestRunner.java:785)
    [junit] diff -a -I file: -I pfile: -I hdfs: -I /tmp/ -I invalidscheme: -I lastUpdateTime
-I lastAccessTime -I [Oo]wner -I CreateTime -I LastAccessTime -I Location -I transient_lastDdlTime
-I last_modified_ -I java.lang.RuntimeException -I at org -I at sun -I at java -I at junit
-I Caused by: -I LOCK_QUERYID: -I grantTime -I [.][.][.] [0-9]* more -I USING 'java -cp <https://hudson.apache.org/hudson/job/Hive-0.7.0-h0.20/ws/hive/build/ql/test/logs/clientnegative/autolocal1.q.out>
<https://hudson.apache.org/hudson/job/Hive-0.7.0-h0.20/ws/hive/ql/src/test/results/clientnegative/autolocal1.q.out>
    [junit] Done query: autolocal1.q
    [junit] Begin query: bad_exec_hooks.q
    [junit] diff -a -I file: -I pfile: -I hdfs: -I /tmp/ -I invalidscheme: -I lastUpdateTime
-I lastAccessTime -I [Oo]wner -I CreateTime -I LastAccessTime -I Location -I transient_lastDdlTime
-I last_modified_ -I java.lang.RuntimeException -I at org -I at sun -I at java -I at junit
-I Caused by: -I LOCK_QUERYID: -I grantTime -I [.][.][.] [0-9]* more -I USING 'java -cp <https://hudson.apache.org/hudson/job/Hive-0.7.0-h0.20/ws/hive/build/ql/test/logs/clientnegative/bad_exec_hooks.q.out>
<https://hudson.apache.org/hudson/job/Hive-0.7.0-h0.20/ws/hive/ql/src/test/results/clientnegative/bad_exec_hooks.q.out>
    [junit] Done query: bad_exec_hooks.q
    [junit] Begin query: bad_indextype.q
    [junit] diff -a -I file: -I pfile: -I hdfs: -I /tmp/ -I invalidscheme: -I lastUpdateTime
-I lastAccessTime -I [Oo]wner -I CreateTime -I LastAccessTime -I Location -I transient_lastDdlTime
-I last_modified_ -I java.lang.RuntimeException -I at org -I at sun -I at java -I at junit
-I Caused by: -I LOCK_QUERYID: -I grantTime -I [.][.][.] [0-9]* more -I USING 'java -cp <https://hudson.apache.org/hudson/job/Hive-0.7.0-h0.20/ws/hive/build/ql/test/logs/clientnegative/bad_indextype.q.out>
<https://hudson.apache.org/hudson/job/Hive-0.7.0-h0.20/ws/hive/ql/src/test/results/clientnegative/bad_indextype.q.out>
    [junit] Done query: bad_indextype.q
    [junit] Begin query: bad_sample_clause.q
    [junit] diff -a -I file: -I pfile: -I hdfs: -I /tmp/ -I invalidscheme: -I lastUpdateTime
-I lastAccessTime -I [Oo]wner -I CreateTime -I LastAccessTime -I Location -I transient_lastDdlTime
-I last_modified_ -I java.lang.RuntimeException -I at org -I at sun -I at java -I at junit
-I Caused by: -I LOCK_QUERYID: -I grantTime -I [.][.][.] [0-9]* more -I USING 'java -cp <https://hudson.apache.org/hudson/job/Hive-0.7.0-h0.20/ws/hive/build/ql/test/logs/clientnegative/bad_sample_clause.q.out>
<https://hudson.apache.org/hudson/job/Hive-0.7.0-h0.20/ws/hive/ql/src/test/results/clientnegative/bad_sample_clause.q.out>
    [junit] Done query: bad_sample_clause.q
    [junit] Begin query: clusterbydistributeby.q
    [junit] diff -a -I file: -I pfile: -I hdfs: -I /tmp/ -I invalidscheme: -I lastUpdateTime
-I lastAccessTime -I [Oo]wner -I CreateTime -I LastAccessTime -I Location -I transient_lastDdlTime
-I last_modified_ -I java.lang.RuntimeException -I at org -I at sun -I at java -I at junit
-I Caused by: -I LOCK_QUERYID: -I grantTime -I [.][.][.] [0-9]* more -I USING 'java -cp <https://hudson.apache.org/hudson/job/Hive-0.7.0-h0.20/ws/hive/build/ql/test/logs/clientnegative/clusterbydistributeby.q.out>
<https://hudson.apache.org/hudson/job/Hive-0.7.0-h0.20/ws/hive/ql/src/test/results/clientnegative/clusterbydistributeby.q.out>
    [junit] Done query: clusterbydistributeby.q
    [junit] Begin query: clusterbyorderby.q
    [junit] diff -a -I file: -I pfile: -I hdfs: -I /tmp/ -I invalidscheme: -I lastUpdateTime
-I lastAccessTime -I [Oo]wner -I CreateTime -I LastAccessTime -I Location -I transient_lastDdlTime
-I last_modified_ -I java.lang.RuntimeException -I at org -I at sun -I at java -I at junit
-I Caused by: -I LOCK_QUERYID: -I grantTime -I [.][.][.] [0-9]* more -I USING 'java -cp <https://hudson.apache.org/hudson/job/Hive-0.7.0-h0.20/ws/hive/build/ql/test/logs/clientnegative/clusterbyorderby.q.out>
<https://hudson.apache.org/hudson/job/Hive-0.7.0-h0.20/ws/hive/ql/src/test/results/clientnegative/clusterbyorderby.q.out>
    [junit] Done query: clusterbyorderby.q
    [junit] Begin query: clusterbysortby.q
    [junit] diff -a -I file: -I pfile: -I hdfs: -I /tmp/ -I invalidscheme: -I lastUpdateTime
-I lastAccessTime -I [Oo]wner -I CreateTime -I LastAccessTime -I Location -I transient_lastDdlTime
-I last_modified_ -I java.lang.RuntimeException -I at org -I at sun -I at java -I at junit
-I Caused by: -I LOCK_QUERYID: -I grantTime -I [.][.][.] [0-9]* more -I USING 'java -cp <https://hudson.apache.org/hudson/job/Hive-0.7.0-h0.20/ws/hive/build/ql/test/logs/clientnegative/clusterbysortby.q.out>
<https://hudson.apache.org/hudson/job/Hive-0.7.0-h0.20/ws/hive/ql/src/test/results/clientnegative/clusterbysortby.q.out>
    [junit] Done query: clusterbysortby.q
    [junit] Begin query: clustern1.q
    [junit] diff -a -I file: -I pfile: -I hdfs: -I /tmp/ -I invalidscheme: -I lastUpdateTime
-I lastAccessTime -I [Oo]wner -I CreateTime -I LastAccessTime -I Location -I transient_lastDdlTime
-I last_modified_ -I java.lang.RuntimeException -I at org -I at sun -I at java -I at junit
-I Caused by: -I LOCK_QUERYID: -I grantTime -I [.][.][.] [0-9]* more -I USING 'java -cp <https://hudson.apache.org/hudson/job/Hive-0.7.0-h0.20/ws/hive/build/ql/test/logs/clientnegative/clustern1.q.out>
<https://hudson.apache.org/hudson/job/Hive-0.7.0-h0.20/ws/hive/ql/src/test/results/clientnegative/clustern1.q.out>
    [junit] Done query: clustern1.q
    [junit] Begin query: clustern2.q
    [junit] diff -a -I file: -I pfile: -I hdfs: -I /tmp/ -I invalidscheme: -I lastUpdateTime
-I lastAccessTime -I [Oo]wner -I CreateTime -I LastAccessTime -I Location -I transient_lastDdlTime
-I last_modified_ -I java.lang.RuntimeException -I at org -I at sun -I at java -I at junit
-I Caused by: -I LOCK_QUERYID: -I grantTime -I [.][.][.] [0-9]* more -I USING 'java -cp <https://hudson.apache.org/hudson/job/Hive-0.7.0-h0.20/ws/hive/build/ql/test/logs/clientnegative/clustern2.q.out>
<https://hudson.apache.org/hudson/job/Hive-0.7.0-h0.20/ws/hive/ql/src/test/results/clientnegative/clustern2.q.out>
    [junit] Done query: clustern2.q
    [junit] Begin query: clustern3.q
    [junit] diff -a -I file: -I pfile: -I hdfs: -I /tmp/ -I invalidscheme: -I lastUpdateTime
-I lastAccessTime -I [Oo]wner -I CreateTime -I LastAccessTime -I Location -I transient_lastDdlTime
-I last_modified_ -I java.lang.RuntimeException -I at org -I at sun -I at java -I at junit
-I Caused by: -I LOCK_QUERYID: -I grantTime -I [.][.][.] [0-9]* more -I USING 'java -cp <https://hudson.apache.org/hudson/job/Hive-0.7.0-h0.20/ws/hive/build/ql/test/logs/clientnegative/clustern3.q.out>
<https://hudson.apache.org/hudson/job/Hive-0.7.0-h0.20/ws/hive/ql/src/test/results/clientnegative/clustern3.q.out>
    [junit] Done query: clustern3.q
    [junit] Begin query: clustern4.q
    [junit] diff -a -I file: -I pfile: -I hdfs: -I /tmp/ -I invalidscheme: -I lastUpdateTime
-I lastAccessTime -I [Oo]wner -I CreateTime -I LastAccessTime -I Location -I transient_lastDdlTime
-I last_modified_ -I java.lang.RuntimeException -I at org -I at sun -I at java -I at junit
-I Caused by: -I LOCK_QUERYID: -I grantTime -I [.][.][.] [0-9]* more -I USING 'java -cp <https://hudson.apache.org/hudson/job/Hive-0.7.0-h0.20/ws/hive/build/ql/test/logs/clientnegative/clustern4.q.out>
<https://hudson.apache.org/hudson/job/Hive-0.7.0-h0.20/ws/hive/ql/src/test/results/clientnegative/clustern4.q.out>
    [junit] Done query: clustern4.q
    [junit] Begin query: column_rename1.q
    [junit] Deleted <https://hudson.apache.org/hudson/job/Hive-0.7.0-h0.20/ws/hive/build/ql/test/data/warehouse/tstsrc>
    [junit] diff -a -I file: -I pfile: -I hdfs: -I /tmp/ -I invalidscheme: -I lastUpdateTime
-I lastAccessTime -I [Oo]wner -I CreateTime -I LastAccessTime -I Location -I transient_lastDdlTime
-I last_modified_ -I java.lang.RuntimeException -I at org -I at sun -I at java -I at junit
-I Caused by: -I LOCK_QUERYID: -I grantTime -I [.][.][.] [0-9]* more -I USING 'java -cp <https://hudson.apache.org/hudson/job/Hive-0.7.0-h0.20/ws/hive/build/ql/test/logs/clientnegative/column_rename1.q.out>
<https://hudson.apache.org/hudson/job/Hive-0.7.0-h0.20/ws/hive/ql/src/test/results/clientnegative/column_rename1.q.out>
    [junit] Done query: column_rename1.q
    [junit] Begin query: column_rename2.q
    [junit] Deleted <https://hudson.apache.org/hudson/job/Hive-0.7.0-h0.20/ws/hive/build/ql/test/data/warehouse/tstsrc>
    [junit] diff -a -I file: -I pfile: -I hdfs: -I /tmp/ -I invalidscheme: -I lastUpdateTime
-I lastAccessTime -I [Oo]wner -I CreateTime -I LastAccessTime -I Location -I transient_lastDdlTime
-I last_modified_ -I java.lang.RuntimeException -I at org -I at sun -I at java -I at junit
-I Caused by: -I LOCK_QUERYID: -I grantTime -I [.][.][.] [0-9]* more -I USING 'java -cp <https://hudson.apache.org/hudson/job/Hive-0.7.0-h0.20/ws/hive/build/ql/test/logs/clientnegative/column_rename2.q.out>
<https://hudson.apache.org/hudson/job/Hive-0.7.0-h0.20/ws/hive/ql/src/test/results/clientnegative/column_rename2.q.out>
    [junit] Done query: column_rename2.q
    [junit] Begin query: column_rename3.q
    [junit] diff -a -I file: -I pfile: -I hdfs: -I /tmp/ -I invalidscheme: -I lastUpdateTime
-I lastAccessTime -I [Oo]wner -I CreateTime -I LastAccessTime -I Location -I transient_lastDdlTime
-I last_modified_ -I java.lang.RuntimeException -I at org -I at sun -I at java -I at junit
-I Caused by: -I LOCK_QUERYID: -I grantTime -I [.][.][.] [0-9]* more -I USING 'java -cp <https://hudson.apache.org/hudson/job/Hive-0.7.0-h0.20/ws/hive/build/ql/test/logs/clientnegative/column_rename3.q.out>
<https://hudson.apache.org/hudson/job/Hive-0.7.0-h0.20/ws/hive/ql/src/test/results/clientnegative/column_rename3.q.out>
    [junit] Done query: column_rename3.q
    [junit] Begin query: column_rename4.q
    [junit] Deleted <https://hudson.apache.org/hudson/job/Hive-0.7.0-h0.20/ws/hive/build/ql/test/data/warehouse/tstsrc>
    [junit] diff -a -I file: -I pfile: -I hdfs: -I /tmp/ -I invalidscheme: -I lastUpdateTime
-I lastAccessTime -I [Oo]wner -I CreateTime -I LastAccessTime -I Location -I transient_lastDdlTime
-I last_modified_ -I java.lang.RuntimeException -I at org -I at sun -I at java -I at junit
-I Caused by: -I LOCK_QUERYID: -I grantTime -I [.][.][.] [0-9]* more -I USING 'java -cp <https://hudson.apache.org/hudson/job/Hive-0.7.0-h0.20/ws/hive/build/ql/test/logs/clientnegative/column_rename4.q.out>
<https://hudson.apache.org/hudson/job/Hive-0.7.0-h0.20/ws/hive/ql/src/test/results/clientnegative/column_rename4.q.out>
    [junit] Done query: column_rename4.q
    [junit] Begin query: create_insert_outputformat.q
    [junit] diff -a -I file: -I pfile: -I hdfs: -I /tmp/ -I invalidscheme: -I lastUpdateTime
-I lastAccessTime -I [Oo]wner -I CreateTime -I LastAccessTime -I Location -I transient_lastDdlTime
-I last_modified_ -I java.lang.RuntimeException -I at org -I at sun -I at java -I at junit
-I Caused by: -I LOCK_QUERYID: -I grantTime -I [.][.][.] [0-9]* more -I USING 'java -cp <https://hudson.apache.org/hudson/job/Hive-0.7.0-h0.20/ws/hive/build/ql/test/logs/clientnegative/create_insert_outputformat.q.out>
<https://hudson.apache.org/hudson/job/Hive-0.7.0-h0.20/ws/hive/ql/src/test/results/clientnegative/create_insert_outputformat.q.out>
    [junit] Done query: create_insert_outputformat.q
    [junit] Begin query: create_udaf_failure.q
    [junit] diff -a -I file: -I pfile: -I hdfs: -I /tmp/ -I invalidscheme: -I lastUpdateTime
-I lastAccessTime -I [Oo]wner -I CreateTime -I LastAccessTime -I Location -I transient_lastDdlTime
-I last_modified_ -I java.lang.RuntimeException -I at org -I at sun -I at java -I at junit
-I Caused by: -I LOCK_QUERYID: -I grantTime -I [.][.][.] [0-9]* more -I USING 'java -cp <https://hudson.apache.org/hudson/job/Hive-0.7.0-h0.20/ws/hive/build/ql/test/logs/clientnegative/create_udaf_failure.q.out>
<https://hudson.apache.org/hudson/job/Hive-0.7.0-h0.20/ws/hive/ql/src/test/results/clientnegative/create_udaf_failure.q.out>
    [junit] Done query: create_udaf_failure.q
    [junit] Begin query: create_unknown_genericudf.q
    [junit] diff -a -I file: -I pfile: -I hdfs: -I /tmp/ -I invalidscheme: -I lastUpdateTime
-I lastAccessTime -I [Oo]wner -I CreateTime -I LastAccessTime -I Location -I transient_lastDdlTime
-I last_modified_ -I java.lang.RuntimeException -I at org -I at sun -I at java -I at junit
-I Caused by: -I LOCK_QUERYID: -I grantTime -I [.][.][.] [0-9]* more -I USING 'java -cp <https://hudson.apache.org/hudson/job/Hive-0.7.0-h0.20/ws/hive/build/ql/test/logs/clientnegative/create_unknown_genericudf.q.out>
<https://hudson.apache.org/hudson/job/Hive-0.7.0-h0.20/ws/hive/ql/src/test/results/clientnegative/create_unknown_genericudf.q.out>
    [junit] Done query: create_unknown_genericudf.q
    [junit] Begin query: create_unknown_udf_udaf.q
    [junit] diff -a -I file: -I pfile: -I hdfs: -I /tmp/ -I invalidscheme: -I lastUpdateTime
-I lastAccessTime -I [Oo]wner -I CreateTime -I LastAccessTime -I Location -I transient_lastDdlTime
-I last_modified_ -I java.lang.RuntimeException -I at org -I at sun -I at java -I at junit
-I Caused by: -I LOCK_QUERYID: -I grantTime -I [.][.][.] [0-9]* more -I USING 'java -cp <https://hudson.apache.org/hudson/job/Hive-0.7.0-h0.20/ws/hive/build/ql/test/logs/clientnegative/create_unknown_udf_udaf.q.out>
<https://hudson.apache.org/hudson/job/Hive-0.7.0-h0.20/ws/hive/ql/src/test/results/clientnegative/create_unknown_udf_udaf.q.out>
    [junit] Done query: create_unknown_udf_udaf.q
    [junit] Begin query: create_view_failure1.q
    [junit] diff -a -I file: -I pfile: -I hdfs: -I /tmp/ -I invalidscheme: -I lastUpdateTime
-I lastAccessTime -I [Oo]wner -I CreateTime -I LastAccessTime -I Location -I transient_lastDdlTime
-I last_modified_ -I java.lang.RuntimeException -I at org -I at sun -I at java -I at junit
-I Caused by: -I LOCK_QUERYID: -I grantTime -I [.][.][.] [0-9]* more -I USING 'java -cp <https://hudson.apache.org/hudson/job/Hive-0.7.0-h0.20/ws/hive/build/ql/test/logs/clientnegative/create_view_failure1.q.out>
<https://hudson.apache.org/hudson/job/Hive-0.7.0-h0.20/ws/hive/ql/src/test/results/clientnegative/create_view_failure1.q.out>
    [junit] Done query: create_view_failure1.q
    [junit] Begin query: create_view_failure2.q
    [junit] diff -a -I file: -I pfile: -I hdfs: -I /tmp/ -I invalidscheme: -I lastUpdateTime
-I lastAccessTime -I [Oo]wner -I CreateTime -I LastAccessTime -I Location -I transient_lastDdlTime
-I last_modified_ -I java.lang.RuntimeException -I at org -I at sun -I at java -I at junit
-I Caused by: -I LOCK_QUERYID: -I grantTime -I [.][.][.] [0-9]* more -I USING 'java -cp <https://hudson.apache.org/hudson/job/Hive-0.7.0-h0.20/ws/hive/build/ql/test/logs/clientnegative/create_view_failure2.q.out>
<https://hudson.apache.org/hudson/job/Hive-0.7.0-h0.20/ws/hive/ql/src/test/results/clientnegative/create_view_failure2.q.out>
    [junit] Done query: create_view_failure2.q
    [junit] Begin query: create_view_failure3.q
    [junit] diff -a -I file: -I pfile: -I hdfs: -I /tmp/ -I invalidscheme: -I lastUpdateTime
-I lastAccessTime -I [Oo]wner -I CreateTime -I LastAccessTime -I Location -I transient_lastDdlTime
-I last_modified_ -I java.lang.RuntimeException -I at org -I at sun -I at java -I at junit
-I Caused by: -I LOCK_QUERYID: -I grantTime -I [.][.][.] [0-9]* more -I USING 'java -cp <https://hudson.apache.org/hudson/job/Hive-0.7.0-h0.20/ws/hive/build/ql/test/logs/clientnegative/create_view_failure3.q.out>
<https://hudson.apache.org/hudson/job/Hive-0.7.0-h0.20/ws/hive/ql/src/test/results/clientnegative/create_view_failure3.q.out>
    [junit] Done query: create_view_failure3.q
    [junit] Begin query: create_view_failure4.q
    [junit] diff -a -I file: -I pfile: -I hdfs: -I /tmp/ -I invalidscheme: -I lastUpdateTime
-I lastAccessTime -I [Oo]wner -I CreateTime -I LastAccessTime -I Location -I transient_lastDdlTime
-I last_modified_ -I java.lang.RuntimeException -I at org -I at sun -I at java -I at junit
-I Caused by: -I LOCK_QUERYID: -I grantTime -I [.][.][.] [0-9]* more -I USING 'java -cp <https://hudson.apache.org/hudson/job/Hive-0.7.0-h0.20/ws/hive/build/ql/test/logs/clientnegative/create_view_failure4.q.out>
<https://hudson.apache.org/hudson/job/Hive-0.7.0-h0.20/ws/hive/ql/src/test/results/clientnegative/create_view_failure4.q.out>
    [junit] Done query: create_view_failure4.q
    [junit] Begin query: create_view_failure5.q
    [junit] diff -a -I file: -I pfile: -I hdfs: -I /tmp/ -I invalidscheme: -I lastUpdateTime
-I lastAccessTime -I [Oo]wner -I CreateTime -I LastAccessTime -I Location -I transient_lastDdlTime
-I last_modified_ -I java.lang.RuntimeException -I at org -I at sun -I at java -I at junit
-I Caused by: -I LOCK_QUERYID: -I grantTime -I [.][.][.] [0-9]* more -I USING 'java -cp <https://hudson.apache.org/hudson/job/Hive-0.7.0-h0.20/ws/hive/build/ql/test/logs/clientnegative/create_view_failure5.q.out>
<https://hudson.apache.org/hudson/job/Hive-0.7.0-h0.20/ws/hive/ql/src/test/results/clientnegative/create_view_failure5.q.out>
    [junit] Done query: create_view_failure5.q
    [junit] Begin query: ctas.q
    [junit] diff -a -I file: -I pfile: -I hdfs: -I /tmp/ -I invalidscheme: -I lastUpdateTime
-I lastAccessTime -I [Oo]wner -I CreateTime -I LastAccessTime -I Location -I transient_lastDdlTime
-I last_modified_ -I java.lang.RuntimeException -I at org -I at sun -I at java -I at junit
-I Caused by: -I LOCK_QUERYID: -I grantTime -I [.][.][.] [0-9]* more -I USING 'java -cp <https://hudson.apache.org/hudson/job/Hive-0.7.0-h0.20/ws/hive/build/ql/test/logs/clientnegative/ctas.q.out>
<https://hudson.apache.org/hudson/job/Hive-0.7.0-h0.20/ws/hive/ql/src/test/results/clientnegative/ctas.q.out>
    [junit] Done query: ctas.q
    [junit] Begin query: database_create_already_exists.q
    [junit] diff -a -I file: -I pfile: -I hdfs: -I /tmp/ -I invalidscheme: -I lastUpdateTime
-I lastAccessTime -I [Oo]wner -I CreateTime -I LastAccessTime -I Location -I transient_lastDdlTime
-I last_modified_ -I java.lang.RuntimeException -I at org -I at sun -I at java -I at junit
-I Caused by: -I LOCK_QUERYID: -I grantTime -I [.][.][.] [0-9]* more -I USING 'java -cp <https://hudson.apache.org/hudson/job/Hive-0.7.0-h0.20/ws/hive/build/ql/test/logs/clientnegative/database_create_already_exists.q.out>
<https://hudson.apache.org/hudson/job/Hive-0.7.0-h0.20/ws/hive/ql/src/test/results/clientnegative/database_create_already_exists.q.out>
    [junit] Done query: database_create_already_exists.q
    [junit] Begin query: database_create_invalid_name.q
    [junit] diff -a -I file: -I pfile: -I hdfs: -I /tmp/ -I invalidscheme: -I lastUpdateTime
-I lastAccessTime -I [Oo]wner -I CreateTime -I LastAccessTime -I Location -I transient_lastDdlTime
-I last_modified_ -I java.lang.RuntimeException -I at org -I at sun -I at java -I at junit
-I Caused by: -I LOCK_QUERYID: -I grantTime -I [.][.][.] [0-9]* more -I USING 'java -cp <https://hudson.apache.org/hudson/job/Hive-0.7.0-h0.20/ws/hive/build/ql/test/logs/clientnegative/database_create_invalid_name.q.out>
<https://hudson.apache.org/hudson/job/Hive-0.7.0-h0.20/ws/hive/ql/src/test/results/clientnegative/database_create_invalid_name.q.out>
    [junit] Done query: database_create_invalid_name.q
    [junit] Begin query: database_drop_does_not_exist.q
    [junit] diff -a -I file: -I pfile: -I hdfs: -I /tmp/ -I invalidscheme: -I lastUpdateTime
-I lastAccessTime -I [Oo]wner -I CreateTime -I LastAccessTime -I Location -I transient_lastDdlTime
-I last_modified_ -I java.lang.RuntimeException -I at org -I at sun -I at java -I at junit
-I Caused by: -I LOCK_QUERYID: -I grantTime -I [.][.][.] [0-9]* more -I USING 'java -cp <https://hudson.apache.org/hudson/job/Hive-0.7.0-h0.20/ws/hive/build/ql/test/logs/clientnegative/database_drop_does_not_exist.q.out>
<https://hudson.apache.org/hudson/job/Hive-0.7.0-h0.20/ws/hive/ql/src/test/results/clientnegative/database_drop_does_not_exist.q.out>
    [junit] Done query: database_drop_does_not_exist.q
    [junit] Begin query: database_drop_not_empty.q
    [junit] diff -a -I file: -I pfile: -I hdfs: -I /tmp/ -I invalidscheme: -I lastUpdateTime
-I lastAccessTime -I [Oo]wner -I CreateTime -I LastAccessTime -I Location -I transient_lastDdlTime
-I last_modified_ -I java.lang.RuntimeException -I at org -I at sun -I at java -I at junit
-I Caused by: -I LOCK_QUERYID: -I grantTime -I [.][.][.] [0-9]* more -I USING 'java -cp <https://hudson.apache.org/hudson/job/Hive-0.7.0-h0.20/ws/hive/build/ql/test/logs/clientnegative/database_drop_not_empty.q.out>
<https://hudson.apache.org/hudson/job/Hive-0.7.0-h0.20/ws/hive/ql/src/test/results/clientnegative/database_drop_not_empty.q.out>
    [junit] Done query: database_drop_not_empty.q
    [junit] Begin query: database_switch_does_not_exist.q
    [junit] diff -a -I file: -I pfile: -I hdfs: -I /tmp/ -I invalidscheme: -I lastUpdateTime
-I lastAccessTime -I [Oo]wner -I CreateTime -I LastAccessTime -I Location -I transient_lastDdlTime
-I last_modified_ -I java.lang.RuntimeException -I at org -I at sun -I at java -I at junit
-I Caused by: -I LOCK_QUERYID: -I grantTime -I [.][.][.] [0-9]* more -I USING 'java -cp <https://hudson.apache.org/hudson/job/Hive-0.7.0-h0.20/ws/hive/build/ql/test/logs/clientnegative/database_switch_does_not_exist.q.out>
<https://hudson.apache.org/hudson/job/Hive-0.7.0-h0.20/ws/hive/ql/src/test/results/clientnegative/database_switch_does_not_exist.q.out>
    [junit] Done query: database_switch_does_not_exist.q
    [junit] Begin query: ddltime.q
    [junit] diff -a -I file: -I pfile: -I hdfs: -I /tmp/ -I invalidscheme: -I lastUpdateTime
-I lastAccessTime -I [Oo]wner -I CreateTime -I LastAccessTime -I Location -I transient_lastDdlTime
-I last_modified_ -I java.lang.RuntimeException -I at org -I at sun -I at java -I at junit
-I Caused by: -I LOCK_QUERYID: -I grantTime -I [.][.][.] [0-9]* more -I USING 'java -cp <https://hudson.apache.org/hudson/job/Hive-0.7.0-h0.20/ws/hive/build/ql/test/logs/clientnegative/ddltime.q.out>
<https://hudson.apache.org/hudson/job/Hive-0.7.0-h0.20/ws/hive/ql/src/test/results/clientnegative/ddltime.q.out>
    [junit] Done query: ddltime.q
    [junit] Begin query: deletejar.q
    [junit] diff -a -I file: -I pfile: -I hdfs: -I /tmp/ -I invalidscheme: -I lastUpdateTime
-I lastAccessTime -I [Oo]wner -I CreateTime -I LastAccessTime -I Location -I transient_lastDdlTime
-I last_modified_ -I java.lang.RuntimeException -I at org -I at sun -I at java -I at junit
-I Caused by: -I LOCK_QUERYID: -I grantTime -I [.][.][.] [0-9]* more -I USING 'java -cp <https://hudson.apache.org/hudson/job/Hive-0.7.0-h0.20/ws/hive/build/ql/test/logs/clientnegative/deletejar.q.out>
<https://hudson.apache.org/hudson/job/Hive-0.7.0-h0.20/ws/hive/ql/src/test/results/clientnegative/deletejar.q.out>
    [junit] Done query: deletejar.q
    [junit] Begin query: describe_xpath1.q
    [junit] diff -a -I file: -I pfile: -I hdfs: -I /tmp/ -I invalidscheme: -I lastUpdateTime
-I lastAccessTime -I [Oo]wner -I CreateTime -I LastAccessTime -I Location -I transient_lastDdlTime
-I last_modified_ -I java.lang.RuntimeException -I at org -I at sun -I at java -I at junit
-I Caused by: -I LOCK_QUERYID: -I grantTime -I [.][.][.] [0-9]* more -I USING 'java -cp <https://hudson.apache.org/hudson/job/Hive-0.7.0-h0.20/ws/hive/build/ql/test/logs/clientnegative/describe_xpath1.q.out>
<https://hudson.apache.org/hudson/job/Hive-0.7.0-h0.20/ws/hive/ql/src/test/results/clientnegative/describe_xpath1.q.out>
    [junit] Done query: describe_xpath1.q
    [junit] Begin query: describe_xpath2.q
    [junit] diff -a -I file: -I pfile: -I hdfs: -I /tmp/ -I invalidscheme: -I lastUpdateTime
-I lastAccessTime -I [Oo]wner -I CreateTime -I LastAccessTime -I Location -I transient_lastDdlTime
-I last_modified_ -I java.lang.RuntimeException -I at org -I at sun -I at java -I at junit
-I Caused by: -I LOCK_QUERYID: -I grantTime -I [.][.][.] [0-9]* more -I USING 'java -cp <https://hudson.apache.org/hudson/job/Hive-0.7.0-h0.20/ws/hive/build/ql/test/logs/clientnegative/describe_xpath2.q.out>
<https://hudson.apache.org/hudson/job/Hive-0.7.0-h0.20/ws/hive/ql/src/test/results/clientnegative/describe_xpath2.q.out>
    [junit] Done query: describe_xpath2.q
    [junit] Begin query: describe_xpath3.q
    [junit] diff -a -I file: -I pfile: -I hdfs: -I /tmp/ -I invalidscheme: -I lastUpdateTime
-I lastAccessTime -I [Oo]wner -I CreateTime -I LastAccessTime -I Location -I transient_lastDdlTime
-I last_modified_ -I java.lang.RuntimeException -I at org -I at sun -I at java -I at junit
-I Caused by: -I LOCK_QUERYID: -I grantTime -I [.][.][.] [0-9]* more -I USING 'java -cp <https://hudson.apache.org/hudson/job/Hive-0.7.0-h0.20/ws/hive/build/ql/test/logs/clientnegative/describe_xpath3.q.out>
<https://hudson.apache.org/hudson/job/Hive-0.7.0-h0.20/ws/hive/ql/src/test/results/clientnegative/describe_xpath3.q.out>
    [junit] Done query: describe_xpath3.q
    [junit] Begin query: describe_xpath4.q
    [junit] diff -a -I file: -I pfile: -I hdfs: -I /tmp/ -I invalidscheme: -I lastUpdateTime
-I lastAccessTime -I [Oo]wner -I CreateTime -I LastAccessTime -I Location -I transient_lastDdlTime
-I last_modified_ -I java.lang.RuntimeException -I at org -I at sun -I at java -I at junit
-I Caused by: -I LOCK_QUERYID: -I grantTime -I [.][.][.] [0-9]* more -I USING 'java -cp <https://hudson.apache.org/hudson/job/Hive-0.7.0-h0.20/ws/hive/build/ql/test/logs/clientnegative/describe_xpath4.q.out>
<https://hudson.apache.org/hudson/job/Hive-0.7.0-h0.20/ws/hive/ql/src/test/results/clientnegative/describe_xpath4.q.out>
    [junit] Done query: describe_xpath4.q
    [junit] Begin query: drop_function_failure.q
    [junit] diff -a -I file: -I pfile: -I hdfs: -I /tmp/ -I invalidscheme: -I lastUpdateTime
-I lastAccessTime -I [Oo]wner -I CreateTime -I LastAccessTime -I Location -I transient_lastDdlTime
-I last_modified_ -I java.lang.RuntimeException -I at org -I at sun -I at java -I at junit
-I Caused by: -I LOCK_QUERYID: -I grantTime -I [.][.][.] [0-9]* more -I USING 'java -cp <https://hudson.apache.org/hudson/job/Hive-0.7.0-h0.20/ws/hive/build/ql/test/logs/clientnegative/drop_function_failure.q.out>
<https://hudson.apache.org/hudson/job/Hive-0.7.0-h0.20/ws/hive/ql/src/test/results/clientnegative/drop_function_failure.q.out>
    [junit] Done query: drop_function_failure.q
    [junit] Begin query: drop_index_failure.q
    [junit] diff -a -I file: -I pfile: -I hdfs: -I /tmp/ -I invalidscheme: -I lastUpdateTime
-I lastAccessTime -I [Oo]wner -I CreateTime -I LastAccessTime -I Location -I transient_lastDdlTime
-I last_modified_ -I java.lang.RuntimeException -I at org -I at sun -I at java -I at junit
-I Caused by: -I LOCK_QUERYID: -I grantTime -I [.][.][.] [0-9]* more -I USING 'java -cp <https://hudson.apache.org/hudson/job/Hive-0.7.0-h0.20/ws/hive/build/ql/test/logs/clientnegative/drop_index_failure.q.out>
<https://hudson.apache.org/hudson/job/Hive-0.7.0-h0.20/ws/hive/ql/src/test/results/clientnegative/drop_index_failure.q.out>
    [junit] Done query: drop_index_failure.q
    [junit] Begin query: drop_native_udf.q
    [junit] diff -a -I file: -I pfile: -I hdfs: -I /tmp/ -I invalidscheme: -I lastUpdateTime
-I lastAccessTime -I [Oo]wner -I CreateTime -I LastAccessTime -I Location -I transient_lastDdlTime
-I last_modified_ -I java.lang.RuntimeException -I at org -I at sun -I at java -I at junit
-I Caused by: -I LOCK_QUERYID: -I grantTime -I [.][.][.] [0-9]* more -I USING 'java -cp <https://hudson.apache.org/hudson/job/Hive-0.7.0-h0.20/ws/hive/build/ql/test/logs/clientnegative/drop_native_udf.q.out>
<https://hudson.apache.org/hudson/job/Hive-0.7.0-h0.20/ws/hive/ql/src/test/results/clientnegative/drop_native_udf.q.out>
    [junit] Done query: drop_native_udf.q
    [junit] Begin query: drop_partition_failure.q
    [junit] diff -a -I file: -I pfile: -I hdfs: -I /tmp/ -I invalidscheme: -I lastUpdateTime
-I lastAccessTime -I [Oo]wner -I CreateTime -I LastAccessTime -I Location -I transient_lastDdlTime
-I last_modified_ -I java.lang.RuntimeException -I at org -I at sun -I at java -I at junit
-I Caused by: -I LOCK_QUERYID: -I grantTime -I [.][.][.] [0-9]* more -I USING 'java -cp <https://hudson.apache.org/hudson/job/Hive-0.7.0-h0.20/ws/hive/build/ql/test/logs/clientnegative/drop_partition_failure.q.out>
<https://hudson.apache.org/hudson/job/Hive-0.7.0-h0.20/ws/hive/ql/src/test/results/clientnegative/drop_partition_failure.q.out>
    [junit] Done query: drop_partition_failure.q
    [junit] Begin query: drop_table_failure1.q
    [junit] diff -a -I file: -I pfile: -I hdfs: -I /tmp/ -I invalidscheme: -I lastUpdateTime
-I lastAccessTime -I [Oo]wner -I CreateTime -I LastAccessTime -I Location -I transient_lastDdlTime
-I last_modified_ -I java.lang.RuntimeException -I at org -I at sun -I at java -I at junit
-I Caused by: -I LOCK_QUERYID: -I grantTime -I [.][.][.] [0-9]* more -I USING 'java -cp <https://hudson.apache.org/hudson/job/Hive-0.7.0-h0.20/ws/hive/build/ql/test/logs/clientnegative/drop_table_failure1.q.out>
<https://hudson.apache.org/hudson/job/Hive-0.7.0-h0.20/ws/hive/ql/src/test/results/clientnegative/drop_table_failure1.q.out>
    [junit] Done query: drop_table_failure1.q
    [junit] Begin query: drop_table_failure2.q
    [junit] diff -a -I file: -I pfile: -I hdfs: -I /tmp/ -I invalidscheme: -I lastUpdateTime
-I lastAccessTime -I [Oo]wner -I CreateTime -I LastAccessTime -I Location -I transient_lastDdlTime
-I last_modified_ -I java.lang.RuntimeException -I at org -I at sun -I at java -I at junit
-I Caused by: -I LOCK_QUERYID: -I grantTime -I [.][.][.] [0-9]* more -I USING 'java -cp <https://hudson.apache.org/hudson/job/Hive-0.7.0-h0.20/ws/hive/build/ql/test/logs/clientnegative/drop_table_failure2.q.out>
<https://hudson.apache.org/hudson/job/Hive-0.7.0-h0.20/ws/hive/ql/src/test/results/clientnegative/drop_table_failure2.q.out>
    [junit] Done query: drop_table_failure2.q
    [junit] Begin query: drop_view_failure1.q
    [junit] diff -a -I file: -I pfile: -I hdfs: -I /tmp/ -I invalidscheme: -I lastUpdateTime
-I lastAccessTime -I [Oo]wner -I CreateTime -I LastAccessTime -I Location -I transient_lastDdlTime
-I last_modified_ -I java.lang.RuntimeException -I at org -I at sun -I at java -I at junit
-I Caused by: -I LOCK_QUERYID: -I grantTime -I [.][.][.] [0-9]* more -I USING 'java -cp <https://hudson.apache.org/hudson/job/Hive-0.7.0-h0.20/ws/hive/build/ql/test/logs/clientnegative/drop_view_failure1.q.out>
<https://hudson.apache.org/hudson/job/Hive-0.7.0-h0.20/ws/hive/ql/src/test/results/clientnegative/drop_view_failure1.q.out>
    [junit] Done query: drop_view_failure1.q
    [junit] Begin query: drop_view_failure2.q
    [junit] diff -a -I file: -I pfile: -I hdfs: -I /tmp/ -I invalidscheme: -I lastUpdateTime
-I lastAccessTime -I [Oo]wner -I CreateTime -I LastAccessTime -I Location -I transient_lastDdlTime
-I last_modified_ -I java.lang.RuntimeException -I at org -I at sun -I at java -I at junit
-I Caused by: -I LOCK_QUERYID: -I grantTime -I [.][.][.] [0-9]* more -I USING 'java -cp <https://hudson.apache.org/hudson/job/Hive-0.7.0-h0.20/ws/hive/build/ql/test/logs/clientnegative/drop_view_failure2.q.out>
<https://hudson.apache.org/hudson/job/Hive-0.7.0-h0.20/ws/hive/ql/src/test/results/clientnegative/drop_view_failure2.q.out>
    [junit] Done query: drop_view_failure2.q
    [junit] Begin query: duplicate_alias_in_transform.q
    [junit] diff -a -I file: -I pfile: -I hdfs: -I /tmp/ -I invalidscheme: -I lastUpdateTime
-I lastAccessTime -I [Oo]wner -I CreateTime -I LastAccessTime -I Location -I transient_lastDdlTime
-I last_modified_ -I java.lang.RuntimeException -I at org -I at sun -I at java -I at junit
-I Caused by: -I LOCK_QUERYID: -I grantTime -I [.][.][.] [0-9]* more -I USING 'java -cp <https://hudson.apache.org/hudson/job/Hive-0.7.0-h0.20/ws/hive/build/ql/test/logs/clientnegative/duplicate_alias_in_transform.q.out>
<https://hudson.apache.org/hudson/job/Hive-0.7.0-h0.20/ws/hive/ql/src/test/results/clientnegative/duplicate_alias_in_transform.q.out>
    [junit] Done query: duplicate_alias_in_transform.q
    [junit] Begin query: duplicate_alias_in_transform_schema.q
    [junit] diff -a -I file: -I pfile: -I hdfs: -I /tmp/ -I invalidscheme: -I lastUpdateTime
-I lastAccessTime -I [Oo]wner -I CreateTime -I LastAccessTime -I Location -I transient_lastDdlTime
-I last_modified_ -I java.lang.RuntimeException -I at org -I at sun -I at java -I at junit
-I Caused by: -I LOCK_QUERYID: -I grantTime -I [.][.][.] [0-9]* more -I USING 'java -cp <https://hudson.apache.org/hudson/job/Hive-0.7.0-h0.20/ws/hive/build/ql/test/logs/clientnegative/duplicate_alias_in_transform_schema.q.out>
<https://hudson.apache.org/hudson/job/Hive-0.7.0-h0.20/ws/hive/ql/src/test/results/clientnegative/duplicate_alias_in_transform_schema.q.out>
    [junit] Done query: duplicate_alias_in_transform_schema.q
    [junit] Begin query: duplicate_insert1.q
    [junit] diff -a -I file: -I pfile: -I hdfs: -I /tmp/ -I invalidscheme: -I lastUpdateTime
-I lastAccessTime -I [Oo]wner -I CreateTime -I LastAccessTime -I Location -I transient_lastDdlTime
-I last_modified_ -I java.lang.RuntimeException -I at org -I at sun -I at java -I at junit
-I Caused by: -I LOCK_QUERYID: -I grantTime -I [.][.][.] [0-9]* more -I USING 'java -cp <https://hudson.apache.org/hudson/job/Hive-0.7.0-h0.20/ws/hive/build/ql/test/logs/clientnegative/duplicate_insert1.q.out>
<https://hudson.apache.org/hudson/job/Hive-0.7.0-h0.20/ws/hive/ql/src/test/results/clientnegative/duplicate_insert1.q.out>
    [junit] Done query: duplicate_insert1.q
    [junit] Begin query: duplicate_insert2.q
    [junit] diff -a -I file: -I pfile: -I hdfs: -I /tmp/ -I invalidscheme: -I lastUpdateTime
-I lastAccessTime -I [Oo]wner -I CreateTime -I LastAccessTime -I Location -I transient_lastDdlTime
-I last_modified_ -I java.lang.RuntimeException -I at org -I at sun -I at java -I at junit
-I Caused by: -I LOCK_QUERYID: -I grantTime -I [.][.][.] [0-9]* more -I USING 'java -cp <https://hudson.apache.org/hudson/job/Hive-0.7.0-h0.20/ws/hive/build/ql/test/logs/clientnegative/duplicate_insert2.q.out>
<https://hudson.apache.org/hudson/job/Hive-0.7.0-h0.20/ws/hive/ql/src/test/results/clientnegative/duplicate_insert2.q.out>
    [junit] Done query: duplicate_insert2.q
    [junit] Begin query: duplicate_insert3.q
    [junit] diff -a -I file: -I pfile: -I hdfs: -I /tmp/ -I invalidscheme: -I lastUpdateTime
-I lastAccessTime -I [Oo]wner -I CreateTime -I LastAccessTime -I Location -I transient_lastDdlTime
-I last_modified_ -I java.lang.RuntimeException -I at org -I at sun -I at java -I at junit
-I Caused by: -I LOCK_QUERYID: -I grantTime -I [.][.][.] [0-9]* more -I USING 'java -cp <https://hudson.apache.org/hudson/job/Hive-0.7.0-h0.20/ws/hive/build/ql/test/logs/clientnegative/duplicate_insert3.q.out>
<https://hudson.apache.org/hudson/job/Hive-0.7.0-h0.20/ws/hive/ql/src/test/results/clientnegative/duplicate_insert3.q.out>
    [junit] Done query: duplicate_insert3.q
    [junit] Begin query: dyn_part1.q
    [junit] diff -a -I file: -I pfile: -I hdfs: -I /tmp/ -I invalidscheme: -I lastUpdateTime
-I lastAccessTime -I [Oo]wner -I CreateTime -I LastAccessTime -I Location -I transient_lastDdlTime
-I last_modified_ -I java.lang.RuntimeException -I at org -I at sun -I at java -I at junit
-I Caused by: -I LOCK_QUERYID: -I grantTime -I [.][.][.] [0-9]* more -I USING 'java -cp <https://hudson.apache.org/hudson/job/Hive-0.7.0-h0.20/ws/hive/build/ql/test/logs/clientnegative/dyn_part1.q.out>
<https://hudson.apache.org/hudson/job/Hive-0.7.0-h0.20/ws/hive/ql/src/test/results/clientnegative/dyn_part1.q.out>
    [junit] Done query: dyn_part1.q
    [junit] Begin query: dyn_part2.q
    [junit] diff -a -I file: -I pfile: -I hdfs: -I /tmp/ -I invalidscheme: -I lastUpdateTime
-I lastAccessTime -I [Oo]wner -I CreateTime -I LastAccessTime -I Location -I transient_lastDdlTime
-I last_modified_ -I java.lang.RuntimeException -I at org -I at sun -I at java -I at junit
-I Caused by: -I LOCK_QUERYID: -I grantTime -I [.][.][.] [0-9]* more -I USING 'java -cp <https://hudson.apache.org/hudson/job/Hive-0.7.0-h0.20/ws/hive/build/ql/test/logs/clientnegative/dyn_part2.q.out>
<https://hudson.apache.org/hudson/job/Hive-0.7.0-h0.20/ws/hive/ql/src/test/results/clientnegative/dyn_part2.q.out>
    [junit] Done query: dyn_part2.q
    [junit] Begin query: dyn_part3.q
    [junit] [Fatal Error] total number of created files exceeds 100. Killing the job.
    [junit] java.lang.RuntimeException: Error while running command to get file permissions
: java.io.IOException: java.lang.InterruptedException
    [junit] 	at org.apache.hadoop.util.Shell.runCommand(Shell.java:198)
    [junit] 	at org.apache.hadoop.util.Shell.run(Shell.java:134)
    [junit] 	at org.apache.hadoop.util.Shell$ShellCommandExecutor.execute(Shell.java:286)
    [junit] 	at org.apache.hadoop.util.Shell.execCommand(Shell.java:354)
    [junit] 	at org.apache.hadoop.util.Shell.execCommand(Shell.java:337)
    [junit] 	at org.apache.hadoop.fs.RawLocalFileSystem.execCommand(RawLocalFileSystem.java:481)
    [junit] 	at org.apache.hadoop.fs.RawLocalFileSystem.access$100(RawLocalFileSystem.java:37)
    [junit] 	at org.apache.hadoop.fs.RawLocalFileSystem$RawLocalFileStatus.loadPermissionInfo(RawLocalFileSystem.java:407)
    [junit] 	at org.apache.hadoop.fs.RawLocalFileSystem$RawLocalFileStatus.getPermission(RawLocalFileSystem.java:382)
    [junit] 	at org.apache.hadoop.fs.ProxyFileSystem.swizzleFileStatus(ProxyFileSystem.java:56)
    [junit] 	at org.apache.hadoop.fs.ProxyFileSystem.getFileStatus(ProxyFileSystem.java:233)
    [junit] 	at org.apache.hadoop.fs.FilterFileSystem.getFileStatus(FilterFileSystem.java:245)
    [junit] 	at org.apache.hadoop.fs.FileSystem.exists(FileSystem.java:643)
    [junit] 	at org.apache.hadoop.fs.FileSystem.deleteOnExit(FileSystem.java:610)
    [junit] 	at org.apache.hadoop.hive.shims.Hadoop20Shims.fileSystemDeleteOnExit(Hadoop20Shims.java:68)
    [junit] 	at org.apache.hadoop.hive.ql.exec.FileSinkOperator.createBucketFiles(FileSinkOperator.java:473)
    [junit] 	at org.apache.hadoop.hive.ql.exec.FileSinkOperator.getDynOutWriters(FileSinkOperator.java:602)
    [junit] 	at org.apache.hadoop.hive.ql.exec.FileSinkOperator.processOp(FileSinkOperator.java:542)
    [junit] 	at org.apache.hadoop.hive.ql.exec.Operator.process(Operator.java:471)
    [junit] 	at org.apache.hadoop.hive.ql.exec.Operator.forward(Operator.java:744)
    [junit] 	at org.apache.hadoop.hive.ql.exec.SelectOperator.processOp(SelectOperator.java:84)
    [junit] 	at org.apache.hadoop.hive.ql.exec.Operator.process(Operator.java:471)
    [junit] 	at org.apache.hadoop.hive.ql.exec.Operator.forward(Operator.java:744)
    [junit] 	at org.apache.hadoop.hive.ql.exec.TableScanOperator.processOp(TableScanOperator.java:78)
    [junit] 	at org.apache.hadoop.hive.ql.exec.Operator.process(Operator.java:471)
    [junit] 	at org.apache.hadoop.hive.ql.exec.Operator.forward(Operator.java:744)
    [junit] 	at org.apache.hadoop.hive.ql.exec.MapOperator.process(MapOperator.java:527)
    [junit] 	at org.apache.hadoop.hive.ql.exec.ExecMapper.map(ExecMapper.java:143)
    [junit] 	at org.apache.hadoop.mapred.MapRunner.run(MapRunner.java:50)
    [junit] 	at org.apache.hadoop.mapred.MapTask.runOldMapper(MapTask.java:356)
    [junit] 	at org.apache.hadoop.mapred.MapTask.run(MapTask.java:305)
    [junit] 	at org.apache.hadoop.mapred.LocalJobRunner$Job.run(LocalJobRunner.java:176)
    [junit] 
    [junit] 	at org.apache.hadoop.fs.RawLocalFileSystem$RawLocalFileStatus.loadPermissionInfo(RawLocalFileSystem.java:432)
    [junit] 	at org.apache.hadoop.fs.RawLocalFileSystem$RawLocalFileStatus.getPermission(RawLocalFileSystem.java:382)
    [junit] 	at org.apache.hadoop.fs.ProxyFileSystem.swizzleFileStatus(ProxyFileSystem.java:56)
    [junit] 	at org.apache.hadoop.fs.ProxyFileSystem.getFileStatus(ProxyFileSystem.java:233)
    [junit] 	at org.apache.hadoop.fs.FilterFileSystem.getFileStatus(FilterFileSystem.java:245)
    [junit] 	at org.apache.hadoop.fs.FileSystem.exists(FileSystem.java:643)
    [junit] 	at org.apache.hadoop.fs.FileSystem.deleteOnExit(FileSystem.java:610)
    [junit] 	at org.apache.hadoop.hive.shims.Hadoop20Shims.fileSystemDeleteOnExit(Hadoop20Shims.java:68)
    [junit] 	at org.apache.hadoop.hive.ql.exec.FileSinkOperator.createBucketFiles(FileSinkOperator.java:473)
    [junit] 	at org.apache.hadoop.hive.ql.exec.FileSinkOperator.getDynOutWriters(FileSinkOperator.java:602)
    [junit] 	at org.apache.hadoop.hive.ql.exec.FileSinkOperator.processOp(FileSinkOperator.java:542)
    [junit] 	at org.apache.hadoop.hive.ql.exec.Operator.process(Operator.java:471)
    [junit] 	at org.apache.hadoop.hive.ql.exec.Operator.forward(Operator.java:744)
    [junit] 	at org.apache.hadoop.hive.ql.exec.SelectOperator.processOp(SelectOperator.java:84)
    [junit] 	at org.apache.hadoop.hive.ql.exec.Operator.process(Operator.java:471)
    [junit] 	at org.apache.hadoop.hive.ql.exec.Operator.forward(Operator.java:744)
    [junit] 	at org.apache.hadoop.hive.ql.exec.TableScanOperator.processOp(TableScanOperator.java:78)
    [junit] 	at org.apache.hadoop.hive.ql.exec.Operator.process(Operator.java:471)
    [junit] 	at org.apache.hadoop.hive.ql.exec.Operator.forward(Operator.java:744)
    [junit] 	at org.apache.hadoop.hive.ql.exec.MapOperator.process(MapOperator.java:527)
    [junit] 	at org.apache.hadoop.hive.ql.exec.ExecMapper.map(ExecMapper.java:143)
    [junit] 	at org.apache.hadoop.mapred.MapRunner.run(MapRunner.java:50)
    [junit] 	at org.apache.hadoop.mapred.MapTask.runOldMapper(MapTask.java:356)
    [junit] 	at org.apache.hadoop.mapred.MapTask.run(MapTask.java:305)
    [junit] 	at org.apache.hadoop.mapred.LocalJobRunner$Job.run(LocalJobRunner.java:176)
    [junit] Ended Job = job_local_0001 with errors
    [junit] diff -a -I file: -I pfile: -I hdfs: -I /tmp/ -I invalidscheme: -I lastUpdateTime
-I lastAccessTime -I [Oo]wner -I CreateTime -I LastAccessTime -I Location -I transient_lastDdlTime
-I last_modified_ -I java.lang.RuntimeException -I at org -I at sun -I at java -I at junit
-I Caused by: -I LOCK_QUERYID: -I grantTime -I [.][.][.] [0-9]* more -I USING 'java -cp <https://hudson.apache.org/hudson/job/Hive-0.7.0-h0.20/ws/hive/build/ql/test/logs/clientnegative/dyn_part3.q.out>
<https://hudson.apache.org/hudson/job/Hive-0.7.0-h0.20/ws/hive/ql/src/test/results/clientnegative/dyn_part3.q.out>
    [junit] Done query: dyn_part3.q
    [junit] Begin query: dyn_part_empty.q
      [for] <https://hudson.apache.org/hudson/job/Hive-0.7.0-h0.20/ws/hive/ql/build.xml>:
The following error occurred while executing this line:
      [for] <https://hudson.apache.org/hudson/job/Hive-0.7.0-h0.20/ws/hive/build.xml>:212:
The following error occurred while executing this line:
      [for] <https://hudson.apache.org/hudson/job/Hive-0.7.0-h0.20/ws/hive/build-common.xml>:416:
java.lang.OutOfMemoryError: PermGen space
      [for] <https://hudson.apache.org/hudson/job/Hive-0.7.0-h0.20/ws/hive/serde/build.xml>:
The following error occurred while executing this line:
      [for] <https://hudson.apache.org/hudson/job/Hive-0.7.0-h0.20/ws/hive/build.xml>:212:
The following error occurred while executing this line:
      [for] <https://hudson.apache.org/hudson/job/Hive-0.7.0-h0.20/ws/hive/serde/build.xml>:28:
The following error occurred while executing this line:
      [for] <https://hudson.apache.org/hudson/job/Hive-0.7.0-h0.20/ws/hive/build-common.xml>:71:
java.lang.OutOfMemoryError: PermGen space
      [for] <https://hudson.apache.org/hudson/job/Hive-0.7.0-h0.20/ws/hive/service/build.xml>:
The following error occurred while executing this line:
      [for] <https://hudson.apache.org/hudson/job/Hive-0.7.0-h0.20/ws/hive/build.xml>:212:
The following error occurred while executing this line:
      [for] <https://hudson.apache.org/hudson/job/Hive-0.7.0-h0.20/ws/hive/service/build.xml>:30:
The following error occurred while executing this line:
      [for] <https://hudson.apache.org/hudson/job/Hive-0.7.0-h0.20/ws/hive/build-common.xml>:71:
java.lang.OutOfMemoryError: PermGen space

BUILD FAILED
<https://hudson.apache.org/hudson/job/Hive-0.7.0-h0.20/ws/hive/build.xml>:207: Keepgoing
execution: 4 of 10 iterations failed.

Total time: 175 minutes 44 seconds
Recording test results


Mime
View raw message