hive-dev mailing list archives

Site index · List index
Message view « Date » · « Thread »
Top « Date » · « Thread »
From mvaradach...@facebook.com (Murli Varadachari)
Subject *UNIT TEST FAILURE for apache HIVE* Hadoop.Version=0.17.1 based on SVN Rev# 740573.43
Date Wed, 04 Feb 2009 01:43:44 GMT
[ivy:retrieve] :: resolution report :: resolve 39ms :: artifacts dl 3ms
	---------------------------------------------------------------------
	|                  |            modules            ||   artifacts   |
	|       conf       | number| search|dwnlded|evicted|| number|dwnlded|
	---------------------------------------------------------------------
	|      default     |   1   |   0   |   0   |   0   ||   1   |   0   |
	---------------------------------------------------------------------
[ivy:retrieve] :: retrieving :: org.apache.hadoop.hive#cli
[ivy:retrieve] 	confs: [default]
[ivy:retrieve] 	0 artifacts copied, 1 already retrieved (0kB/4ms)

install-hadoopcore:

compile:
     [echo] Compiling: cli

jar:
     [echo] Jar: cli

deploy:
     [echo] hive: cli

init:
    [mkdir] Created dir: /usr/local/continuous_builds/src/hiveopensource-0.17.1/hiveopensource_0_17_1/build/service/test
    [mkdir] Created dir: /usr/local/continuous_builds/src/hiveopensource-0.17.1/hiveopensource_0_17_1/build/service/test/src
    [mkdir] Created dir: /usr/local/continuous_builds/src/hiveopensource-0.17.1/hiveopensource_0_17_1/build/service/test/classes

core-compile:

compile:

jar:
     [echo] Jar: service

deploy:
     [echo] hive: service

init:
    [mkdir] Created dir: /usr/local/continuous_builds/src/hiveopensource-0.17.1/hiveopensource_0_17_1/build/jdbc/test
    [mkdir] Created dir: /usr/local/continuous_builds/src/hiveopensource-0.17.1/hiveopensource_0_17_1/build/jdbc/test/src
    [mkdir] Created dir: /usr/local/continuous_builds/src/hiveopensource-0.17.1/hiveopensource_0_17_1/build/jdbc/test/classes

core-compile:

compile:

jar:
     [echo] Jar: jdbc

deploy:
     [echo] hive: jdbc

hwi-init:
    [mkdir] Created dir: /usr/local/continuous_builds/src/hiveopensource-0.17.1/hiveopensource_0_17_1/build/hwi/test/classes
    [mkdir] Created dir: /usr/local/continuous_builds/src/hiveopensource-0.17.1/hiveopensource_0_17_1/build/hwi/test/src

compile:
     [echo] Compiling: hwi
    [javac] Compiling 7 source files to /usr/local/continuous_builds/src/hiveopensource-0.17.1/hiveopensource_0_17_1/build/hwi/classes

jar:
     [echo] Jar: hwi
      [jar] Building jar: /usr/local/continuous_builds/src/hiveopensource-0.17.1/hiveopensource_0_17_1/build/hwi/hive_hwi.jar

deploy:
     [echo] hive: hwi
     [copy] Copying 1 file to /usr/local/continuous_builds/src/hiveopensource-0.17.1/hiveopensource_0_17_1/build

test:

test:
     [echo] Nothing to do!

test:
     [echo] Nothing to do!

test-conditions:

gen-test:

hwi-init:

compile:
     [echo] Compiling: hwi
    [javac] Compiling 7 source files to /usr/local/continuous_builds/src/hiveopensource-0.17.1/hiveopensource_0_17_1/build/hwi/classes

compile-test:
    [javac] Compiling 1 source file to /usr/local/continuous_builds/src/hiveopensource-0.17.1/hiveopensource_0_17_1/build/hwi/test/classes

test-jar:

test-init:
    [mkdir] Created dir: /usr/local/continuous_builds/src/hiveopensource-0.17.1/hiveopensource_0_17_1/build/hwi/test/data
    [mkdir] Created dir: /usr/local/continuous_builds/src/hiveopensource-0.17.1/hiveopensource_0_17_1/build/hwi/test/logs/clientpositive
    [mkdir] Created dir: /usr/local/continuous_builds/src/hiveopensource-0.17.1/hiveopensource_0_17_1/build/hwi/test/logs/clientnegative
    [mkdir] Created dir: /usr/local/continuous_builds/src/hiveopensource-0.17.1/hiveopensource_0_17_1/build/hwi/test/logs/positive
    [mkdir] Created dir: /usr/local/continuous_builds/src/hiveopensource-0.17.1/hiveopensource_0_17_1/build/hwi/test/logs/negative
     [copy] Copying 20 files to /usr/local/continuous_builds/src/hiveopensource-0.17.1/hiveopensource_0_17_1/build/hwi/test/data
     [copy] Copied 5 empty directories to 2 empty directories under /usr/local/continuous_builds/src/hiveopensource-0.17.1/hiveopensource_0_17_1/build/hwi/test/data

test:
    [junit] Running org.apache.hadoop.hive.hwi.TestHWISessionManager
    [junit] Hive history file=/usr/local/continuous_builds/src/hiveopensource-0.17.1/hiveopensource_0_17_1/hwi/../build/ql/tmp/hive_job_log_mvaradachari_200902031742_-924248687.txt
    [junit] Hive history file=/usr/local/continuous_builds/src/hiveopensource-0.17.1/hiveopensource_0_17_1/hwi/../build/ql/tmp/hive_job_log_mvaradachari_200902031742_-194534739.txt
    [junit] Hive history file=/usr/local/continuous_builds/src/hiveopensource-0.17.1/hiveopensource_0_17_1/hwi/../build/ql/tmp/hive_job_log_mvaradachari_200902031742_1714123286.txt
    [junit] OK
    [junit] Total MapReduce jobs = 2
    [junit] Total MapReduce jobs = 2
    [junit] Exception in thread "main" java.io.FileNotFoundException: File /usr/local/continuous_builds/src/hiveopensource-0.17.1/hiveopensource_0_17_1/build/ql/test/test-udfs.jar
does not exist.
    [junit] 	at org.apache.hadoop.mapred.JobShell.validateFiles(JobShell.java:129)
    [junit] 	at org.apache.hadoop.mapred.JobShell.run(JobShell.java:179)
    [junit] 	at org.apache.hadoop.util.ToolRunner.run(ToolRunner.java:65)
    [junit] 	at org.apache.hadoop.util.ToolRunner.run(ToolRunner.java:79)
    [junit] 	at org.apache.hadoop.mapred.JobShell.main(JobShell.java:220)
    [junit] FAILED: Execution Error, return code 1 from org.apache.hadoop.hive.ql.exec.MapRedTask
    [junit] Exception in thread "main" java.io.FileNotFoundException: File /usr/local/continuous_builds/src/hiveopensource-0.17.1/hiveopensource_0_17_1/build/ql/test/test-udfs.jar
does not exist.
    [junit] 	at org.apache.hadoop.mapred.JobShell.validateFiles(JobShell.java:129)
    [junit] 	at org.apache.hadoop.mapred.JobShell.run(JobShell.java:179)
    [junit] 	at org.apache.hadoop.util.ToolRunner.run(ToolRunner.java:65)
    [junit] 	at org.apache.hadoop.util.ToolRunner.run(ToolRunner.java:79)
    [junit] 	at org.apache.hadoop.mapred.JobShell.main(JobShell.java:220)
    [junit] FAILED: Execution Error, return code 1 from org.apache.hadoop.hive.ql.exec.MapRedTask
    [junit] Tests run: 1, Failures: 1, Errors: 0, Time elapsed: 23.511 sec
    [junit] Test org.apache.hadoop.hive.hwi.TestHWISessionManager FAILED

BUILD FAILED
/usr/local/continuous_builds/src/hiveopensource-0.17.1/hiveopensource_0_17_1/build.xml:117:
The following error occurred while executing this line:
/usr/local/continuous_builds/src/hiveopensource-0.17.1/hiveopensource_0_17_1/build-common.xml:268:
Tests failed!

Total time: 40 seconds
EXIT VALUE IS 1 for runtests
RUNNING TEST SECOND TIME FOR HIVE OPENSOURCE Hadoop.Version=0.17.1 - ant test
+++++++++++++++++++++++++++++++++++++++++++++++++++++++++++++++++
Buildfile: build.xml

clean-test:

clean-test:
   [delete] Deleting directory /usr/local/continuous_builds/src/hiveopensource-0.17.1/hiveopensource_0_17_1/build/cli/test
   [delete] Deleting directory /usr/local/continuous_builds/src/hiveopensource-0.17.1/hiveopensource_0_17_1/build/test

clean-test:
   [delete] Deleting directory /usr/local/continuous_builds/src/hiveopensource-0.17.1/hiveopensource_0_17_1/build/common/test

clean-test:
   [delete] Deleting directory /usr/local/continuous_builds/src/hiveopensource-0.17.1/hiveopensource_0_17_1/build/hwi/test

clean-test:
   [delete] Deleting directory /usr/local/continuous_builds/src/hiveopensource-0.17.1/hiveopensource_0_17_1/build/jdbc/test

clean-test:
   [delete] Deleting directory /usr/local/continuous_builds/src/hiveopensource-0.17.1/hiveopensource_0_17_1/build/metastore/test
Overriding previous definition of reference to test.classpath

clean-test:
   [delete] Deleting directory /usr/local/continuous_builds/src/hiveopensource-0.17.1/hiveopensource_0_17_1/build/ql/test

clean-test:
   [delete] Deleting directory /usr/local/continuous_builds/src/hiveopensource-0.17.1/hiveopensource_0_17_1/build/serde/test

clean-test:
   [delete] Deleting directory /usr/local/continuous_builds/src/hiveopensource-0.17.1/hiveopensource_0_17_1/build/service/test

BUILD SUCCESSFUL
Total time: 3 seconds
Buildfile: build.xml

clean-test:

clean-test:

clean-test:

clean-test:

clean-test:

clean-test:
Overriding previous definition of reference to test.classpath

clean-test:

clean-test:

clean-test:

deploy:

init:
    [mkdir] Created dir: /usr/local/continuous_builds/src/hiveopensource-0.17.1/hiveopensource_0_17_1/build/common/test
    [mkdir] Created dir: /usr/local/continuous_builds/src/hiveopensource-0.17.1/hiveopensource_0_17_1/build/common/test/src
    [mkdir] Created dir: /usr/local/continuous_builds/src/hiveopensource-0.17.1/hiveopensource_0_17_1/build/common/test/classes

download-ivy:

init-ivy:

settings-ivy:

resolve:
[ivy:retrieve] :: Ivy 2.0.0-rc2 - 20081028224207 :: http://ant.apache.org/ivy/ ::
:: loading settings :: file = /usr/local/continuous_builds/src/hiveopensource-0.17.1/hiveopensource_0_17_1/ivy/ivysettings.xml
[ivy:retrieve] :: resolving dependencies :: org.apache.hadoop.hive#common;working@devbuild001.snc1.facebook.com
[ivy:retrieve] 	confs: [default]
[ivy:retrieve] 	found hadoop#core;0.17.1 in hadoop-resolver
[ivy:retrieve] :: resolution report :: resolve 856ms :: artifacts dl 4ms
	---------------------------------------------------------------------
	|                  |            modules            ||   artifacts   |
	|       conf       | number| search|dwnlded|evicted|| number|dwnlded|
	---------------------------------------------------------------------
	|      default     |   1   |   0   |   0   |   0   ||   1   |   0   |
	---------------------------------------------------------------------
[ivy:retrieve] :: retrieving :: org.apache.hadoop.hive#common
[ivy:retrieve] 	confs: [default]
[ivy:retrieve] 	0 artifacts copied, 1 already retrieved (0kB/8ms)

install-hadoopcore:

compile:
     [echo] Compiling: common

jar:
     [echo] Jar: common

deploy:
     [echo] hive: common

init:
    [mkdir] Created dir: /usr/local/continuous_builds/src/hiveopensource-0.17.1/hiveopensource_0_17_1/build/serde/test
    [mkdir] Created dir: /usr/local/continuous_builds/src/hiveopensource-0.17.1/hiveopensource_0_17_1/build/serde/test/src
    [mkdir] Created dir: /usr/local/continuous_builds/src/hiveopensource-0.17.1/hiveopensource_0_17_1/build/serde/test/classes

dynamic-serde:

compile:
     [echo] Compiling: serde

jar:
     [echo] Jar: serde

deploy:
     [echo] hive: serde

init:
    [mkdir] Created dir: /usr/local/continuous_builds/src/hiveopensource-0.17.1/hiveopensource_0_17_1/build/metastore/test
    [mkdir] Created dir: /usr/local/continuous_builds/src/hiveopensource-0.17.1/hiveopensource_0_17_1/build/metastore/test/src
    [mkdir] Created dir: /usr/local/continuous_builds/src/hiveopensource-0.17.1/hiveopensource_0_17_1/build/metastore/test/classes

model-compile:

core-compile:
     [echo] Compiling: 

model-enhance:

compile:

jar:
     [echo] Jar: metastore

deploy:
     [echo] hive: metastore
Overriding previous definition of reference to test.classpath

init:
    [mkdir] Created dir: /usr/local/continuous_builds/src/hiveopensource-0.17.1/hiveopensource_0_17_1/build/ql/test
    [mkdir] Created dir: /usr/local/continuous_builds/src/hiveopensource-0.17.1/hiveopensource_0_17_1/build/ql/test/src
    [mkdir] Created dir: /usr/local/continuous_builds/src/hiveopensource-0.17.1/hiveopensource_0_17_1/build/ql/test/classes

ql-init:

build-grammar:

compile-ant-tasks:

init:

download-ivy:

init-ivy:

settings-ivy:

resolve:
:: loading settings :: file = /usr/local/continuous_builds/src/hiveopensource-0.17.1/hiveopensource_0_17_1/ivy/ivysettings.xml
[ivy:retrieve] :: resolving dependencies :: org.apache.hadoop.hive#ant;working@devbuild001.snc1.facebook.com
[ivy:retrieve] 	confs: [default]
[ivy:retrieve] :: resolution report :: resolve 13ms :: artifacts dl 0ms
	---------------------------------------------------------------------
	|                  |            modules            ||   artifacts   |
	|       conf       | number| search|dwnlded|evicted|| number|dwnlded|
	---------------------------------------------------------------------
	|      default     |   0   |   0   |   0   |   0   ||   0   |   0   |
	---------------------------------------------------------------------
[ivy:retrieve] :: retrieving :: org.apache.hadoop.hive#ant
[ivy:retrieve] 	confs: [default]
[ivy:retrieve] 	0 artifacts copied, 0 already retrieved (0kB/4ms)

install-hadoopcore:

compile:
     [echo] Compiling: anttasks

deploy-ant-tasks:

init:

download-ivy:

init-ivy:

settings-ivy:

resolve:
:: loading settings :: file = /usr/local/continuous_builds/src/hiveopensource-0.17.1/hiveopensource_0_17_1/ivy/ivysettings.xml
[ivy:retrieve] :: resolving dependencies :: org.apache.hadoop.hive#ant;working@devbuild001.snc1.facebook.com
[ivy:retrieve] 	confs: [default]
[ivy:retrieve] :: resolution report :: resolve 12ms :: artifacts dl 0ms
	---------------------------------------------------------------------
	|                  |            modules            ||   artifacts   |
	|       conf       | number| search|dwnlded|evicted|| number|dwnlded|
	---------------------------------------------------------------------
	|      default     |   0   |   0   |   0   |   0   ||   0   |   0   |
	---------------------------------------------------------------------
[ivy:retrieve] :: retrieving :: org.apache.hadoop.hive#ant
[ivy:retrieve] 	confs: [default]
[ivy:retrieve] 	0 artifacts copied, 0 already retrieved (0kB/3ms)

install-hadoopcore:

compile:
     [echo] Compiling: anttasks

jar:

deploy:
     [echo] hive: anttasks

configure:

compile:
     [echo] Compiling: ql

jar:
     [echo] Jar: ql
    [unzip] Expanding: /usr/local/continuous_builds/src/hiveopensource-0.17.1/hiveopensource_0_17_1/ql/lib/commons-jexl-1.1.jar
into /usr/local/continuous_builds/src/hiveopensource-0.17.1/hiveopensource_0_17_1/build/jexl/classes
    [unzip] Expanding: /usr/local/continuous_builds/src/hiveopensource-0.17.1/hiveopensource_0_17_1/lib/libthrift.jar
into /usr/local/continuous_builds/src/hiveopensource-0.17.1/hiveopensource_0_17_1/build/thrift/classes
    [unzip] Expanding: /usr/local/continuous_builds/src/hiveopensource-0.17.1/hiveopensource_0_17_1/lib/commons-lang-2.4.jar
into /usr/local/continuous_builds/src/hiveopensource-0.17.1/hiveopensource_0_17_1/build/commons-lang/classes
    [unzip] Expanding: /usr/local/continuous_builds/src/hiveopensource-0.17.1/hiveopensource_0_17_1/lib/json.jar
into /usr/local/continuous_builds/src/hiveopensource-0.17.1/hiveopensource_0_17_1/build/json/classes

deploy:
     [echo] hive: ql

init:
    [mkdir] Created dir: /usr/local/continuous_builds/src/hiveopensource-0.17.1/hiveopensource_0_17_1/build/cli/test
    [mkdir] Created dir: /usr/local/continuous_builds/src/hiveopensource-0.17.1/hiveopensource_0_17_1/build/cli/test/src
    [mkdir] Created dir: /usr/local/continuous_builds/src/hiveopensource-0.17.1/hiveopensource_0_17_1/build/cli/test/classes

download-ivy:

init-ivy:

settings-ivy:

resolve:
:: loading settings :: file = /usr/local/continuous_builds/src/hiveopensource-0.17.1/hiveopensource_0_17_1/ivy/ivysettings.xml
[ivy:retrieve] :: resolving dependencies :: org.apache.hadoop.hive#cli;working@devbuild001.snc1.facebook.com
[ivy:retrieve] 	confs: [default]
[ivy:retrieve] 	found hadoop#core;0.17.1 in hadoop-resolver
[ivy:retrieve] :: resolution report :: resolve 38ms :: artifacts dl 3ms
	---------------------------------------------------------------------
	|                  |            modules            ||   artifacts   |
	|       conf       | number| search|dwnlded|evicted|| number|dwnlded|
	---------------------------------------------------------------------
	|      default     |   1   |   0   |   0   |   0   ||   1   |   0   |
	---------------------------------------------------------------------
[ivy:retrieve] :: retrieving :: org.apache.hadoop.hive#cli
[ivy:retrieve] 	confs: [default]
[ivy:retrieve] 	0 artifacts copied, 1 already retrieved (0kB/5ms)

install-hadoopcore:

compile:
     [echo] Compiling: cli

jar:
     [echo] Jar: cli

deploy:
     [echo] hive: cli

init:
    [mkdir] Created dir: /usr/local/continuous_builds/src/hiveopensource-0.17.1/hiveopensource_0_17_1/build/service/test
    [mkdir] Created dir: /usr/local/continuous_builds/src/hiveopensource-0.17.1/hiveopensource_0_17_1/build/service/test/src
    [mkdir] Created dir: /usr/local/continuous_builds/src/hiveopensource-0.17.1/hiveopensource_0_17_1/build/service/test/classes

core-compile:

compile:

jar:
     [echo] Jar: service

deploy:
     [echo] hive: service

init:
    [mkdir] Created dir: /usr/local/continuous_builds/src/hiveopensource-0.17.1/hiveopensource_0_17_1/build/jdbc/test
    [mkdir] Created dir: /usr/local/continuous_builds/src/hiveopensource-0.17.1/hiveopensource_0_17_1/build/jdbc/test/src
    [mkdir] Created dir: /usr/local/continuous_builds/src/hiveopensource-0.17.1/hiveopensource_0_17_1/build/jdbc/test/classes

core-compile:

compile:

jar:
     [echo] Jar: jdbc

deploy:
     [echo] hive: jdbc

hwi-init:
    [mkdir] Created dir: /usr/local/continuous_builds/src/hiveopensource-0.17.1/hiveopensource_0_17_1/build/hwi/test/classes
    [mkdir] Created dir: /usr/local/continuous_builds/src/hiveopensource-0.17.1/hiveopensource_0_17_1/build/hwi/test/src

compile:
     [echo] Compiling: hwi
    [javac] Compiling 7 source files to /usr/local/continuous_builds/src/hiveopensource-0.17.1/hiveopensource_0_17_1/build/hwi/classes

jar:
     [echo] Jar: hwi
      [jar] Building jar: /usr/local/continuous_builds/src/hiveopensource-0.17.1/hiveopensource_0_17_1/build/hwi/hive_hwi.jar

deploy:
     [echo] hive: hwi
     [copy] Copying 1 file to /usr/local/continuous_builds/src/hiveopensource-0.17.1/hiveopensource_0_17_1/build

test:

test:
     [echo] Nothing to do!

test:
     [echo] Nothing to do!

test-conditions:

gen-test:

hwi-init:

compile:
     [echo] Compiling: hwi
    [javac] Compiling 7 source files to /usr/local/continuous_builds/src/hiveopensource-0.17.1/hiveopensource_0_17_1/build/hwi/classes

compile-test:
    [javac] Compiling 1 source file to /usr/local/continuous_builds/src/hiveopensource-0.17.1/hiveopensource_0_17_1/build/hwi/test/classes

test-jar:

test-init:
    [mkdir] Created dir: /usr/local/continuous_builds/src/hiveopensource-0.17.1/hiveopensource_0_17_1/build/hwi/test/data
    [mkdir] Created dir: /usr/local/continuous_builds/src/hiveopensource-0.17.1/hiveopensource_0_17_1/build/hwi/test/logs/clientpositive
    [mkdir] Created dir: /usr/local/continuous_builds/src/hiveopensource-0.17.1/hiveopensource_0_17_1/build/hwi/test/logs/clientnegative
    [mkdir] Created dir: /usr/local/continuous_builds/src/hiveopensource-0.17.1/hiveopensource_0_17_1/build/hwi/test/logs/positive
    [mkdir] Created dir: /usr/local/continuous_builds/src/hiveopensource-0.17.1/hiveopensource_0_17_1/build/hwi/test/logs/negative
     [copy] Copying 20 files to /usr/local/continuous_builds/src/hiveopensource-0.17.1/hiveopensource_0_17_1/build/hwi/test/data
     [copy] Copied 5 empty directories to 2 empty directories under /usr/local/continuous_builds/src/hiveopensource-0.17.1/hiveopensource_0_17_1/build/hwi/test/data

test:
    [junit] Running org.apache.hadoop.hive.hwi.TestHWISessionManager
    [junit] Hive history file=/usr/local/continuous_builds/src/hiveopensource-0.17.1/hiveopensource_0_17_1/hwi/../build/ql/tmp/hive_job_log_mvaradachari_200902031743_1448961764.txt
    [junit] Hive history file=/usr/local/continuous_builds/src/hiveopensource-0.17.1/hiveopensource_0_17_1/hwi/../build/ql/tmp/hive_job_log_mvaradachari_200902031743_-371738593.txt
    [junit] Hive history file=/usr/local/continuous_builds/src/hiveopensource-0.17.1/hiveopensource_0_17_1/hwi/../build/ql/tmp/hive_job_log_mvaradachari_200902031743_-53970574.txt
    [junit] OK
    [junit] Total MapReduce jobs = 2
    [junit] Total MapReduce jobs = 2
    [junit] Exception in thread "main" java.io.FileNotFoundException: File /usr/local/continuous_builds/src/hiveopensource-0.17.1/hiveopensource_0_17_1/build/ql/test/test-udfs.jar
does not exist.
    [junit] 	at org.apache.hadoop.mapred.JobShell.validateFiles(JobShell.java:129)
    [junit] 	at org.apache.hadoop.mapred.JobShell.run(JobShell.java:179)
    [junit] 	at org.apache.hadoop.util.ToolRunner.run(ToolRunner.java:65)
    [junit] 	at org.apache.hadoop.util.ToolRunner.run(ToolRunner.java:79)
    [junit] 	at org.apache.hadoop.mapred.JobShell.main(JobShell.java:220)
    [junit] FAILED: Execution Error, return code 1 from org.apache.hadoop.hive.ql.exec.MapRedTask
    [junit] Exception in thread "main" java.io.FileNotFoundException: File /usr/local/continuous_builds/src/hiveopensource-0.17.1/hiveopensource_0_17_1/build/ql/test/test-udfs.jar
does not exist.
    [junit] 	at org.apache.hadoop.mapred.JobShell.validateFiles(JobShell.java:129)
    [junit] 	at org.apache.hadoop.mapred.JobShell.run(JobShell.java:179)
    [junit] 	at org.apache.hadoop.util.ToolRunner.run(ToolRunner.java:65)
    [junit] 	at org.apache.hadoop.util.ToolRunner.run(ToolRunner.java:79)
    [junit] 	at org.apache.hadoop.mapred.JobShell.main(JobShell.java:220)
    [junit] FAILED: Execution Error, return code 1 from org.apache.hadoop.hive.ql.exec.MapRedTask
    [junit] Tests run: 1, Failures: 1, Errors: 0, Time elapsed: 17.037 sec
    [junit] Test org.apache.hadoop.hive.hwi.TestHWISessionManager FAILED

BUILD FAILED
/usr/local/continuous_builds/src/hiveopensource-0.17.1/hiveopensource_0_17_1/build.xml:117:
The following error occurred while executing this line:
/usr/local/continuous_builds/src/hiveopensource-0.17.1/hiveopensource_0_17_1/build-common.xml:268:
Tests failed!

Total time: 31 seconds
EXIT VALUE IS 1 for runtests

Mime
View raw message