hc-dev mailing list archives

Site index · List index
Message view « Date » · « Thread »
Top « Date » · « Thread »
From "ASF subversion and git services (JIRA)" <j...@apache.org>
Subject [jira] [Commented] (HTTPCLIENT-1866) Update HttpClient5 from Log4j 2.8.2 to 2.9.0.
Date Thu, 19 Oct 2017 14:20:00 GMT

    [ https://issues.apache.org/jira/browse/HTTPCLIENT-1866?page=com.atlassian.jira.plugin.system.issuetabpanels:comment-tabpanel&focusedCommentId=16211106#comment-16211106
] 

ASF subversion and git services commented on HTTPCLIENT-1866:
-------------------------------------------------------------

Commit 2155361d3b95355fa6ebaf3665a767ba46320538 in httpcomponents-client's branch refs/heads/master
from [~olegk]
[ https://git-wip-us.apache.org/repos/asf?p=httpcomponents-client.git;h=2155361 ]

HTTPCLIENT-1866: upgraded log4j to version 2.9.1


> Update HttpClient5 from Log4j 2.8.2 to 2.9.0.
> ---------------------------------------------
>
>                 Key: HTTPCLIENT-1866
>                 URL: https://issues.apache.org/jira/browse/HTTPCLIENT-1866
>             Project: HttpComponents HttpClient
>          Issue Type: Task
>    Affects Versions: 5.0 Alpha2
>            Reporter: Gary Gregory
>             Fix For: 5.0 Alpha3
>
>
> Update HttpClient5 from Log4j 2.8.2 to 2.9.0.
> We must use the Animal Sniffer plugin 1.16 as 1.15 give me the error below and 1.16 works
fine. In order to use 1.16 we must release the version 9 parent POM.
> {noformat}
> [INFO] ------------------------------------------------------------------------
> [INFO] Reactor Summary:
> [INFO]
> [INFO] Apache HttpComponents Client Parent ................ SUCCESS [  6.758 s]
> [INFO] Apache HttpClient .................................. FAILURE [ 14.413 s]
> [INFO] Apache HttpClient Fluent ........................... SKIPPED
> [INFO] Apache HttpClient Cache ............................ SKIPPED
> [INFO] Apache HttpClient Windows features ................. SKIPPED
> [INFO] Apache HttpClient Integration Tests ................ SKIPPED
> [INFO] Apache HttpClient OSGi bundle ...................... SKIPPED
> [INFO] ------------------------------------------------------------------------
> [INFO] BUILD FAILURE
> [INFO] ------------------------------------------------------------------------
> [INFO] Total time: 23.918 s
> [INFO] Finished at: 2017-09-03T13:13:40-06:00
> [INFO] Final Memory: 49M/483M
> [INFO] ------------------------------------------------------------------------
> [ERROR] Failed to execute goal org.codehaus.mojo:animal-sniffer-maven-plugin:1.15:check
(checkAPIcompatibility) on project httpclient5: Execution checkAPIcompatibility of goal org.codehaus.mojo:animal-sniffer-maven-plugin:1.15:check
failed.: IllegalArgumentException -> [Help 1]
> org.apache.maven.lifecycle.LifecycleExecutionException: Failed to execute goal org.codehaus.mojo:animal-sniffer-maven-plugin:1.15:check
(checkAPIcompatibility) on project httpclient5: Execution checkAPIcompatibility of goal org.codehaus.mojo:animal-sniffer-maven-plugin:1.15:check
failed.
>         at org.apache.maven.lifecycle.internal.MojoExecutor.execute(MojoExecutor.java:213)
>         at org.apache.maven.lifecycle.internal.MojoExecutor.execute(MojoExecutor.java:154)
>         at org.apache.maven.lifecycle.internal.MojoExecutor.execute(MojoExecutor.java:146)
>         at org.apache.maven.lifecycle.internal.LifecycleModuleBuilder.buildProject(LifecycleModuleBuilder.java:117)
>         at org.apache.maven.lifecycle.internal.LifecycleModuleBuilder.buildProject(LifecycleModuleBuilder.java:81)
>         at org.apache.maven.lifecycle.internal.builder.singlethreaded.SingleThreadedBuilder.build(SingleThreadedBuilder.java:51)
>         at org.apache.maven.lifecycle.internal.LifecycleStarter.execute(LifecycleStarter.java:128)
>         at org.apache.maven.DefaultMaven.doExecute(DefaultMaven.java:309)
>         at org.apache.maven.DefaultMaven.doExecute(DefaultMaven.java:194)
>         at org.apache.maven.DefaultMaven.execute(DefaultMaven.java:107)
>         at org.apache.maven.cli.MavenCli.execute(MavenCli.java:993)
>         at org.apache.maven.cli.MavenCli.doMain(MavenCli.java:345)
>         at org.apache.maven.cli.MavenCli.main(MavenCli.java:191)
>         at sun.reflect.NativeMethodAccessorImpl.invoke0(Native Method)
>         at sun.reflect.NativeMethodAccessorImpl.invoke(NativeMethodAccessorImpl.java:62)
>         at sun.reflect.DelegatingMethodAccessorImpl.invoke(DelegatingMethodAccessorImpl.java:43)
>         at java.lang.reflect.Method.invoke(Method.java:498)
>         at org.codehaus.plexus.classworlds.launcher.Launcher.launchEnhanced(Launcher.java:289)
>         at org.codehaus.plexus.classworlds.launcher.Launcher.launch(Launcher.java:229)
>         at org.codehaus.plexus.classworlds.launcher.Launcher.mainWithExitCode(Launcher.java:415)
>         at org.codehaus.plexus.classworlds.launcher.Launcher.main(Launcher.java:356)
> Caused by: org.apache.maven.plugin.PluginExecutionException: Execution checkAPIcompatibility
of goal org.codehaus.mojo:animal-sniffer-maven-plugin:1.15:check failed.
>         at org.apache.maven.plugin.DefaultBuildPluginManager.executeMojo(DefaultBuildPluginManager.java:145)
>         at org.apache.maven.lifecycle.internal.MojoExecutor.execute(MojoExecutor.java:208)
>         ... 20 more
> Caused by: java.lang.IllegalArgumentException
>         at org.objectweb.asm.ClassReader.<init>(Unknown Source)
>         at org.objectweb.asm.ClassReader.<init>(Unknown Source)
>         at org.objectweb.asm.ClassReader.<init>(Unknown Source)
>         at org.codehaus.mojo.animal_sniffer.ClassListBuilder.process(ClassListBuilder.java:71)
>         at org.codehaus.mojo.animal_sniffer.ClassFileVisitor.processJarFile(ClassFileVisitor.java:153)
>         at org.codehaus.mojo.animal_sniffer.ClassFileVisitor.process(ClassFileVisitor.java:105)
>         at org.codehaus.mojo.animal_sniffer.maven.CheckSignatureMojo.apply(CheckSignatureMojo.java:377)
>         at org.codehaus.mojo.animal_sniffer.maven.CheckSignatureMojo.buildPackageList(CheckSignatureMojo.java:324)
>         at org.codehaus.mojo.animal_sniffer.maven.CheckSignatureMojo.execute(CheckSignatureMojo.java:227)
>         at org.apache.maven.plugin.DefaultBuildPluginManager.executeMojo(DefaultBuildPluginManager.java:134)
>         ... 21 more
> [ERROR]
> [ERROR]
> [ERROR] For more information about the errors and possible solutions, please read the
following articles:
> [ERROR] [Help 1] http://cwiki.apache.org/confluence/display/MAVEN/PluginExecutionException
> [ERROR]
> [ERROR] After correcting the problems, you can resume the build with the command
> [ERROR]   mvn <goals> -rf :httpclient5
> {noformat}



--
This message was sent by Atlassian JIRA
(v6.4.14#64029)

---------------------------------------------------------------------
To unsubscribe, e-mail: dev-unsubscribe@hc.apache.org
For additional commands, e-mail: dev-help@hc.apache.org


Mime
View raw message