hc-dev mailing list archives

Site index · List index
Message view « Date » · « Thread »
Top « Date » · « Thread »
From Gary Gregory <garydgreg...@gmail.com>
Subject Fwd: Build failed in Jenkins: httpcomponents-client-4.6.x #1
Date Wed, 17 May 2017 17:08:57 GMT
It looks like we need to turn off host name verification for tests.

Gary
---------- Forwarded message ----------
From: Apache Jenkins Server <jenkins@builds.apache.org>
Date: Wed, May 17, 2017 at 6:15 AM
Subject: Build failed in Jenkins: httpcomponents-client-4.6.x #1
To: commits@hc.apache.org


See <https://builds.apache.org/job/httpcomponents-client-4.6.
x/1/display/redirect>

------------------------------------------
[...truncated 31.82 KB...]
        at org.apache.maven.lifecycle.internal.LifecycleStarter.
execute(LifecycleStarter.java:161)
        at org.apache.maven.DefaultMaven.doExecute(DefaultMaven.java:320)
        at org.apache.maven.DefaultMaven.execute(DefaultMaven.java:156)
        at org.jvnet.hudson.maven3.launcher.Maven3Launcher.main(
Maven3Launcher.java:117)
        at sun.reflect.NativeMethodAccessorImpl.invoke0(Native Method)
        at sun.reflect.NativeMethodAccessorImpl.invoke(
NativeMethodAccessorImpl.java:57)
        at sun.reflect.DelegatingMethodAccessorImpl.invoke(
DelegatingMethodAccessorImpl.java:43)
        at java.lang.reflect.Method.invoke(Method.java:606)
        at org.codehaus.plexus.classworlds.launcher.Launcher.
launchStandard(Launcher.java:329)
        at org.codehaus.plexus.classworlds.launcher.Launcher.
launch(Launcher.java:239)
        at org.jvnet.hudson.maven3.agent.Maven3Main.launch(Maven3Main.
java:181)
        at sun.reflect.NativeMethodAccessorImpl.invoke0(Native Method)
        at sun.reflect.NativeMethodAccessorImpl.invoke(
NativeMethodAccessorImpl.java:57)
        at sun.reflect.DelegatingMethodAccessorImpl.invoke(
DelegatingMethodAccessorImpl.java:43)
        at java.lang.reflect.Method.invoke(Method.java:606)
        at hudson.maven.Maven3Builder.call(Maven3Builder.java:139)
        at hudson.maven.Maven3Builder.call(Maven3Builder.java:70)
        at hudson.remoting.UserRequest.perform(UserRequest.java:153)
        at hudson.remoting.UserRequest.perform(UserRequest.java:50)
        at hudson.remoting.Request$2.run(Request.java:336)
        at hudson.remoting.InterceptingExecutorService$1.call(
InterceptingExecutorService.java:68)
        at java.util.concurrent.FutureTask.run(FutureTask.java:262)
        at java.util.concurrent.ThreadPoolExecutor.runWorker(
ThreadPoolExecutor.java:1145)
        at java.util.concurrent.ThreadPoolExecutor$Worker.run(
ThreadPoolExecutor.java:615)
        at java.lang.Thread.run(Thread.java:745)
Caused by: javax.net.ssl.SSLException: hostname in certificate didn't
match: <publicsuffix.org> != <generic-san.mozilla.org> OR <
generic-san.mozilla.org> OR <air.mozilla.org> OR <outgoing.mozilla.org> OR
<
securitywiki.mozilla.org> OR <wiki.mozilla.org> OR <www.itisatrap.org> OR <
itisatrap.org> OR <calendar.mozilla.org> OR <moztrap.mozilla.org> OR <
pto.mozilla.org> OR <mx.thunderbird.net> OR <broker.thunderbird.net> OR <
intranet.mozilla.org> OR <iplimit.irc.mozilla.org> OR <m.wiki.mozilla.org>
OR <fb-affiliates.mozilla.org> OR <getfirebug.com> OR <www.getfirebug.com>
OR <phonebook.mozilla.org> OR <passwordreset.mozilla.org> OR <www.webfwd.org>
OR <webfwd.net> OR <www.webfwd.net> OR <webfwd.org> OR <planet.mozilla.org>
OR <planet.mozilla.de> OR <planet.firefox.com> OR <planet.webmademovies.org>
OR <flashblock.itisatrap.org> OR <except.flashallow.itisatrap.org> OR <
except.flashblock.itisatrap.org> OR <flashallow.itisatrap.org> OR <
flashsubdoc.itisatrap.org> OR <except.flashsubdoc.itisatrap.org> OR <
krakenbenchmark.mozilla.org> OR <www.seamonkeyproject.org> OR <
seamonkeyproject.org> OR <www.seamonkey-project.org> OR <
seamonkey-project.org>
        at org.apache.maven.wagon.providers.http.httpclient.
conn.ssl.AbstractVerifier.verify(AbstractVerifier.java:227)
        at org.apache.maven.wagon.providers.http.httpclient.conn.ssl.
BrowserCompatHostnameVerifier.verify(BrowserCompatHostnameVerifier.java:54)
        at org.apache.maven.wagon.providers.http.httpclient.
conn.ssl.AbstractVerifier.verify(AbstractVerifier.java:147)
        at org.apache.maven.wagon.providers.http.httpclient.
conn.ssl.AbstractVerifier.verify(AbstractVerifier.java:128)
        at org.apache.maven.wagon.providers.http.httpclient.
conn.ssl.SSLSocketFactory.connectSocket(SSLSocketFactory.java:572)
        at org.apache.maven.wagon.shared.http4.
ConfigurableSSLSocketFactoryDecorator.connectSocket(
ConfigurableSSLSocketFactoryDecorator.java:64)
        at org.apache.maven.wagon.providers.http.httpclient.impl.conn.
DefaultClientConnectionOperator.openConnection(
DefaultClientConnectionOperator.java:180)
        at org.apache.maven.wagon.providers.http.httpclient.impl.conn.
ManagedClientConnectionImpl.open(ManagedClientConnectionImpl.java:294)
        at org.apache.maven.wagon.providers.http.httpclient.impl.client.
DefaultRequestDirector.tryConnect(DefaultRequestDirector.java:645)
        at org.apache.maven.wagon.providers.http.httpclient.impl.client.
DefaultRequestDirector.execute(DefaultRequestDirector.java:480)
        at org.apache.maven.wagon.providers.http.httpclient.impl.client.
AbstractHttpClient.execute(AbstractHttpClient.java:906)
        at org.apache.maven.wagon.providers.http.httpclient.impl.client.
AbstractHttpClient.execute(AbstractHttpClient.java:805)
        at org.apache.maven.wagon.shared.http4.AbstractHttpClientWagon.
execute(AbstractHttpClientWagon.java:746)
        at org.apache.maven.wagon.shared.http4.AbstractHttpClientWagon.
fillInputData(AbstractHttpClientWagon.java:886)
        ... 37 more
[WARNING] Retrying (1 more)
Downloading: https://publicsuffix.org/list//effective_tld_names.dat
javax.net.ssl.SSLException: hostname in certificate didn't match: <
publicsuffix.org> != <generic-san.mozilla.org> OR <generic-san.mozilla.org>
OR <air.mozilla.org> OR <outgoing.mozilla.org> OR <securitywiki.mozilla.org>
OR <wiki.mozilla.org> OR <www.itisatrap.org> OR <itisatrap.org> OR <
calendar.mozilla.org> OR <moztrap.mozilla.org> OR <pto.mozilla.org> OR <
mx.thunderbird.net> OR <broker.thunderbird.net> OR <intranet.mozilla.org>
OR <iplimit.irc.mozilla.org> OR <m.wiki.mozilla.org> OR <
fb-affiliates.mozilla.org> OR <getfirebug.com> OR <www.getfirebug.com> OR <
phonebook.mozilla.org> OR <passwordreset.mozilla.org> OR <www.webfwd.org>
OR <webfwd.net> OR <www.webfwd.net> OR <webfwd.org> OR <planet.mozilla.org>
OR <planet.mozilla.de> OR <planet.firefox.com> OR <planet.webmademovies.org>
OR <flashblock.itisatrap.org> OR <except.flashallow.itisatrap.org> OR <
except.flashblock.itisatrap.org> OR <flashallow.itisatrap.org> OR <
flashsubdoc.itisatrap.org> OR <except.flashsubdoc.itisatrap.org> OR <
krakenbenchmark.mozilla.org> OR <www.seamonkeyproject.org> OR <
seamonkeyproject.org> OR <www.seamonkey-project.org> OR <
seamonkey-project.org>
        at org.apache.maven.wagon.providers.http.httpclient.
conn.ssl.AbstractVerifier.verify(AbstractVerifier.java:227)
        at org.apache.maven.wagon.providers.http.httpclient.conn.ssl.
BrowserCompatHostnameVerifier.verify(BrowserCompatHostnameVerifier.java:54)
        at org.apache.maven.wagon.providers.http.httpclient.
conn.ssl.AbstractVerifier.verify(AbstractVerifier.java:147)
        at org.apache.maven.wagon.providers.http.httpclient.
conn.ssl.AbstractVerifier.verify(AbstractVerifier.java:128)
        at org.apache.maven.wagon.providers.http.httpclient.
conn.ssl.SSLSocketFactory.connectSocket(SSLSocketFactory.java:572)
        at org.apache.maven.wagon.shared.http4.
ConfigurableSSLSocketFactoryDecorator.connectSocket(
ConfigurableSSLSocketFactoryDecorator.java:64)
        at org.apache.maven.wagon.providers.http.httpclient.impl.conn.
DefaultClientConnectionOperator.openConnection(
DefaultClientConnectionOperator.java:180)
        at org.apache.maven.wagon.providers.http.httpclient.impl.conn.
ManagedClientConnectionImpl.open(ManagedClientConnectionImpl.java:294)
        at org.apache.maven.wagon.providers.http.httpclient.impl.client.
DefaultRequestDirector.tryConnect(DefaultRequestDirector.java:645)
        at org.apache.maven.wagon.providers.http.httpclient.impl.client.
DefaultRequestDirector.execute(DefaultRequestDirector.java:480)
        at org.apache.maven.wagon.providers.http.httpclient.impl.client.
AbstractHttpClient.execute(AbstractHttpClient.java:906)
        at org.apache.maven.wagon.providers.http.httpclient.impl.client.
AbstractHttpClient.execute(AbstractHttpClient.java:805)
        at org.apache.maven.wagon.shared.http4.AbstractHttpClientWagon.
execute(AbstractHttpClientWagon.java:746)
        at org.apache.maven.wagon.shared.http4.AbstractHttpClientWagon.
fillInputData(AbstractHttpClientWagon.java:886)
        at org.apache.maven.wagon.StreamWagon.getInputStream(
StreamWagon.java:116)
        at org.apache.maven.wagon.StreamWagon.getIfNewer(
StreamWagon.java:88)
        at org.apache.maven.wagon.StreamWagon.get(StreamWagon.java:61)
        at com.googlecode.WGet.doGet(WGet.java:293)
        at com.googlecode.WGet.execute(WGet.java:223)
        at org.apache.maven.plugin.DefaultBuildPluginManager.executeMojo(
DefaultBuildPluginManager.java:101)
        at org.apache.maven.lifecycle.internal.MojoExecutor.execute(
MojoExecutor.java:209)
        at org.apache.maven.lifecycle.internal.MojoExecutor.execute(
MojoExecutor.java:153)
        at org.apache.maven.lifecycle.internal.MojoExecutor.execute(
MojoExecutor.java:145)
        at org.apache.maven.lifecycle.internal.LifecycleModuleBuilder.
buildProject(LifecycleModuleBuilder.java:84)
        at org.apache.maven.lifecycle.internal.LifecycleModuleBuilder.
buildProject(LifecycleModuleBuilder.java:59)
        at org.apache.maven.lifecycle.internal.LifecycleStarter.
singleThreadedBuild(LifecycleStarter.java:183)
        at org.apache.maven.lifecycle.internal.LifecycleStarter.
execute(LifecycleStarter.java:161)
        at org.apache.maven.DefaultMaven.doExecute(DefaultMaven.java:320)
        at org.apache.maven.DefaultMaven.execute(DefaultMaven.java:156)
        at org.jvnet.hudson.maven3.launcher.Maven3Launcher.main(
Maven3Launcher.java:117)
        at sun.reflect.NativeMethodAccessorImpl.invoke0(Native Method)
        at sun.reflect.NativeMethodAccessorImpl.invoke(
NativeMethodAccessorImpl.java:57)
        at sun.reflect.DelegatingMethodAccessorImpl.invoke(
DelegatingMethodAccessorImpl.java:43)
        at java.lang.reflect.Method.invoke(Method.java:606)
        at org.codehaus.plexus.classworlds.launcher.Launcher.
launchStandard(Launcher.java:329)
        at org.codehaus.plexus.classworlds.launcher.Launcher.
launch(Launcher.java:239)
        at org.jvnet.hudson.maven3.agent.Maven3Main.launch(Maven3Main.
java:181)
        at sun.reflect.NativeMethodAccessorImpl.invoke0(Native Method)
        at sun.reflect.NativeMethodAccessorImpl.invoke(
NativeMethodAccessorImpl.java:57)
        at sun.reflect.DelegatingMethodAccessorImpl.invoke(
DelegatingMethodAccessorImpl.java:43)
        at java.lang.reflect.Method.invoke(Method.java:606)
        at hudson.maven.Maven3Builder.call(Maven3Builder.java:139)
        at hudson.maven.Maven3Builder.call(Maven3Builder.java:70)
        at hudson.remoting.UserRequest.perform(UserRequest.java:153)
        at hudson.remoting.UserRequest.perform(UserRequest.java:50)
        at hudson.remoting.Request$2.run(Request.java:336)
        at hudson.remoting.InterceptingExecutorService$1.call(
InterceptingExecutorService.java:68)
        at java.util.concurrent.FutureTask.run(FutureTask.java:262)
        at java.util.concurrent.ThreadPoolExecutor.runWorker(
ThreadPoolExecutor.java:1145)
        at java.util.concurrent.ThreadPoolExecutor$Worker.run(
ThreadPoolExecutor.java:615)
        at java.lang.Thread.run(Thread.java:745)
org.apache.maven.wagon.TransferFailedException: hostname in certificate
didn't match: <publicsuffix.org> != <generic-san.mozilla.org> OR <
generic-san.mozilla.org> OR <air.mozilla.org> OR <outgoing.mozilla.org> OR
<
securitywiki.mozilla.org> OR <wiki.mozilla.org> OR <www.itisatrap.org> OR <
itisatrap.org> OR <calendar.mozilla.org> OR <moztrap.mozilla.org> OR <
pto.mozilla.org> OR <mx.thunderbird.net> OR <broker.thunderbird.net> OR <
intranet.mozilla.org> OR <iplimit.irc.mozilla.org> OR <m.wiki.mozilla.org>
OR <fb-affiliates.mozilla.org> OR <getfirebug.com> OR <www.getfirebug.com>
OR <phonebook.mozilla.org> OR <passwordreset.mozilla.org> OR <www.webfwd.org>
OR <webfwd.net> OR <www.webfwd.net> OR <webfwd.org> OR <planet.mozilla.org>
OR <planet.mozilla.de> OR <planet.firefox.com> OR <planet.webmademovies.org>
OR <flashblock.itisatrap.org> OR <except.flashallow.itisatrap.org> OR <
except.flashblock.itisatrap.org> OR <flashallow.itisatrap.org> OR <
flashsubdoc.itisatrap.org> OR <except.flashsubdoc.itisatrap.org> OR <
krakenbenchmark.mozilla.org> OR <www.seamonkeyproject.org> OR <
seamonkeyproject.org> OR <www.seamonkey-project.org> OR <
seamonkey-project.org>
        at org.apache.maven.wagon.shared.http4.AbstractHttpClientWagon.
fillInputData(AbstractHttpClientWagon.java:892)
        at org.apache.maven.wagon.StreamWagon.getInputStream(
StreamWagon.java:116)
        at org.apache.maven.wagon.StreamWagon.getIfNewer(
StreamWagon.java:88)
        at org.apache.maven.wagon.StreamWagon.get(StreamWagon.java:61)
        at com.googlecode.WGet.doGet(WGet.java:293)
        at com.googlecode.WGet.execute(WGet.java:223)
        at org.apache.maven.plugin.DefaultBuildPluginManager.executeMojo(
DefaultBuildPluginManager.java:101)
        at org.apache.maven.lifecycle.internal.MojoExecutor.execute(
MojoExecutor.java:209)
        at org.apache.maven.lifecycle.internal.MojoExecutor.execute(
MojoExecutor.java:153)
        at org.apache.maven.lifecycle.internal.MojoExecutor.execute(
MojoExecutor.java:145)
        at org.apache.maven.lifecycle.internal.LifecycleModuleBuilder.
buildProject(LifecycleModuleBuilder.java:84)
        at org.apache.maven.lifecycle.internal.LifecycleModuleBuilder.
buildProject(LifecycleModuleBuilder.java:59)
        at org.apache.maven.lifecycle.internal.LifecycleStarter.
singleThreadedBuild(LifecycleStarter.java:183)
        at org.apache.maven.lifecycle.internal.LifecycleStarter.
execute(LifecycleStarter.java:161)
        at org.apache.maven.DefaultMaven.doExecute(DefaultMaven.java:320)
        at org.apache.maven.DefaultMaven.execute(DefaultMaven.java:156)
        at org.jvnet.hudson.maven3.launcher.Maven3Launcher.main(
Maven3Launcher.java:117)
        at sun.reflect.NativeMethodAccessorImpl.invoke0(Native Method)
        at sun.reflect.NativeMethodAccessorImpl.invoke(
NativeMethodAccessorImpl.java:57)
        at sun.reflect.DelegatingMethodAccessorImpl.invoke(
DelegatingMethodAccessorImpl.java:43)
        at java.lang.reflect.Method.invoke(Method.java:606)
        at org.codehaus.plexus.classworlds.launcher.Launcher.
launchStandard(Launcher.java:329)
        at org.codehaus.plexus.classworlds.launcher.Launcher.
launch(Launcher.java:239)
        at org.jvnet.hudson.maven3.agent.Maven3Main.launch(Maven3Main.
java:181)
        at sun.reflect.NativeMethodAccessorImpl.invoke0(Native Method)
        at sun.reflect.NativeMethodAccessorImpl.invoke(
NativeMethodAccessorImpl.java:57)
        at sun.reflect.DelegatingMethodAccessorImpl.invoke(
DelegatingMethodAccessorImpl.java:43)
        at java.lang.reflect.Method.invoke(Method.java:606)
        at hudson.maven.Maven3Builder.call(Maven3Builder.java:139)
        at hudson.maven.Maven3Builder.call(Maven3Builder.java:70)
        at hudson.remoting.UserRequest.perform(UserRequest.java:153)
        at hudson.remoting.UserRequest.perform(UserRequest.java:50)
        at hudson.remoting.Request$2.run(Request.java:336)
        at hudson.remoting.InterceptingExecutorService$1.call(
InterceptingExecutorService.java:68)
        at java.util.concurrent.FutureTask.run(FutureTask.java:262)
        at java.util.concurrent.ThreadPoolExecutor.runWorker(
ThreadPoolExecutor.java:1145)
        at java.util.concurrent.ThreadPoolExecutor$Worker.run(
ThreadPoolExecutor.java:615)
        at java.lang.Thread.run(Thread.java:745)
Caused by: javax.net.ssl.SSLException: hostname in certificate didn't
match: <publicsuffix.org> != <generic-san.mozilla.org> OR <
generic-san.mozilla.org> OR <air.mozilla.org> OR <outgoing.mozilla.org> OR
<
securitywiki.mozilla.org> OR <wiki.mozilla.org> OR <www.itisatrap.org> OR <
itisatrap.org> OR <calendar.mozilla.org> OR <moztrap.mozilla.org> OR <
pto.mozilla.org> OR <mx.thunderbird.net> OR <broker.thunderbird.net> OR <
intranet.mozilla.org> OR <iplimit.irc.mozilla.org> OR <m.wiki.mozilla.org>
OR <fb-affiliates.mozilla.org> OR <getfirebug.com> OR <www.getfirebug.com>
OR <phonebook.mozilla.org> OR <passwordreset.mozilla.org> OR <www.webfwd.org>
OR <webfwd.net> OR <www.webfwd.net> OR <webfwd.org> OR <planet.mozilla.org>
OR <planet.mozilla.de> OR <planet.firefox.com> OR <planet.webmademovies.org>
OR <flashblock.itisatrap.org> OR <except.flashallow.itisatrap.org> OR <
except.flashblock.itisatrap.org> OR <flashallow.itisatrap.org> OR <
flashsubdoc.itisatrap.org> OR <except.flashsubdoc.itisatrap.org> OR <
krakenbenchmark.mozilla.org> OR <www.seamonkeyproject.org> OR <
seamonkeyproject.org> OR <www.seamonkey-project.org> OR <
seamonkey-project.org>
        at org.apache.maven.wagon.providers.http.httpclient.
conn.ssl.AbstractVerifier.verify(AbstractVerifier.java:227)
        at org.apache.maven.wagon.providers.http.httpclient.conn.ssl.
BrowserCompatHostnameVerifier.verify(BrowserCompatHostnameVerifier.java:54)
        at org.apache.maven.wagon.providers.http.httpclient.
conn.ssl.AbstractVerifier.verify(AbstractVerifier.java:147)
        at org.apache.maven.wagon.providers.http.httpclient.
conn.ssl.AbstractVerifier.verify(AbstractVerifier.java:128)
        at org.apache.maven.wagon.providers.http.httpclient.
conn.ssl.SSLSocketFactory.connectSocket(SSLSocketFactory.java:572)
        at org.apache.maven.wagon.shared.http4.
ConfigurableSSLSocketFactoryDecorator.connectSocket(
ConfigurableSSLSocketFactoryDecorator.java:64)
        at org.apache.maven.wagon.providers.http.httpclient.impl.conn.
DefaultClientConnectionOperator.openConnection(
DefaultClientConnectionOperator.java:180)
        at org.apache.maven.wagon.providers.http.httpclient.impl.conn.
ManagedClientConnectionImpl.open(ManagedClientConnectionImpl.java:294)
        at org.apache.maven.wagon.providers.http.httpclient.impl.client.
DefaultRequestDirector.tryConnect(DefaultRequestDirector.java:645)
        at org.apache.maven.wagon.providers.http.httpclient.impl.client.
DefaultRequestDirector.execute(DefaultRequestDirector.java:480)
        at org.apache.maven.wagon.providers.http.httpclient.impl.client.
AbstractHttpClient.execute(AbstractHttpClient.java:906)
        at org.apache.maven.wagon.providers.http.httpclient.impl.client.
AbstractHttpClient.execute(AbstractHttpClient.java:805)
        at org.apache.maven.wagon.shared.http4.AbstractHttpClientWagon.
execute(AbstractHttpClientWagon.java:746)
        at org.apache.maven.wagon.shared.http4.AbstractHttpClientWagon.
fillInputData(AbstractHttpClientWagon.java:886)
        ... 37 more
[WARNING] Could not get content
org.apache.maven.wagon.TransferFailedException: hostname in certificate
didn't match: <publicsuffix.org> != <generic-san.mozilla.org> OR <
generic-san.mozilla.org> OR <air.mozilla.org> OR <outgoing.mozilla.org> OR
<
securitywiki.mozilla.org> OR <wiki.mozilla.org> OR <www.itisatrap.org> OR <
itisatrap.org> OR <calendar.mozilla.org> OR <moztrap.mozilla.org> OR <
pto.mozilla.org> OR <mx.thunderbird.net> OR <broker.thunderbird.net> OR <
intranet.mozilla.org> OR <iplimit.irc.mozilla.org> OR <m.wiki.mozilla.org>
OR <fb-affiliates.mozilla.org> OR <getfirebug.com> OR <www.getfirebug.com>
OR <phonebook.mozilla.org> OR <passwordreset.mozilla.org> OR <www.webfwd.org>
OR <webfwd.net> OR <www.webfwd.net> OR <webfwd.org> OR <planet.mozilla.org>
OR <planet.mozilla.de> OR <planet.firefox.com> OR <planet.webmademovies.org>
OR <flashblock.itisatrap.org> OR <except.flashallow.itisatrap.org> OR <
except.flashblock.itisatrap.org> OR <flashallow.itisatrap.org> OR <
flashsubdoc.itisatrap.org> OR <except.flashsubdoc.itisatrap.org> OR <
krakenbenchmark.mozilla.org> OR <www.seamonkeyproject.org> OR <
seamonkeyproject.org> OR <www.seamonkey-project.org> OR <
seamonkey-project.org>
        at org.apache.maven.wagon.shared.http4.AbstractHttpClientWagon.
fillInputData(AbstractHttpClientWagon.java:892)
        at org.apache.maven.wagon.StreamWagon.getInputStream(
StreamWagon.java:116)
        at org.apache.maven.wagon.StreamWagon.getIfNewer(
StreamWagon.java:88)
        at org.apache.maven.wagon.StreamWagon.get(StreamWagon.java:61)
        at com.googlecode.WGet.doGet(WGet.java:293)
        at com.googlecode.WGet.execute(WGet.java:223)
        at org.apache.maven.plugin.DefaultBuildPluginManager.executeMojo(
DefaultBuildPluginManager.java:101)
        at org.apache.maven.lifecycle.internal.MojoExecutor.execute(
MojoExecutor.java:209)
        at org.apache.maven.lifecycle.internal.MojoExecutor.execute(
MojoExecutor.java:153)
        at org.apache.maven.lifecycle.internal.MojoExecutor.execute(
MojoExecutor.java:145)
        at org.apache.maven.lifecycle.internal.LifecycleModuleBuilder.
buildProject(LifecycleModuleBuilder.java:84)
        at org.apache.maven.lifecycle.internal.LifecycleModuleBuilder.
buildProject(LifecycleModuleBuilder.java:59)
        at org.apache.maven.lifecycle.internal.LifecycleStarter.
singleThreadedBuild(LifecycleStarter.java:183)
        at org.apache.maven.lifecycle.internal.LifecycleStarter.
execute(LifecycleStarter.java:161)
        at org.apache.maven.DefaultMaven.doExecute(DefaultMaven.java:320)
        at org.apache.maven.DefaultMaven.execute(DefaultMaven.java:156)
        at org.jvnet.hudson.maven3.launcher.Maven3Launcher.main(
Maven3Launcher.java:117)
        at sun.reflect.NativeMethodAccessorImpl.invoke0(Native Method)
        at sun.reflect.NativeMethodAccessorImpl.invoke(
NativeMethodAccessorImpl.java:57)
        at sun.reflect.DelegatingMethodAccessorImpl.invoke(
DelegatingMethodAccessorImpl.java:43)
        at java.lang.reflect.Method.invoke(Method.java:606)
        at org.codehaus.plexus.classworlds.launcher.Launcher.
launchStandard(Launcher.java:329)
        at org.codehaus.plexus.classworlds.launcher.Launcher.
launch(Launcher.java:239)
        at org.jvnet.hudson.maven3.agent.Maven3Main.launch(Maven3Main.
java:181)
        at sun.reflect.NativeMethodAccessorImpl.invoke0(Native Method)
        at sun.reflect.NativeMethodAccessorImpl.invoke(
NativeMethodAccessorImpl.java:57)
        at sun.reflect.DelegatingMethodAccessorImpl.invoke(
DelegatingMethodAccessorImpl.java:43)
        at java.lang.reflect.Method.invoke(Method.java:606)
        at hudson.maven.Maven3Builder.call(Maven3Builder.java:139)
        at hudson.maven.Maven3Builder.call(Maven3Builder.java:70)
        at hudson.remoting.UserRequest.perform(UserRequest.java:153)
        at hudson.remoting.UserRequest.perform(UserRequest.java:50)
        at hudson.remoting.Request$2.run(Request.java:336)
        at hudson.remoting.InterceptingExecutorService$1.call(
InterceptingExecutorService.java:68)
        at java.util.concurrent.FutureTask.run(FutureTask.java:262)
        at java.util.concurrent.ThreadPoolExecutor.runWorker(
ThreadPoolExecutor.java:1145)
        at java.util.concurrent.ThreadPoolExecutor$Worker.run(
ThreadPoolExecutor.java:615)
        at java.lang.Thread.run(Thread.java:745)
Caused by: javax.net.ssl.SSLException: hostname in certificate didn't
match: <publicsuffix.org> != <generic-san.mozilla.org> OR <
generic-san.mozilla.org> OR <air.mozilla.org> OR <outgoing.mozilla.org> OR
<
securitywiki.mozilla.org> OR <wiki.mozilla.org> OR <www.itisatrap.org> OR <
itisatrap.org> OR <calendar.mozilla.org> OR <moztrap.mozilla.org> OR <
pto.mozilla.org> OR <mx.thunderbird.net> OR <broker.thunderbird.net> OR <
intranet.mozilla.org> OR <iplimit.irc.mozilla.org> OR <m.wiki.mozilla.org>
OR <fb-affiliates.mozilla.org> OR <getfirebug.com> OR <www.getfirebug.com>
OR <phonebook.mozilla.org> OR <passwordreset.mozilla.org> OR <www.webfwd.org>
OR <webfwd.net> OR <www.webfwd.net> OR <webfwd.org> OR <planet.mozilla.org>
OR <planet.mozilla.de> OR <planet.firefox.com> OR <planet.webmademovies.org>
OR <flashblock.itisatrap.org> OR <except.flashallow.itisatrap.org> OR <
except.flashblock.itisatrap.org> OR <flashallow.itisatrap.org> OR <
flashsubdoc.itisatrap.org> OR <except.flashsubdoc.itisatrap.org> OR <
krakenbenchmark.mozilla.org> OR <www.seamonkeyproject.org> OR <
seamonkeyproject.org> OR <www.seamonkey-project.org> OR <
seamonkey-project.org>
        at org.apache.maven.wagon.providers.http.httpclient.
conn.ssl.AbstractVerifier.verify(AbstractVerifier.java:227)
        at org.apache.maven.wagon.providers.http.httpclient.conn.ssl.
BrowserCompatHostnameVerifier.verify(BrowserCompatHostnameVerifier.java:54)
        at org.apache.maven.wagon.providers.http.httpclient.
conn.ssl.AbstractVerifier.verify(AbstractVerifier.java:147)
        at org.apache.maven.wagon.providers.http.httpclient.
conn.ssl.AbstractVerifier.verify(AbstractVerifier.java:128)
        at org.apache.maven.wagon.providers.http.httpclient.
conn.ssl.SSLSocketFactory.connectSocket(SSLSocketFactory.java:572)
        at org.apache.maven.wagon.shared.http4.
ConfigurableSSLSocketFactoryDecorator.connectSocket(
ConfigurableSSLSocketFactoryDecorator.java:64)
        at org.apache.maven.wagon.providers.http.httpclient.impl.conn.
DefaultClientConnectionOperator.openConnection(
DefaultClientConnectionOperator.java:180)
        at org.apache.maven.wagon.providers.http.httpclient.impl.conn.
ManagedClientConnectionImpl.open(ManagedClientConnectionImpl.java:294)
        at org.apache.maven.wagon.providers.http.httpclient.impl.client.
DefaultRequestDirector.tryConnect(DefaultRequestDirector.java:645)
        at org.apache.maven.wagon.providers.http.httpclient.impl.client.
DefaultRequestDirector.execute(DefaultRequestDirector.java:480)
        at org.apache.maven.wagon.providers.http.httpclient.impl.client.
AbstractHttpClient.execute(AbstractHttpClient.java:906)
        at org.apache.maven.wagon.providers.http.httpclient.impl.client.
AbstractHttpClient.execute(AbstractHttpClient.java:805)
        at org.apache.maven.wagon.shared.http4.AbstractHttpClientWagon.
execute(AbstractHttpClientWagon.java:746)
        at org.apache.maven.wagon.shared.http4.AbstractHttpClientWagon.
fillInputData(AbstractHttpClientWagon.java:886)
        ... 37 more
[INFO] ------------------------------------------------------------
------------
[INFO] Reactor Summary:
[INFO]
[INFO] Apache HttpComponents Client ...................... SUCCESS [15.494s]
[INFO] Apache HttpClient ................................. FAILURE [11.429s]
[INFO] Apache HttpClient Mime ............................ SKIPPED
[INFO] Apache HttpClient Fluent API ...................... SKIPPED
[INFO] Apache HttpClient Cache ........................... SKIPPED
[INFO] Apache HttpClient Windows features ................ SKIPPED
[INFO] Apache HttpClient OSGi bundle ..................... SKIPPED
[INFO] ------------------------------------------------------------
------------
[INFO] BUILD FAILURE
[INFO] ------------------------------------------------------------
------------
[INFO] Total time: 36.845s
[INFO] Finished at: Wed May 17 13:14:33 UTC 2017
[INFO] Final Memory: 52M/700M
[INFO] ------------------------------------------------------------
------------
Waiting for Jenkins to finish collecting data
[ERROR] Failed to execute goal com.googlecode.maven-download-
plugin:download-maven-plugin:1.2.0:wget (download-public-suffix-list) on
project httpclient: IO Error: Could not get content -> [Help 1]
[ERROR]
[ERROR] To see the full stack trace of the errors, re-run Maven with the -e
switch.
[ERROR] Re-run Maven using the -X switch to enable full debug logging.
[ERROR]
[ERROR] For more information about the errors and possible solutions,
please read the following articles:
[ERROR] [Help 1] http://cwiki.apache.org/confluence/display/MAVEN/
MojoExecutionException
[ERROR]
[ERROR] After correcting the problems, you can resume the build with the
command
[ERROR]   mvn <goals> -rf :httpclient
[JENKINS] Archiving <https://builds.apache.org/
job/httpcomponents-client-4.6.x/ws/httpclient-cache/pom.xml> to
org.apache.httpcomponents/httpclient-cache/4.6.0-alpha1-
SNAPSHOT/httpclient-cache-4.6.0-alpha1-SNAPSHOT.pom
No prior successful build to compare, so performing full copy of artifacts
[JENKINS] Archiving <https://builds.apache.org/
job/httpcomponents-client-4.6.x/ws/pom.xml> to org.apache.httpcomponents/
httpcomponents-client/4.6.0-alpha1-SNAPSHOT/httpcomponents-client-4.6.0-
alpha1-SNAPSHOT.pom
No prior successful build to compare, so performing full copy of artifacts
[JENKINS] Archiving <https://builds.apache.org/
job/httpcomponents-client-4.6.x/ws/fluent-hc/pom.xml> to
org.apache.httpcomponents/fluent-hc/4.6.0-alpha1-SNAPSHOT/fluent-hc-4.6.0-
alpha1-SNAPSHOT.pom
No prior successful build to compare, so performing full copy of artifacts
[JENKINS] Archiving <https://builds.apache.org/
job/httpcomponents-client-4.6.x/ws/httpclient-osgi/pom.xml> to
org.apache.httpcomponents/httpclient-osgi/4.6.0-alpha1-
SNAPSHOT/httpclient-osgi-4.6.0-alpha1-SNAPSHOT.pom
No prior successful build to compare, so performing full copy of artifacts
[JENKINS] Archiving <https://builds.apache.org/
job/httpcomponents-client-4.6.x/ws/httpclient/pom.xml> to
org.apache.httpcomponents/httpclient/4.6.0-alpha1-SNAPSHOT/httpclient-4.6.0-
alpha1-SNAPSHOT.pom
No prior successful build to compare, so performing full copy of artifacts
[JENKINS] Archiving <https://builds.apache.org/
job/httpcomponents-client-4.6.x/ws/httpclient-win/pom.xml> to
org.apache.httpcomponents/httpclient-win/4.6.0-alpha1-
SNAPSHOT/httpclient-win-4.6.0-alpha1-SNAPSHOT.pom
No prior successful build to compare, so performing full copy of artifacts
[JENKINS] Archiving <https://builds.apache.org/
job/httpcomponents-client-4.6.x/ws/httpmime/pom.xml> to
org.apache.httpcomponents/httpmime/4.6.0-alpha1-SNAPSHOT/httpmime-4.6.0-
alpha1-SNAPSHOT.pom
No prior successful build to compare, so performing full copy of artifacts
channel stopped



-- 
E-Mail: garydgregory@gmail.com | ggregory@apache.org
Java Persistence with Hibernate, Second Edition
<https://www.amazon.com/gp/product/1617290459/ref=as_li_tl?ie=UTF8&camp=1789&creative=9325&creativeASIN=1617290459&linkCode=as2&tag=garygregory-20&linkId=cadb800f39946ec62ea2b1af9fe6a2b8>

<http:////ir-na.amazon-adsystem.com/e/ir?t=garygregory-20&l=am2&o=1&a=1617290459>
JUnit in Action, Second Edition
<https://www.amazon.com/gp/product/1935182021/ref=as_li_tl?ie=UTF8&camp=1789&creative=9325&creativeASIN=1935182021&linkCode=as2&tag=garygregory-20&linkId=31ecd1f6b6d1eaf8886ac902a24de418%22>

<http:////ir-na.amazon-adsystem.com/e/ir?t=garygregory-20&l=am2&o=1&a=1935182021>
Spring Batch in Action
<https://www.amazon.com/gp/product/1935182951/ref=as_li_tl?ie=UTF8&camp=1789&creative=9325&creativeASIN=1935182951&linkCode=%7B%7BlinkCode%7D%7D&tag=garygregory-20&linkId=%7B%7Blink_id%7D%7D%22%3ESpring+Batch+in+Action>
<http:////ir-na.amazon-adsystem.com/e/ir?t=garygregory-20&l=am2&o=1&a=1935182951>
Blog: http://garygregory.wordpress.com
Home: http://garygregory.com/
Tweet! http://twitter.com/GaryGregory

Mime
  • Unnamed multipart/alternative (inline, None, 0 bytes)
View raw message