hc-dev mailing list archives

Site index · List index
Message view « Date » · « Thread »
Top « Date » · « Thread »
From Gary Gregory <garydgreg...@gmail.com>
Subject Fwd: Build failed in Jenkins: httpcomponents-client-5.x » Apache HttpComponents Client Parent #37
Date Wed, 27 Jan 2016 02:27:40 GMT
Hi All:

I can build locally OK, can anyone duplicate this fail locally?

Gary

---------- Forwarded message ----------
From: Apache Jenkins Server <jenkins@builds.apache.org>
Date: Tue, Jan 26, 2016 at 5:56 PM
Subject: Build failed in Jenkins: httpcomponents-client-5.x » Apache
HttpComponents Client Parent #37
To: commits@hc.apache.org


See <
https://builds.apache.org/job/httpcomponents-client-5.x/org.apache.httpcomponents.client5$httpclient5-parent/37/
>

------------------------------------------
Established TCP socket on 44304
maven3-agent.jar already up to date
maven3-interceptor.jar already up to date
maven3-interceptor-commons.jar already up to date
<===[JENKINS REMOTING CAPACITY]===>   channel started
Executing Maven:  -N -B
-Dmaven.repo.local=/home/jenkins/jenkins-slave/maven-repositories/1 -f <
https://builds.apache.org/job/httpcomponents-client-5.x/org.apache.httpcomponents.client5$httpclient5-parent/ws/pom.xml>
clean install
[INFO] Scanning for projects...
[INFO]
[INFO]
------------------------------------------------------------------------
[INFO] Building Apache HttpComponents Client Parent 5.0-alpha2-SNAPSHOT
[INFO]
------------------------------------------------------------------------
[INFO]
[INFO] --- maven-clean-plugin:2.5:clean (default-clean) @
httpclient5-parent ---
[INFO] Deleting <
https://builds.apache.org/job/httpcomponents-client-5.x/org.apache.httpcomponents.client5$httpclient5-parent/ws/target
>
[INFO]
[INFO] --- maven-checkstyle-plugin:2.9.1:checkstyle (validate) @
httpclient5-parent ---
[INFO]
[INFO] --- maven-checkstyle-plugin:2.9.1:checkstyle (validate-main) @
httpclient5-parent ---
[INFO]
[INFO] --- maven-checkstyle-plugin:2.9.1:checkstyle (validate-test) @
httpclient5-parent ---
[INFO]
[INFO] --- maven-checkstyle-plugin:2.9.1:checkstyle (validate-examples) @
httpclient5-parent ---
[INFO]
[INFO] --- maven-remote-resources-plugin:1.4:process (default) @
httpclient5-parent ---
[INFO]
[INFO] --- buildnumber-maven-plugin:1.2:create (default) @
httpclient5-parent ---
[INFO] Checking for local modifications: skipped.
[INFO] Updating project files from SCM: skipped.
[INFO] Executing: /bin/sh -c cd <
https://builds.apache.org/job/httpcomponents-client-5.x/org.apache.httpcomponents.client5$httpclient5-parent/ws/>
&& svn --non-interactive info
[INFO] Working directory: <
https://builds.apache.org/job/httpcomponents-client-5.x/org.apache.httpcomponents.client5$httpclient5-parent/ws/
>
[INFO] Storing buildNumber: 1726896 at timestamp: 1453859407444
[INFO] Executing: /bin/sh -c cd <
https://builds.apache.org/job/httpcomponents-client-5.x/org.apache.httpcomponents.client5$httpclient5-parent/ws/>
&& svn --non-interactive info
[INFO] Working directory: <
https://builds.apache.org/job/httpcomponents-client-5.x/org.apache.httpcomponents.client5$httpclient5-parent/ws/
>
[INFO] Storing buildScmBranch: trunk
[INFO]
[INFO] --- maven-site-plugin:3.3:attach-descriptor (attach-descriptor) @
httpclient5-parent ---
[INFO]
[INFO] --- maven-checkstyle-plugin:2.9.1:checkstyle (validate) @
httpclient5-parent ---
[INFO]
[INFO] --- maven-checkstyle-plugin:2.9.1:checkstyle (validate-main) @
httpclient5-parent ---
[INFO]
[INFO] --- maven-checkstyle-plugin:2.9.1:checkstyle (validate-test) @
httpclient5-parent ---
[INFO]
[INFO] --- maven-checkstyle-plugin:2.9.1:checkstyle (validate-examples) @
httpclient5-parent ---
[WARNING] Failed to getClass for
org.apache.maven.plugin.source.SourceJarMojo
[INFO]
[INFO] --- maven-source-plugin:2.2.1:jar (attach-sources) @
httpclient5-parent ---
[INFO]
[INFO] --- maven-javadoc-plugin:2.9.1:jar (attach-javadocs) @
httpclient5-parent ---
[INFO] Not executing Javadoc as the project is not a Java classpath-capable
package
[INFO]
[INFO] --- apache-rat-plugin:0.11:check (default) @ httpclient5-parent ---
[INFO] 56 implicit excludes (use -debug for more details).
[INFO] Exclude: src/docbkx/resources/**
[INFO] Exclude: src/test/resources/*.truststore
[INFO] Exclude: .checkstyle
[INFO] Exclude: .externalToolBuilders/**
[INFO] Exclude: maven-eclipse.xml
[INFO] 2012 resources included (use -debug for more details)
Warning:  org.apache.xerces.jaxp.SAXParserImpl$JAXPSAXParser: Property '
http://www.oracle.com/xml/jaxp/properties/entityExpansionLimit' is not
recognized.
Compiler warnings:
  WARNING:  'org.apache.xerces.jaxp.SAXParserImpl: Property '
http://javax.xml.XMLConstants/property/accessExternalDTD' is not
recognized.'
Warning:  org.apache.xerces.parsers.SAXParser: Feature '
http://javax.xml.XMLConstants/feature/secure-processing' is not recognized.
Warning:  org.apache.xerces.parsers.SAXParser: Property '
http://javax.xml.XMLConstants/property/accessExternalDTD' is not recognized.
Warning:  org.apache.xerces.parsers.SAXParser: Property '
http://www.oracle.com/xml/jaxp/properties/entityExpansionLimit' is not
recognized.
[INFO] Rat check: Summary of files. Unapproved: 380 unknown: 380 generated:
0 approved: 52 licence.
ache-rat-plugin:0.11:check (default) @ httpclient5-parent ---
[INFO] 56 implicit excludes (use -debug for more details).
[INFO] Exclude: src/docbkx/resources/**
[INFO] Exclude: src/test/resources/*.truststore
[INFO] Exclude: .checkstyle
[INFO] Exclude: .externalToolBuilders/**
[INFO] Exclude: maven-eclipse.xml
[INFO] 2012 resources included (use -debug for more details)
Warning:  org.apache.xerces.jaxp.SAXParserImpl$JAXPSAXParser: Property '
http://www.oracle.com/xml/jaxp/properties/entityExpansionLimit' is not
recognized.
Compiler warnings:
  WARNING:  'org.apache.xerces.jaxp.SAXParserImpl: Property '
http://javax.xml.XMLConstants/property/accessExternalDTD' is not
recognized.'
Warning:  org.apache.xerces.parsers.SAXParser: Feature '
http://javax.xml.XMLConstants/feature/secure-processing' is not recognized.
Warning:  org.apache.xerces.parsers.SAXParser: Property '
http://javax.xml.XMLConstants/property/accessExternalDTD' is not recognized.
Warning:  org.apache.xerces.parsers.SAXParser: Property '
http://www.oracle.com/xml/jaxp/properties/entityExpansionLimit' is not
recognized.
[INFO] Rat check: Summary of files. Unapproved: 380 unknown: 380 generated:
0 approved: 52 licence.
[INFO]
------------------------------------------------------------------------
[INFO] BUILD FAILURE
[INFO]
------------------------------------------------------------------------
[INFO] Total time: 13.938s
[INFO] Finished at: Wed Jan 27 01:50:17 UTC 2016
[INFO] Final Memory: 31M/448M
[INFO]
------------------------------------------------------------------------
Waiting for Jenkins to finish collecting data[ERROR] Failed to execute goal
org.apache.rat:apache-rat-plugin:0.11:check (default) on project
httpclient5-parent: Too many files with unapproved license: 380 See RAT
report in: <
https://builds.apache.org/job/httpcomponents-client-5.x/org.apache.httpcomponents.client5$httpclient5-parent/ws/target/rat.txt>
-> [Help 1]
[ERROR]
[ERROR] To see the full stack trace of the errors, re-run Maven with the -e
switch.
[ERROR] Re-run Maven using the -X switch to enable full debug logging.
[ERROR]
[ERROR] For more information about the errors and possible solutions,
please read the following articles:
[ERROR] [Help 1]
http://cwiki.apache.org/confluence/display/MAVEN/MojoFailureException

[JENKINS] Archiving <
https://builds.apache.org/job/httpcomponents-client-5.x/org.apache.httpcomponents.client5$httpclient5-parent/ws/pom.xml>
to
org.apache.httpcomponents.client5/httpclient5-parent/5.0-alpha2-SNAPSHOT/httpclient5-parent-5.0-alpha2-SNAPSHOT.pom



-- 
E-Mail: garydgregory@gmail.com | ggregory@apache.org
Java Persistence with Hibernate, Second Edition
<http://www.manning.com/bauer3/>
JUnit in Action, Second Edition <http://www.manning.com/tahchiev/>
Spring Batch in Action <http://www.manning.com/templier/>
Blog: http://garygregory.wordpress.com
Home: http://garygregory.com/
Tweet! http://twitter.com/GaryGregory

Mime
  • Unnamed multipart/alternative (inline, None, 0 bytes)
View raw message