hc-dev mailing list archives

Site index · List index
Message view « Date » · « Thread »
Top « Date » · « Thread »
From "Continuum@vmbuild" <...@hc.apache.org>
Subject [continuum] BUILD FAILURE: Apache HttpComponents - HttpComponents Core - Default Maven 2 Build Definition
Date Wed, 26 Sep 2012 21:04:44 GMT
Online report : http://vmbuild.apache.org/continuum/buildResult.action?buildId=24902&projectId=66

Build statistics:
  State: Failed
  Previous State: Ok
  Started at: Wed 26 Sep 2012 21:03:40 +0000
  Finished at: Wed 26 Sep 2012 21:04:41 +0000
  Total time: 1m 0s
  Build Trigger: Schedule
  Build Number: 285
  Exit code: 1
  Building machine hostname: vmbuild
  Operating system : Linux(unknown)
  Java Home version : 
          java version "1.6.0_30"
          Java(TM) SE Runtime Environment (build 1.6.0_30-b12)
          Java HotSpot(TM) 64-Bit Server VM (build 20.5-b03, mixed mode)
        
  Builder version :
          Apache Maven 2.2.1 (r801777; 2009-08-06 19:16:01+0000)
          Java version: 1.6.0_30
          Java home: /usr/lib/jvm/jdk1.6.0_30/jre
          Default locale: en_US, platform encoding: ANSI_X3.4-1968
          OS name: "linux" version: "2.6.32-41-server" arch: "amd64" Family: "unix"
    
****************************************************************************
SCM Changes:
****************************************************************************
Changed: olegk @ Wed 26 Sep 2012 20:38:19 +0000
Comment: Added Wire log classes to the the base module; moved Wire log and related classes
in the nio module
Files changed:
  /httpcomponents/httpcore/trunk/httpcore/pom.xml ( 1390720 )
  /httpcomponents/httpcore/trunk/httpcore/src/test/java/org/apache/http/testserver/LoggingInputStream.java
( 1390720 )
  /httpcomponents/httpcore/trunk/httpcore/src/test/java/org/apache/http/testserver/LoggingOutputStream.java
(from /httpcomponents/httpcore/trunk/httpcore-nio/src/test/java/org/apache/http/SimpleIOReactorExceptionHandler.java:1389501)
( 1390720 )
  /httpcomponents/httpcore/trunk/httpcore/src/test/java/org/apache/http/testserver/Wire.java
(from /httpcomponents/httpcore/trunk/httpcore-nio/src/test/java/org/apache/http/Wire.java:1389501)
( 1390720 )
  /httpcomponents/httpcore/trunk/httpcore-nio/src/test/java/org/apache/http/HttpCoreNIOTestBase.java
( 1390720 )
  /httpcomponents/httpcore/trunk/httpcore-nio/src/test/java/org/apache/http/LoggingClientConnectionFactory.java
( 1390720 )
  /httpcomponents/httpcore/trunk/httpcore-nio/src/test/java/org/apache/http/LoggingIOSession.java
( 1390720 )
  /httpcomponents/httpcore/trunk/httpcore-nio/src/test/java/org/apache/http/LoggingNHttpClientConnection.java
( 1390720 )
  /httpcomponents/httpcore/trunk/httpcore-nio/src/test/java/org/apache/http/LoggingNHttpServerConnection.java
( 1390720 )
  /httpcomponents/httpcore/trunk/httpcore-nio/src/test/java/org/apache/http/LoggingSSLClientConnectionFactory.java
( 1390720 )
  /httpcomponents/httpcore/trunk/httpcore-nio/src/test/java/org/apache/http/LoggingSSLServerConnectionFactory.java
( 1390720 )
  /httpcomponents/httpcore/trunk/httpcore-nio/src/test/java/org/apache/http/LoggingServerConnectionFactory.java
( 1390720 )
  /httpcomponents/httpcore/trunk/httpcore-nio/src/test/java/org/apache/http/SSLTestContexts.java
( 1390720 )
  /httpcomponents/httpcore/trunk/httpcore-nio/src/test/java/org/apache/http/SimpleIOReactorExceptionHandler.java
( 1390720 )
  /httpcomponents/httpcore/trunk/httpcore-nio/src/test/java/org/apache/http/Wire.java ( 1390720
)
  /httpcomponents/httpcore/trunk/httpcore-nio/src/test/java/org/apache/http/impl/nio/reactor/TestBaseIOReactorSSL.java
( 1390720 )
  /httpcomponents/httpcore/trunk/httpcore-nio/src/test/java/org/apache/http/impl/nio/reactor/TestDefaultIOReactors.java
( 1390720 )
  /httpcomponents/httpcore/trunk/httpcore-nio/src/test/java/org/apache/http/impl/nio/reactor/TestDefaultIOReactorsSSL.java
( 1390720 )
  /httpcomponents/httpcore/trunk/httpcore-nio/src/test/java/org/apache/http/nio/integration/TestAsyncNHttpHandlers.java
( 1390720 )
  /httpcomponents/httpcore/trunk/httpcore-nio/src/test/java/org/apache/http/nio/integration/TestHttpAsyncHandlerCancellable.java
( 1390720 )
  /httpcomponents/httpcore/trunk/httpcore-nio/src/test/java/org/apache/http/nio/integration/TestHttpAsyncHandlers.java
( 1390720 )
  /httpcomponents/httpcore/trunk/httpcore-nio/src/test/java/org/apache/http/nio/integration/TestHttpAsyncPrematureTermination.java
( 1390720 )
  /httpcomponents/httpcore/trunk/httpcore-nio/src/test/java/org/apache/http/nio/integration/TestHttpsAsyncHandlers.java
( 1390720 )
  /httpcomponents/httpcore/trunk/httpcore-nio/src/test/java/org/apache/http/nio/integration/TestPipelining.java
( 1390720 )
  /httpcomponents/httpcore/trunk/httpcore-nio/src/test/java/org/apache/http/nio/integration/TestThrottlingNHttpHandlers.java
( 1390720 )
  /httpcomponents/httpcore/trunk/httpcore-nio/src/test/java/org/apache/http/nio/integration/TestTruncatedChunks.java
( 1390720 )
  /httpcomponents/httpcore/trunk/httpcore-nio/src/test/java/org/apache/http/testserver/HttpCoreNIOTestBase.java
(from /httpcomponents/httpcore/trunk/httpcore-nio/src/test/java/org/apache/http/HttpCoreNIOTestBase.java:1389501)
( 1390720 )
  /httpcomponents/httpcore/trunk/httpcore-nio/src/test/java/org/apache/http/testserver/LoggingClientConnectionFactory.java
(from /httpcomponents/httpcore/trunk/httpcore-nio/src/test/java/org/apache/http/LoggingClientConnectionFactory.java:1389501)
( 1390720 )
  /httpcomponents/httpcore/trunk/httpcore-nio/src/test/java/org/apache/http/testserver/LoggingIOSession.java
(from /httpcomponents/httpcore/trunk/httpcore-nio/src/test/java/org/apache/http/LoggingIOSession.java:1389501)
( 1390720 )
  /httpcomponents/httpcore/trunk/httpcore-nio/src/test/java/org/apache/http/testserver/LoggingNHttpClientConnection.java
(from /httpcomponents/httpcore/trunk/httpcore-nio/src/test/java/org/apache/http/LoggingNHttpClientConnection.java:1389501)
( 1390720 )
  /httpcomponents/httpcore/trunk/httpcore-nio/src/test/java/org/apache/http/testserver/LoggingNHttpServerConnection.java
(from /httpcomponents/httpcore/trunk/httpcore-nio/src/test/java/org/apache/http/LoggingNHttpServerConnection.java:1389501)
( 1390720 )
  /httpcomponents/httpcore/trunk/httpcore-nio/src/test/java/org/apache/http/testserver/LoggingSSLClientConnectionFactory.java
(from /httpcomponents/httpcore/trunk/httpcore-nio/src/test/java/org/apache/http/LoggingSSLClientConnectionFactory.java:1389501)
( 1390720 )
  /httpcomponents/httpcore/trunk/httpcore-nio/src/test/java/org/apache/http/testserver/LoggingSSLServerConnectionFactory.java
(from /httpcomponents/httpcore/trunk/httpcore-nio/src/test/java/org/apache/http/LoggingSSLServerConnectionFactory.java:1389501)
( 1390720 )
  /httpcomponents/httpcore/trunk/httpcore-nio/src/test/java/org/apache/http/testserver/LoggingServerConnectionFactory.java
(from /httpcomponents/httpcore/trunk/httpcore-nio/src/test/java/org/apache/http/LoggingServerConnectionFactory.java:1389501)
( 1390720 )
  /httpcomponents/httpcore/trunk/httpcore-nio/src/test/java/org/apache/http/testserver/SSLTestContexts.java
(from /httpcomponents/httpcore/trunk/httpcore-nio/src/test/java/org/apache/http/SSLTestContexts.java:1389501)
( 1390720 )
  /httpcomponents/httpcore/trunk/httpcore-nio/src/test/java/org/apache/http/testserver/SimpleIOReactorExceptionHandler.java
(from /httpcomponents/httpcore/trunk/httpcore-nio/src/test/java/org/apache/http/SimpleIOReactorExceptionHandler.java:1389501)
( 1390720 )
  /httpcomponents/httpcore/trunk/httpcore-nio/src/test/java/org/apache/http/testserver/Wire.java
(from /httpcomponents/httpcore/trunk/httpcore-nio/src/test/java/org/apache/http/Wire.java:1389501)
( 1390720 )

****************************************************************************
Dependencies Changes:
****************************************************************************
No dependencies changed


****************************************************************************
Build Definition:
****************************************************************************
POM filename: pom.xml
Goals: clean install   
Arguments: --batch-mode
Build Fresh: false
Always Build: false
Default Build Definition: true
Schedule: DEFAULT_SCHEDULE
Profile Name: Maven 2.2.1
Description: Default Maven 2 Build Definition

****************************************************************************
Test Summary:
****************************************************************************
Tests: 956
Failures: 1
Errors: 0
Success Rate: 99
Total time: 34.118

****************************************************************************
Test Failures:
****************************************************************************

TestSyncHttp
    testHttpPostsWithExpectationVerification :
  java.lang.AssertionError
  java.lang.AssertionError: expected:<417> but was:<400>
	at org.junit.Assert.fail(Assert.java:93)
	at org.junit.Assert.failNotEquals(Assert.java:647)
	at org.junit.Assert.assertEquals(Assert.java:128)
	at org.junit.Assert.assertEquals(Assert.java:472)
	at org.junit.Assert.assertEquals(Assert.java:456)
	at org.apache.http.integration.TestSyncHttp.testHttpPostsWithExpectationVerification(TestSyncHttp.java:595)
	at sun.reflect.NativeMethodAccessorImpl.invoke0(Native Method)
	at sun.reflect.NativeMethodAccessorImpl.invoke(NativeMethodAccessorImpl.java:39)
	at sun.reflect.DelegatingMethodAccessorImpl.invoke(DelegatingMethodAccessorImpl.java:25)
	at java.lang.reflect.Method.invoke(Method.java:597)
	at org.junit.runners.model.FrameworkMethod$1.runReflectiveCall(FrameworkMethod.java:44)
	at org.junit.internal.runners.model.ReflectiveCallable.run(ReflectiveCallable.java:15)
	at org.junit.runners.model.FrameworkMethod.invokeExplosively(FrameworkMethod.java:41)
	at org.junit.internal.runners.statements.InvokeMethod.evaluate(InvokeMethod.java:20)
	at org.junit.internal.runners.statements.RunBefores.evaluate(RunBefores.java:28)
	at org.junit.internal.runners.statements.RunAfters.evaluate(RunAfters.java:31)
	at org.junit.runners.ParentRunner.runLeaf(ParentRunner.java:263)
	at org.junit.runners.BlockJUnit4ClassRunner.runChild(BlockJUnit4ClassRunner.java:69)
	at org.junit.runners.BlockJUnit4ClassRunner.runChild(BlockJUnit4ClassRunner.java:48)
	at org.junit.runners.ParentRunner$3.run(ParentRunner.java:231)
	at org.junit.runners.ParentRunner$1.schedule(ParentRunner.java:60)
	at org.junit.runners.ParentRunner.runChildren(ParentRunner.java:229)
	at org.junit.runners.ParentRunner.access$000(ParentRunner.java:50)
	at org.junit.runners.ParentRunner$2.evaluate(ParentRunner.java:222)
	at org.junit.runners.ParentRunner.run(ParentRunner.java:292)
	at org.apache.maven.surefire.junit4.JUnit4TestSet.execute(JUnit4TestSet.java:53)
	at org.apache.maven.surefire.junit4.JUnit4Provider.executeTestSet(JUnit4Provider.java:123)
	at org.apache.maven.surefire.junit4.JUnit4Provider.invoke(JUnit4Provider.java:104)
	at sun.reflect.NativeMethodAccessorImpl.invoke0(Native Method)
	at sun.reflect.NativeMethodAccessorImpl.invoke(NativeMethodAccessorImpl.java:39)
	at sun.reflect.DelegatingMethodAccessorImpl.invoke(DelegatingMethodAccessorImpl.java:25)
	at java.lang.reflect.Method.invoke(Method.java:597)
	at org.apache.maven.surefire.util.ReflectionUtils.invokeMethodWithArray(ReflectionUtils.java:164)
	at org.apache.maven.surefire.booter.ProviderFactory$ProviderProxy.invoke(ProviderFactory.java:110)
	at org.apache.maven.surefire.booter.SurefireStarter.invokeProvider(SurefireStarter.java:172)
	at org.apache.maven.surefire.booter.SurefireStarter.runSuitesInProcessWhenForked(SurefireStarter.java:104)
	at org.apache.maven.surefire.booter.ForkedBooter.main(ForkedBooter.java:70)

  



---------------------------------------------------------------------
To unsubscribe, e-mail: dev-unsubscribe@hc.apache.org
For additional commands, e-mail: dev-help@hc.apache.org


Mime
View raw message