hc-dev mailing list archives

Site index · List index
Message view « Date » · « Thread »
Top « Date » · « Thread »
From "Continuum@vmbuild" <contin...@apache.org>
Subject [continuum] BUILD FAILURE: Apache HttpComponents - HttpComponents Client - Default Maven 2 Build Definition
Date Tue, 10 Apr 2012 21:08:54 GMT
Online report : http://vmbuild.apache.org/continuum/buildResult.action?buildId=21059&projectId=77

Build statistics:
  State: Failed
  Previous State: Ok
  Started at: Tue 10 Apr 2012 21:07:46 +0000
  Finished at: Tue 10 Apr 2012 21:08:49 +0000
  Total time: 1m 2s
  Build Trigger: Schedule
  Build Number: 328
  Exit code: 1
  Building machine hostname: vmbuild
  Operating system : Linux(unknown)
  Java Home version : 
          java version "1.6.0_30"
          Java(TM) SE Runtime Environment (build 1.6.0_30-b12)
          Java HotSpot(TM) 64-Bit Server VM (build 20.5-b03, mixed mode)
        
  Builder version :
          Apache Maven 2.2.1 (r801777; 2009-08-06 19:16:01+0000)
          Java version: 1.6.0_30
          Java home: /usr/lib/jvm/jdk1.6.0_30/jre
          Default locale: en_US, platform encoding: ANSI_X3.4-1968
          OS name: "linux" version: "2.6.32-31-server" arch: "amd64" Family: "unix"
    
****************************************************************************
SCM Changes:
****************************************************************************
Changed: olegk @ Tue 10 Apr 2012 20:19:20 +0000
Comment: Renamed CompressionDecorator to DecompressingHttpClient
Files changed:
  /httpcomponents/httpclient/trunk/httpclient/src/main/java/org/apache/http/impl/client/CompressionDecorator.java
( 1311967 )
  /httpcomponents/httpclient/trunk/httpclient/src/main/java/org/apache/http/impl/client/ContentEncodingHttpClient.java
( 1311967 )
  /httpcomponents/httpclient/trunk/httpclient/src/main/java/org/apache/http/impl/client/DecompressingHttpClient.java
(from /httpcomponents/httpclient/trunk/httpclient/src/main/java/org/apache/http/impl/client/CompressionDecorator.java:1311952)
( 1311967 )
  /httpcomponents/httpclient/trunk/httpclient/src/test/java/org/apache/http/impl/client/TestCompressionDecorator.java
( 1311967 )
  /httpcomponents/httpclient/trunk/httpclient/src/test/java/org/apache/http/impl/client/TestContentCodings.java
( 1311967 )
  /httpcomponents/httpclient/trunk/httpclient/src/test/java/org/apache/http/impl/client/TestDecompressingHttpClient.java
(from /httpcomponents/httpclient/trunk/httpclient/src/test/java/org/apache/http/impl/client/TestCompressionDecorator.java:1311952)
( 1311967 )

****************************************************************************
Dependencies Changes:
****************************************************************************
No dependencies changed


****************************************************************************
Build Definition:
****************************************************************************
POM filename: pom.xml
Goals: clean install   
Arguments: --batch-mode
Build Fresh: false
Always Build: false
Default Build Definition: true
Schedule: DEFAULT_SCHEDULE
Profile Name: Maven 2.2.1
Description: Default Maven 2 Build Definition

****************************************************************************
Test Summary:
****************************************************************************
Tests: 1704
Failures: 1
Errors: 0
Success Rate: 99
Total time: 23.405998

****************************************************************************
Test Failures:
****************************************************************************

TestConnPoolByRoute
    wakesUpWaitingThreadsOnShutdown :
  java.lang.AssertionError
  java.lang.AssertionError
	at org.junit.Assert.fail(Assert.java:92)
	at org.junit.Assert.assertTrue(Assert.java:43)
	at org.junit.Assert.assertTrue(Assert.java:54)
	at org.apache.http.impl.conn.tsccm.TestConnPoolByRoute.wakesUpWaitingThreadsOnShutdown(TestConnPoolByRoute.java:448)
	at sun.reflect.NativeMethodAccessorImpl.invoke0(Native Method)
	at sun.reflect.NativeMethodAccessorImpl.invoke(NativeMethodAccessorImpl.java:39)
	at sun.reflect.DelegatingMethodAccessorImpl.invoke(DelegatingMethodAccessorImpl.java:25)
	at java.lang.reflect.Method.invoke(Method.java:597)
	at org.junit.runners.model.FrameworkMethod$1.runReflectiveCall(FrameworkMethod.java:44)
	at org.junit.internal.runners.model.ReflectiveCallable.run(ReflectiveCallable.java:15)
	at org.junit.runners.model.FrameworkMethod.invokeExplosively(FrameworkMethod.java:41)
	at org.junit.internal.runners.statements.InvokeMethod.evaluate(InvokeMethod.java:20)
	at org.junit.internal.runners.statements.RunBefores.evaluate(RunBefores.java:28)
	at org.junit.internal.runners.statements.RunAfters.evaluate(RunAfters.java:31)
	at org.junit.runners.ParentRunner.runLeaf(ParentRunner.java:263)
	at org.junit.runners.BlockJUnit4ClassRunner.runChild(BlockJUnit4ClassRunner.java:69)
	at org.junit.runners.BlockJUnit4ClassRunner.runChild(BlockJUnit4ClassRunner.java:48)
	at org.junit.runners.ParentRunner$3.run(ParentRunner.java:231)
	at org.junit.runners.ParentRunner$1.schedule(ParentRunner.java:60)
	at org.junit.runners.ParentRunner.runChildren(ParentRunner.java:229)
	at org.junit.runners.ParentRunner.access$000(ParentRunner.java:50)
	at org.junit.runners.ParentRunner$2.evaluate(ParentRunner.java:222)
	at org.junit.runners.ParentRunner.run(ParentRunner.java:292)
	at org.mockito.internal.runners.JUnit45AndHigherRunnerImpl.run(JUnit45AndHigherRunnerImpl.java:37)
	at org.mockito.runners.MockitoJUnitRunner.run(MockitoJUnitRunner.java:62)
	at org.apache.maven.surefire.junit4.JUnit4TestSet.execute(JUnit4TestSet.java:53)
	at org.apache.maven.surefire.junit4.JUnit4Provider.executeTestSet(JUnit4Provider.java:123)
	at org.apache.maven.surefire.junit4.JUnit4Provider.invoke(JUnit4Provider.java:104)
	at sun.reflect.NativeMethodAccessorImpl.invoke0(Native Method)
	at sun.reflect.NativeMethodAccessorImpl.invoke(NativeMethodAccessorImpl.java:39)
	at sun.reflect.DelegatingMethodAccessorImpl.invoke(DelegatingMethodAccessorImpl.java:25)
	at java.lang.reflect.Method.invoke(Method.java:597)
	at org.apache.maven.surefire.util.ReflectionUtils.invokeMethodWithArray(ReflectionUtils.java:164)
	at org.apache.maven.surefire.booter.ProviderFactory$ProviderProxy.invoke(ProviderFactory.java:110)
	at org.apache.maven.surefire.booter.SurefireStarter.invokeProvider(SurefireStarter.java:172)
	at org.apache.maven.surefire.booter.SurefireStarter.runSuitesInProcessWhenForked(SurefireStarter.java:104)
	at org.apache.maven.surefire.booter.ForkedBooter.main(ForkedBooter.java:70)

  



---------------------------------------------------------------------
To unsubscribe, e-mail: dev-unsubscribe@hc.apache.org
For additional commands, e-mail: dev-help@hc.apache.org


Mime
View raw message