hc-dev mailing list archives

Site index · List index
Message view « Date » · « Thread »
Top « Date » · « Thread »
From "Continuum@vmbuild" <contin...@apache.org>
Subject [continuum] BUILD FAILURE: Apache HttpComponents - HttpComponents Core - Default Maven 2 Build Definition
Date Fri, 05 Aug 2011 10:19:44 GMT
Online report : http://vmbuild.apache.org/continuum/buildResult.action?buildId=10957&projectId=66

Build statistics:
  State: Failed
  Previous State: Ok
  Started at: Fri 5 Aug 2011 10:18:57 +0000
  Finished at: Fri 5 Aug 2011 10:19:42 +0000
  Total time: 45s
  Build Trigger: Schedule
  Build Number: 145
  Exit code: 1
  Building machine hostname: vmbuild
  Operating system : Linux(unknown)
  Java Home version : 
          java version "1.6.0_24"
          Java(TM) SE Runtime Environment (build 1.6.0_24-b07)
          Java HotSpot(TM) 64-Bit Server VM (build 19.1-b02, mixed mode)
        
  Builder version :
          Apache Maven 2.2.1 (r801777; 2009-08-06 19:16:01+0000)
          Java version: 1.6.0_24
          Java home: /usr/lib/jvm/java-6-sun-1.6.0.24/jre
          Default locale: en_AU, platform encoding: UTF-8
          OS name: "linux" version: "2.6.32-31-server" arch: "amd64" Family: "unix"
    
****************************************************************************
SCM Changes:
****************************************************************************
Changed: olegk @ Fri 5 Aug 2011 09:24:22 +0000
Comment: Fixed inconsistencies in pool control API
Files changed:
  /httpcomponents/httpcore/trunk/httpcore/src/main/java/org/apache/http/pool/AbstractConnPool.java
( 1154136 )
  /httpcomponents/httpcore/trunk/httpcore/src/main/java/org/apache/http/pool/ConnPoolControl.java
( 1154136 )
  /httpcomponents/httpcore/trunk/httpcore/src/test/java/org/apache/http/pool/TestConnPool.java
( 1154136 )
  /httpcomponents/httpcore/trunk/httpcore-nio/src/main/java/org/apache/http/nio/pool/AbstractNIOConnPool.java
( 1154136 )
  /httpcomponents/httpcore/trunk/httpcore-nio/src/test/java/org/apache/http/nio/pool/TestNIOConnPool.java
( 1154136 )

****************************************************************************
Dependencies Changes:
****************************************************************************
No dependencies changed


****************************************************************************
Build Definition:
****************************************************************************
POM filename: pom.xml
Goals: clean install   
Arguments: --batch-mode
Build Fresh: false
Always Build: false
Default Build Definition: true
Schedule: DEFAULT_SCHEDULE
Profile Name: Maven 2.2.1
Description: Default Maven 2 Build Definition

****************************************************************************
Test Summary:
****************************************************************************
Tests: 697
Failures: 1
Errors: 0
Success Rate: 99
Total time: 13.629997

****************************************************************************
Test Failures:
****************************************************************************

TestAsyncNHttpHandlers
    testNoServiceHandler :
  java.lang.AssertionError
  java.lang.AssertionError: 
	at org.junit.Assert.fail(Assert.java:91)
	at org.junit.Assert.assertTrue(Assert.java:43)
	at org.junit.Assert.assertNotNull(Assert.java:524)
	at org.junit.Assert.assertNotNull(Assert.java:535)
	at org.apache.http.nio.protocol.TestAsyncNHttpHandlers.testNoServiceHandler(TestAsyncNHttpHandlers.java:898)
	at sun.reflect.NativeMethodAccessorImpl.invoke0(Native Method)
	at sun.reflect.NativeMethodAccessorImpl.invoke(NativeMethodAccessorImpl.java:39)
	at sun.reflect.DelegatingMethodAccessorImpl.invoke(DelegatingMethodAccessorImpl.java:25)
	at java.lang.reflect.Method.invoke(Method.java:597)
	at org.junit.runners.model.FrameworkMethod$1.runReflectiveCall(FrameworkMethod.java:44)
	at org.junit.internal.runners.model.ReflectiveCallable.run(ReflectiveCallable.java:15)
	at org.junit.runners.model.FrameworkMethod.invokeExplosively(FrameworkMethod.java:41)
	at org.junit.internal.runners.statements.InvokeMethod.evaluate(InvokeMethod.java:20)
	at org.junit.internal.runners.statements.RunBefores.evaluate(RunBefores.java:28)
	at org.junit.internal.runners.statements.RunAfters.evaluate(RunAfters.java:31)
	at org.junit.runners.BlockJUnit4ClassRunner.runNotIgnored(BlockJUnit4ClassRunner.java:79)
	at org.junit.runners.BlockJUnit4ClassRunner.runChild(BlockJUnit4ClassRunner.java:71)
	at org.junit.runners.BlockJUnit4ClassRunner.runChild(BlockJUnit4ClassRunner.java:49)
	at org.junit.runners.ParentRunner$3.run(ParentRunner.java:193)
	at org.junit.runners.ParentRunner$1.schedule(ParentRunner.java:52)
	at org.junit.runners.ParentRunner.runChildren(ParentRunner.java:191)
	at org.junit.runners.ParentRunner.access$000(ParentRunner.java:42)
	at org.junit.runners.ParentRunner$2.evaluate(ParentRunner.java:184)
	at org.junit.runners.ParentRunner.run(ParentRunner.java:236)
	at org.apache.maven.surefire.junit4.JUnit4TestSet.execute(JUnit4TestSet.java:35)
	at org.apache.maven.surefire.junit4.JUnit4Provider.executeTestSet(JUnit4Provider.java:146)
	at org.apache.maven.surefire.junit4.JUnit4Provider.invoke(JUnit4Provider.java:97)
	at sun.reflect.NativeMethodAccessorImpl.invoke0(Native Method)
	at sun.reflect.NativeMethodAccessorImpl.invoke(NativeMethodAccessorImpl.java:39)
	at sun.reflect.DelegatingMethodAccessorImpl.invoke(DelegatingMethodAccessorImpl.java:25)
	at java.lang.reflect.Method.invoke(Method.java:597)
	at org.apache.maven.surefire.booter.ProviderFactory$ClassLoaderProxy.invoke(ProviderFactory.java:103)
	at $Proxy0.invoke(Unknown Source)
	at org.apache.maven.surefire.booter.SurefireStarter.invokeProvider(SurefireStarter.java:145)
	at org.apache.maven.surefire.booter.SurefireStarter.runSuitesInProcess(SurefireStarter.java:87)
	at org.apache.maven.surefire.booter.ForkedBooter.main(ForkedBooter.java:69)

  



---------------------------------------------------------------------
To unsubscribe, e-mail: dev-unsubscribe@hc.apache.org
For additional commands, e-mail: dev-help@hc.apache.org


Mime
View raw message