hc-dev mailing list archives

Site index · List index
Message view « Date » · « Thread »
Top « Date » · « Thread »
From Apache Hudson Server <hud...@hudson.zones.apache.org>
Subject Build failed in Hudson: HttpComponents Core #94
Date Sun, 28 Mar 2010 13:49:29 GMT
See <http://hudson.zones.apache.org/hudson/job/HttpComponents%20Core/94/>

------------------------------------------
[...truncated 148 lines...]
Tests run: 6, Failures: 0, Errors: 0, Skipped: 0, Time elapsed: 0.007 sec
Running org.apache.http.message.TestBasicLineParser
Tests run: 7, Failures: 0, Errors: 0, Skipped: 0, Time elapsed: 0.008 sec
Running org.apache.http.util.TestByteArrayBuffer
Tests run: 14, Failures: 0, Errors: 0, Skipped: 0, Time elapsed: 0.019 sec
Running org.apache.http.protocol.TestHttpRequestHandlerRegistry
Tests run: 6, Failures: 0, Errors: 0, Skipped: 0, Time elapsed: 0.009 sec
Running org.apache.http.impl.TestSessionBuffers
Tests run: 10, Failures: 0, Errors: 0, Skipped: 0, Time elapsed: 0.013 sec
Running org.apache.http.entity.TestBasicHttpEntity
Tests run: 4, Failures: 0, Errors: 0, Skipped: 0, Time elapsed: 0.006 sec
Running org.apache.http.params.TestBasicHttpParams
Tests run: 1, Failures: 0, Errors: 0, Skipped: 0, Time elapsed: 0.02 sec
Running org.apache.http.message.TestHeaderGroup
Tests run: 10, Failures: 0, Errors: 0, Skipped: 0, Time elapsed: 0.009 sec
Running org.apache.http.message.TestBasicHeaderValueFormatter
Tests run: 6, Failures: 0, Errors: 0, Skipped: 0, Time elapsed: 0.01 sec
Running org.apache.http.message.TestBasicLineFormatter
Tests run: 8, Failures: 0, Errors: 0, Skipped: 0, Time elapsed: 0.009 sec
Running org.apache.http.TestHttpExceptions
Tests run: 1, Failures: 0, Errors: 0, Skipped: 0, Time elapsed: 0.004 sec
Running org.apache.http.message.TestHeaderElement
Tests run: 8, Failures: 0, Errors: 0, Skipped: 0, Time elapsed: 0.009 sec
Running org.apache.http.message.TestBasicMessages
Tests run: 7, Failures: 0, Errors: 0, Skipped: 0, Time elapsed: 0.008 sec
Running org.apache.http.impl.io.TestIdentitynputStream
Tests run: 4, Failures: 0, Errors: 0, Skipped: 0, Time elapsed: 0.005 sec
Running org.apache.http.impl.entity.TestEntitySerializer
Tests run: 9, Failures: 0, Errors: 0, Skipped: 0, Time elapsed: 0.009 sec
Running org.apache.http.impl.io.TestResponseParser
Tests run: 4, Failures: 0, Errors: 0, Skipped: 0, Time elapsed: 0.005 sec

Results :

Tests run: 426, Failures: 0, Errors: 0, Skipped: 0

[HUDSON] Recording test results
[INFO] [jar:jar {execution: default-jar}]
[INFO] Building jar: <http://hudson.zones.apache.org/hudson/job/HttpComponents%20Core/ws/httpcore-trunk/httpcore/target/httpcore-4.1-beta1.jar>
[INFO] Preparing source:jar
[WARNING] Removing: jar from forked lifecycle, to prevent recursive invocation.
[INFO] No goals needed for project - skipping
[INFO] [source:jar {execution: attach-sources}]
[INFO] Building jar: <http://hudson.zones.apache.org/hudson/job/HttpComponents%20Core/ws/httpcore-trunk/httpcore/target/httpcore-4.1-beta1-sources.jar>
[INFO] [install:install {execution: default-install}]
[INFO] Installing <http://hudson.zones.apache.org/hudson/job/HttpComponents%20Core/ws/httpcore-trunk/httpcore/target/httpcore-4.1-beta1.jar>
to /export/home/hudson/.m2/repository/org/apache/httpcomponents/httpcore/4.1-beta1/httpcore-4.1-beta1.jar
[INFO] Installing <http://hudson.zones.apache.org/hudson/job/HttpComponents%20Core/ws/httpcore-trunk/httpcore/target/httpcore-4.1-beta1-sources.jar>
to /export/home/hudson/.m2/repository/org/apache/httpcomponents/httpcore/4.1-beta1/httpcore-4.1-beta1-sources.jar
[HUDSON] Archiving <http://hudson.zones.apache.org/hudson/job/HttpComponents%20Core/ws/httpcore-trunk/httpcore/pom.xml>
to /export/home/hudson/hudson/jobs/HttpComponents Core/modules/org.apache.httpcomponents$httpcore/builds/2010-03-28_13-45-54/archive/org.apache.httpcomponents/httpcore/4.1-beta1/pom.xml
[HUDSON] Archiving <http://hudson.zones.apache.org/hudson/job/HttpComponents%20Core/ws/httpcore-trunk/httpcore/target/httpcore-4.1-beta1.jar>
to /export/home/hudson/hudson/jobs/HttpComponents Core/modules/org.apache.httpcomponents$httpcore/builds/2010-03-28_13-45-54/archive/org.apache.httpcomponents/httpcore/4.1-beta1/httpcore-4.1-beta1.jar
[HUDSON] Archiving <http://hudson.zones.apache.org/hudson/job/HttpComponents%20Core/ws/httpcore-trunk/httpcore/target/httpcore-4.1-beta1-sources.jar>
to /export/home/hudson/hudson/jobs/HttpComponents Core/modules/org.apache.httpcomponents$httpcore/builds/2010-03-28_13-45-54/archive/org.apache.httpcomponents/httpcore/4.1-beta1/httpcore-4.1-beta1-sources.jar
[INFO] ------------------------------------------------------------------------
[INFO] Building HttpCore NIO
[INFO]    task-segment: [clean, install]
[INFO] ------------------------------------------------------------------------
[INFO] [clean:clean {execution: default-clean}]
[INFO] Deleting directory <http://hudson.zones.apache.org/hudson/job/HttpComponents%20Core/ws/httpcore-trunk/httpcore-nio/target>
[INFO] [resources:resources {execution: default-resources}]
[INFO] Using 'UTF-8' encoding to copy filtered resources.
[INFO] Copying 0 resource
[INFO] Copying 1 resource
[INFO] Copying 1 resource to META-INF
[INFO] Copying 1 resource to META-INF
[INFO] [compiler:compile {execution: default-compile}]
[INFO] Compiling 130 source files to <http://hudson.zones.apache.org/hudson/job/HttpComponents%20Core/ws/httpcore-trunk/httpcore-nio/target/classes>
[INFO] [resources:testResources {execution: default-testResources}]
[INFO] Using 'UTF-8' encoding to copy filtered resources.
[INFO] Copying 1 resource
[INFO] [compiler:testCompile {execution: default-testCompile}]
[INFO] Compiling 36 source files to <http://hudson.zones.apache.org/hudson/job/HttpComponents%20Core/ws/httpcore-trunk/httpcore-nio/target/test-classes>
[INFO] [surefire:test {execution: default-test}]
[INFO] Surefire report directory: <http://hudson.zones.apache.org/hudson/job/HttpComponents%20Core/ws/httpcore-trunk/httpcore-nio/target/surefire-reports>

-------------------------------------------------------
 T E S T S
-------------------------------------------------------
Running org.apache.http.nio.protocol.TestJob
Tests run: 0, Failures: 0, Errors: 0, Skipped: 0, Time elapsed: 0.016 sec
Running org.apache.http.nio.protocol.TestThrottlingNHttpHandlers
Connection timed out
Tests run: 10, Failures: 0, Errors: 0, Skipped: 0, Time elapsed: 18.858 sec
Running org.apache.http.impl.nio.codecs.TestChunkEncoder
Tests run: 6, Failures: 0, Errors: 0, Skipped: 0, Time elapsed: 0.01 sec
Running org.apache.http.impl.nio.codecs.TestChunkDecoder
Tests run: 14, Failures: 0, Errors: 0, Skipped: 0, Time elapsed: 0.015 sec
Running org.apache.http.impl.nio.reactor.TestDefaultIOReactorsSSL
Tests run: 1, Failures: 0, Errors: 0, Skipped: 0, Time elapsed: 14.141 sec
Running org.apache.http.nio.util.TestBuffers
Tests run: 7, Failures: 0, Errors: 0, Skipped: 0, Time elapsed: 0.047 sec
Running org.apache.http.impl.nio.codecs.TestLengthDelimitedDecoder
Tests run: 13, Failures: 0, Errors: 0, Skipped: 0, Time elapsed: 0.461 sec
Running org.apache.http.nio.protocol.TestBufferingNHttpHandlers
Tests run: 5, Failures: 0, Errors: 0, Skipped: 0, Time elapsed: 9.199 sec
Running org.apache.http.impl.nio.reactor.TestSessionInOutBuffers
Tests run: 14, Failures: 0, Errors: 0, Skipped: 0, Time elapsed: 0.013 sec
Running org.apache.http.impl.nio.reactor.TestDefaultListeningIOReactor
Tests run: 3, Failures: 0, Errors: 0, Skipped: 0, Time elapsed: 0.806 sec
Running org.apache.http.nio.protocol.TestNIOSSLHttp
Tests run: 5, Failures: 0, Errors: 0, Skipped: 0, Time elapsed: 8.547 sec
Running org.apache.http.impl.nio.codecs.TestLengthDelimitedEncoder
Tests run: 9, Failures: 0, Errors: 0, Skipped: 0, Time elapsed: 0.03 sec
Running org.apache.http.nio.protocol.TestTruncatedChunks
Tests run: 2, Failures: 0, Errors: 0, Skipped: 0, Time elapsed: 0.073 sec
Running org.apache.http.impl.nio.codecs.TestIdentityEncoder
Tests run: 4, Failures: 0, Errors: 0, Skipped: 0, Time elapsed: 0.09 sec
Running org.apache.http.impl.nio.reactor.TestBaseIOReactorSSL
Tests run: 1, Failures: 0, Errors: 0, Skipped: 0, Time elapsed: 0.144 sec
Running org.apache.http.impl.nio.codecs.TestHttpMessageParser
Tests run: 17, Failures: 0, Errors: 0, Skipped: 0, Time elapsed: 0.013 sec
Running org.apache.http.nio.protocol.TestAsyncNHttpHandlers
Tests run: 12, Failures: 0, Errors: 0, Skipped: 0, Time elapsed: 21.352 sec
Running org.apache.http.impl.nio.codecs.TestIdentityDecoder
Tests run: 8, Failures: 0, Errors: 0, Skipped: 0, Time elapsed: 0.333 sec
Running org.apache.http.impl.nio.reactor.TestDefaultIOReactors
Tests run: 4, Failures: 0, Errors: 0, Skipped: 0, Time elapsed: 11.573 sec
Running org.apache.http.impl.nio.reactor.ExceptionEventTest
Tests run: 3, Failures: 0, Errors: 0, Skipped: 0, Time elapsed: 0.003 sec

Results :

Tests run: 138, Failures: 0, Errors: 0, Skipped: 0

[HUDSON] Recording test results
[INFO] [jar:jar {execution: default-jar}]
[INFO] Building jar: <http://hudson.zones.apache.org/hudson/job/HttpComponents%20Core/ws/httpcore-trunk/httpcore-nio/target/httpcore-nio-4.1-beta1.jar>
[INFO] Preparing source:jar
[WARNING] Removing: jar from forked lifecycle, to prevent recursive invocation.
[INFO] No goals needed for project - skipping
[INFO] [source:jar {execution: attach-sources}]
[INFO] Building jar: <http://hudson.zones.apache.org/hudson/job/HttpComponents%20Core/ws/httpcore-trunk/httpcore-nio/target/httpcore-nio-4.1-beta1-sources.jar>
[INFO] [install:install {execution: default-install}]
[INFO] Installing <http://hudson.zones.apache.org/hudson/job/HttpComponents%20Core/ws/httpcore-trunk/httpcore-nio/target/httpcore-nio-4.1-beta1.jar>
to /export/home/hudson/.m2/repository/org/apache/httpcomponents/httpcore-nio/4.1-beta1/httpcore-nio-4.1-beta1.jar
[INFO] Installing <http://hudson.zones.apache.org/hudson/job/HttpComponents%20Core/ws/httpcore-trunk/httpcore-nio/target/httpcore-nio-4.1-beta1-sources.jar>
to /export/home/hudson/.m2/repository/org/apache/httpcomponents/httpcore-nio/4.1-beta1/httpcore-nio-4.1-beta1-sources.jar
[HUDSON] Archiving <http://hudson.zones.apache.org/hudson/job/HttpComponents%20Core/ws/httpcore-trunk/httpcore-nio/pom.xml>
to /export/home/hudson/hudson/jobs/HttpComponents Core/modules/org.apache.httpcomponents$httpcore-nio/builds/2010-03-28_13-45-54/archive/org.apache.httpcomponents/httpcore-nio/4.1-beta1/pom.xml
[HUDSON] Archiving <http://hudson.zones.apache.org/hudson/job/HttpComponents%20Core/ws/httpcore-trunk/httpcore-nio/target/httpcore-nio-4.1-beta1.jar>
to /export/home/hudson/hudson/jobs/HttpComponents Core/modules/org.apache.httpcomponents$httpcore-nio/builds/2010-03-28_13-45-54/archive/org.apache.httpcomponents/httpcore-nio/4.1-beta1/httpcore-nio-4.1-beta1.jar
[HUDSON] Archiving <http://hudson.zones.apache.org/hudson/job/HttpComponents%20Core/ws/httpcore-trunk/httpcore-nio/target/httpcore-nio-4.1-beta1-sources.jar>
to /export/home/hudson/hudson/jobs/HttpComponents Core/modules/org.apache.httpcomponents$httpcore-nio/builds/2010-03-28_13-45-54/archive/org.apache.httpcomponents/httpcore-nio/4.1-beta1/httpcore-nio-4.1-beta1-sources.jar
[INFO] ------------------------------------------------------------------------
[INFO] Building HttpCore OSGi bundle
[INFO]    task-segment: [clean, install]
[INFO] ------------------------------------------------------------------------
[INFO] [clean:clean {execution: default-clean}]
[INFO] Deleting directory <http://hudson.zones.apache.org/hudson/job/HttpComponents%20Core/ws/httpcore-trunk/httpcore-osgi/target>
[INFO] [resources:resources {execution: default-resources}]
[INFO] Using 'UTF-8' encoding to copy filtered resources.
[INFO] skip non existing resourceDirectory <http://hudson.zones.apache.org/hudson/job/HttpComponents%20Core/ws/httpcore-trunk/httpcore-osgi/src/main/resources>
[INFO] [compiler:compile {execution: default-compile}]
[INFO] No sources to compile
[INFO] [resources:testResources {execution: default-testResources}]
[INFO] Using 'UTF-8' encoding to copy filtered resources.
[INFO] skip non existing resourceDirectory <http://hudson.zones.apache.org/hudson/job/HttpComponents%20Core/ws/httpcore-trunk/httpcore-osgi/src/test/resources>
[INFO] [compiler:testCompile {execution: default-testCompile}]
[INFO] No sources to compile
[INFO] [surefire:test {execution: default-test}]
[INFO] No tests to run.
[HUDSON] Recording test results
[INFO] [bundle:bundle {execution: default-bundle}]
[INFO] Preparing source:jar
[WARNING] Removing: jar from forked lifecycle, to prevent recursive invocation.
[INFO] No goals needed for project - skipping
[INFO] [source:jar {execution: attach-sources}]
[INFO] Building jar: <http://hudson.zones.apache.org/hudson/job/HttpComponents%20Core/ws/httpcore-trunk/httpcore-osgi/target/org.apache.httpcomponents.httpcore_4.1-beta1-sources.jar>
[INFO] [install:install {execution: default-install}]
[INFO] Installing <http://hudson.zones.apache.org/hudson/job/HttpComponents%20Core/ws/httpcore-trunk/httpcore-osgi/target/org.apache.httpcomponents.httpcore_4.1-beta1.jar>
to /export/home/hudson/.m2/repository/org/apache/httpcomponents/httpcore-osgi/4.1-beta1/httpcore-osgi-4.1-beta1.jar
[INFO] Installing <http://hudson.zones.apache.org/hudson/job/HttpComponents%20Core/ws/httpcore-trunk/httpcore-osgi/target/org.apache.httpcomponents.httpcore_4.1-beta1-sources.jar>
to /export/home/hudson/.m2/repository/org/apache/httpcomponents/httpcore-osgi/4.1-beta1/httpcore-osgi-4.1-beta1-sources.jar
[INFO] [bundle:install {execution: default-install}]
[INFO] Parsing file:/export/home/hudson/.m2/repository/repository.xml
[Fatal Error] :-1:-1: Premature end of file.
org.xml.sax.SAXParseException: Premature end of file.
	at com.sun.org.apache.xerces.internal.parsers.DOMParser.parse(DOMParser.java:264)
	at com.sun.org.apache.xerces.internal.jaxp.DocumentBuilderImpl.parse(DocumentBuilderImpl.java:292)
	at javax.xml.parsers.DocumentBuilder.parse(DocumentBuilder.java:172)
	at org.apache.felix.obrplugin.ObrUpdate.parseFile(ObrUpdate.java:347)
	at org.apache.felix.obrplugin.ObrUpdate.parseRepositoryXml(ObrUpdate.java:324)
	at org.apache.felix.obrplugin.ObrInstall.execute(ObrInstall.java:140)
	at org.apache.maven.plugin.DefaultPluginManager.executeMojo(DefaultPluginManager.java:490)
	at hudson.maven.agent.PluginManagerInterceptor.executeMojo(PluginManagerInterceptor.java:182)
	at org.apache.maven.lifecycle.DefaultLifecycleExecutor.executeGoals(DefaultLifecycleExecutor.java:694)
	at org.apache.maven.lifecycle.DefaultLifecycleExecutor.executeGoalWithLifecycle(DefaultLifecycleExecutor.java:556)
	at org.apache.maven.lifecycle.DefaultLifecycleExecutor.executeGoal(DefaultLifecycleExecutor.java:535)
	at org.apache.maven.lifecycle.DefaultLifecycleExecutor.executeGoalAndHandleFailures(DefaultLifecycleExecutor.java:387)
	at org.apache.maven.lifecycle.DefaultLifecycleExecutor.executeTaskSegments(DefaultLifecycleExecutor.java:348)
	at org.apache.maven.lifecycle.DefaultLifecycleExecutor.execute(DefaultLifecycleExecutor.java:180)
	at org.apache.maven.lifecycle.LifecycleExecutorInterceptor.execute(LifecycleExecutorInterceptor.java:65)
	at org.apache.maven.DefaultMaven.doExecute(DefaultMaven.java:328)
	at org.apache.maven.DefaultMaven.execute(DefaultMaven.java:138)
	at org.apache.maven.cli.MavenCli.main(MavenCli.java:362)
	at sun.reflect.NativeMethodAccessorImpl.invoke0(Native Method)
	at sun.reflect.NativeMethodAccessorImpl.invoke(NativeMethodAccessorImpl.java:39)
	at sun.reflect.DelegatingMethodAccessorImpl.invoke(DelegatingMethodAccessorImpl.java:25)
	at java.lang.reflect.Method.invoke(Method.java:585)
	at org.codehaus.classworlds.Launcher.launchEnhanced(Launcher.java:315)
	at org.codehaus.classworlds.Launcher.launch(Launcher.java:255)
	at hudson.maven.agent.Main.launch(Main.java:165)
	at hudson.maven.MavenBuilder.call(MavenBuilder.java:159)
	at hudson.maven.MavenModuleSetBuild$Builder.call(MavenModuleSetBuild.java:688)
	at hudson.maven.MavenModuleSetBuild$Builder.call(MavenModuleSetBuild.java:632)
	at hudson.remoting.UserRequest.perform(UserRequest.java:114)
	at hudson.remoting.UserRequest.perform(UserRequest.java:48)
	at hudson.remoting.Request$2.run(Request.java:270)
	at java.util.concurrent.Executors$RunnableAdapter.call(Executors.java:417)
	at java.util.concurrent.FutureTask$Sync.innerRun(FutureTask.java:269)
	at java.util.concurrent.FutureTask.run(FutureTask.java:123)
	at java.util.concurrent.ThreadPoolExecutor$Worker.runTask(ThreadPoolExecutor.java:650)
	at java.util.concurrent.ThreadPoolExecutor$Worker.run(ThreadPoolExecutor.java:675)
	at java.lang.Thread.run(Thread.java:595)
[INFO] Writing OBR metadata
[HUDSON] Archiving <http://hudson.zones.apache.org/hudson/job/HttpComponents%20Core/ws/httpcore-trunk/httpcore-osgi/pom.xml>
to /export/home/hudson/hudson/jobs/HttpComponents Core/modules/org.apache.httpcomponents$httpcore-osgi/builds/2010-03-28_13-45-54/archive/org.apache.httpcomponents/httpcore-osgi/4.1-beta1/pom.xml
[HUDSON] Archiving <http://hudson.zones.apache.org/hudson/job/HttpComponents%20Core/ws/httpcore-trunk/httpcore-osgi/target/org.apache.httpcomponents.httpcore_4.1-beta1.jar>
to /export/home/hudson/hudson/jobs/HttpComponents Core/modules/org.apache.httpcomponents$httpcore-osgi/builds/2010-03-28_13-45-54/archive/org.apache.httpcomponents/httpcore-osgi/4.1-beta1/org.apache.httpcomponents.httpcore_4.1-beta1.jar
[HUDSON] Archiving <http://hudson.zones.apache.org/hudson/job/HttpComponents%20Core/ws/httpcore-trunk/httpcore-osgi/target/org.apache.httpcomponents.httpcore_4.1-beta1-sources.jar>
to /export/home/hudson/hudson/jobs/HttpComponents Core/modules/org.apache.httpcomponents$httpcore-osgi/builds/2010-03-28_13-45-54/archive/org.apache.httpcomponents/httpcore-osgi/4.1-beta1/org.apache.httpcomponents.httpcore_4.1-beta1-sources.jar
[INFO] 
[INFO] 
[INFO] ------------------------------------------------------------------------
[INFO] Reactor Summary:
[INFO] ------------------------------------------------------------------------
[INFO] HttpComponents Core ................................... SUCCESS [16.926s]
[INFO] HttpCore .............................................. SUCCESS [39.182s]
[INFO] HttpCore NIO .......................................... SUCCESS [1:54.407s]
[INFO] HttpCore OSGi bundle .................................. SUCCESS [5.065s]
[INFO] ------------------------------------------------------------------------
[INFO] ------------------------------------------------------------------------
[INFO] BUILD SUCCESSFUL
[INFO] ------------------------------------------------------------------------
[INFO] Total time: 3 minutes 6 seconds
[INFO] Finished at: Sun Mar 28 13:49:14 UTC 2010
[INFO] Final Memory: 36M/189M
[INFO] ------------------------------------------------------------------------
channel stopped
Deploying artifacts to https://repository.apache.org/content/repositories/snapshots
Deploying the main artifact httpcomponents-core-4.1-beta1.pom
ERROR: Error deploying artifact: Failed to transfer file: https://repository.apache.org/content/repositories/snapshots/org/apache/httpcomponents/httpcomponents-core/4.1-beta1/httpcomponents-core-4.1-beta1.pom.
Return code is: 400
org.apache.maven.artifact.deployer.ArtifactDeploymentException: Error deploying artifact:
Failed to transfer file: https://repository.apache.org/content/repositories/snapshots/org/apache/httpcomponents/httpcomponents-core/4.1-beta1/httpcomponents-core-4.1-beta1.pom.
Return code is: 400
	at org.apache.maven.artifact.deployer.DefaultArtifactDeployer.deploy(DefaultArtifactDeployer.java:94)
	at hudson.maven.reporters.MavenArtifactRecord.deploy(MavenArtifactRecord.java:119)
	at hudson.maven.reporters.MavenAggregatedArtifactRecord.deploy(MavenAggregatedArtifactRecord.java:79)
	at hudson.maven.RedeployPublisher.perform(RedeployPublisher.java:96)
	at hudson.tasks.BuildStepMonitor$1.perform(BuildStepMonitor.java:19)
	at hudson.model.AbstractBuild$AbstractRunner.perform(AbstractBuild.java:582)
	at hudson.model.AbstractBuild$AbstractRunner.performAllBuildStep(AbstractBuild.java:563)
	at hudson.maven.MavenModuleSetBuild$RunnerImpl.post2(MavenModuleSetBuild.java:594)
	at hudson.model.AbstractBuild$AbstractRunner.post(AbstractBuild.java:528)
	at hudson.model.Run.run(Run.java:1221)
	at hudson.maven.MavenModuleSetBuild.run(MavenModuleSetBuild.java:304)
	at hudson.model.ResourceController.execute(ResourceController.java:88)
	at hudson.model.Executor.run(Executor.java:122)
Caused by: org.apache.maven.wagon.TransferFailedException: Failed to transfer file: https://repository.apache.org/content/repositories/snapshots/org/apache/httpcomponents/httpcomponents-core/4.1-beta1/httpcomponents-core-4.1-beta1.pom.
Return code is: 400
	at org.apache.maven.wagon.providers.http.LightweightHttpWagon.put(LightweightHttpWagon.java:172)
	at org.apache.maven.artifact.manager.DefaultWagonManager.putRemoteFile(DefaultWagonManager.java:244)
	at org.apache.maven.artifact.manager.DefaultWagonManager.putArtifact(DefaultWagonManager.java:160)
	at org.apache.maven.artifact.deployer.DefaultArtifactDeployer.deploy(DefaultArtifactDeployer.java:80)
	... 12 more


---------------------------------------------------------------------
To unsubscribe, e-mail: dev-unsubscribe@hc.apache.org
For additional commands, e-mail: dev-help@hc.apache.org


Mime
View raw message