hc-dev mailing list archives

Site index · List index
Message view « Date » · « Thread »
Top « Date » · « Thread »
From Julius Davies <juliusdav...@gmail.com>
Subject Re: Build failed in Hudson: HttpComponents Client #90
Date Sat, 20 Feb 2010 01:08:06 GMT
This might be from:

http://issues.apache.org/jira/browse/CODEC-89



On Fri, Feb 19, 2010 at 4:24 PM, Apache Hudson Server
<hudson@hudson.zones.apache.org> wrote:
> See <http://hudson.zones.apache.org/hudson/job/HttpComponents%20Client/90/changes>
>
> Changes:
>
> [olegk] HTTPCLIENT-914: Upgraded Commons Codec dependency to version 1.4
>
> ------------------------------------------
> [...truncated 702 lines...]
> Running org.apache.http.client.utils.TestURIUtils
> Tests run: 45, Failures: 0, Errors: 0, Skipped: 0, Time elapsed: 0.03 sec
> Running org.apache.http.impl.conn.tsccm.TestConnPoolByRoute
> Tests run: 2, Failures: 0, Errors: 0, Skipped: 0, Time elapsed: 0.005 sec
> Running org.apache.http.conn.routing.TestHttpRoute
> Tests run: 11, Failures: 0, Errors: 0, Skipped: 0, Time elapsed: 0.011 sec
> Running org.apache.http.impl.client.TestClientAuthentication
> Tests run: 6, Failures: 0, Errors: 0, Skipped: 0, Time elapsed: 0.062 sec
> Running org.apache.http.cookie.TestCookiePathComparator
> Tests run: 6, Failures: 0, Errors: 0, Skipped: 0, Time elapsed: 0.004 sec
> Running org.apache.http.impl.conn.tsccm.TestSpuriousWakeup
> Tests run: 1, Failures: 0, Errors: 0, Skipped: 0, Time elapsed: 4.238 sec
> Running org.apache.http.impl.conn.TestTSCCMNoServer
> Tests run: 11, Failures: 0, Errors: 0, Skipped: 0, Time elapsed: 1.816 sec
> Running org.apache.http.cookie.TestCookieOrigin
> Tests run: 6, Failures: 0, Errors: 0, Skipped: 0, Time elapsed: 0.004 sec
> Running org.apache.http.client.protocol.TestUriEscapes
> Tests run: 12, Failures: 0, Errors: 0, Skipped: 0, Time elapsed: 0.063 sec
> Running org.apache.http.impl.conn.TestTSCCMWithServer
> Tests run: 10, Failures: 0, Errors: 0, Skipped: 0, Time elapsed: 1.61 sec
> Running org.apache.http.impl.cookie.TestBasicCookieAttribHandlers
> Tests run: 31, Failures: 0, Errors: 0, Skipped: 0, Time elapsed: 0.017 sec
> Running org.apache.http.impl.conn.TestProxySelRoutePlanner
> Tests run: 2, Failures: 0, Errors: 0, Skipped: 0, Time elapsed: 0.005 sec
> Running org.apache.http.impl.client.TestContentCodings
> Tests run: 8, Failures: 0, Errors: 0, Skipped: 0, Time elapsed: 1.054 sec
> Running org.apache.http.impl.cookie.TestPublicSuffixListParser
> Tests run: 3, Failures: 0, Errors: 0, Skipped: 0, Time elapsed: 0.012 sec
> Running org.apache.http.conn.params.TestRouteParams
> Tests run: 4, Failures: 0, Errors: 0, Skipped: 0, Time elapsed: 0.003 sec
> Running org.apache.http.impl.auth.TestRFC2617Scheme
> Tests run: 5, Failures: 0, Errors: 0, Skipped: 0, Time elapsed: 0.003 sec
> Running org.apache.http.cookie.TestCookiePolicy
> Tests run: 3, Failures: 0, Errors: 0, Skipped: 0, Time elapsed: 0.003 sec
> Running org.apache.http.conn.TestConnectionAutoRelease
> Tests run: 4, Failures: 0, Errors: 0, Skipped: 0, Time elapsed: 1.05 sec
> Running org.apache.http.impl.cookie.TestCookieRFC2109Spec
> Tests run: 19, Failures: 0, Errors: 0, Skipped: 0, Time elapsed: 0.011 sec
> Running org.apache.http.auth.TestCredentials
> Tests run: 6, Failures: 0, Errors: 0, Skipped: 0, Time elapsed: 0.006 sec
> Running org.apache.http.impl.cookie.TestCookieNetscapeDraft
> Tests run: 11, Failures: 0, Errors: 0, Skipped: 0, Time elapsed: 0.008 sec
> Running org.apache.http.client.utils.TestURLEncodedUtils
> Tests run: 5, Failures: 0, Errors: 0, Skipped: 0, Time elapsed: 0.013 sec
> Running org.apache.http.client.methods.TestHttpRequestBase
> Tests run: 4, Failures: 0, Errors: 0, Skipped: 0, Time elapsed: 0.006 sec
> Running org.apache.http.impl.client.TestRequestRetryHandler
> Feb 20, 2010 12:23:15 AM org.apache.http.impl.client.DefaultRequestDirector tryConnect
> INFO: I/O exception (java.net.UnknownHostException) caught when connecting to the target
host: www.complete.garbage
> Feb 20, 2010 12:23:15 AM org.apache.http.impl.client.DefaultRequestDirector tryConnect
> INFO: Retrying connect
> Tests run: 2, Failures: 0, Errors: 0, Skipped: 0, Time elapsed: 0.338 sec
> Running org.apache.http.client.utils.TestRfc3492Idn
> Tests run: 2, Failures: 0, Errors: 0, Skipped: 0, Time elapsed: 0.002 sec
> Running org.apache.http.conn.TestConnectionReuse
> Feb 20, 2010 12:23:15 AM org.apache.http.impl.client.DefaultRequestDirector tryConnect
> INFO: I/O exception (java.net.UnknownHostException) caught when connecting to the target
host: www.complete.garbage
> Feb 20, 2010 12:23:15 AM org.apache.http.impl.client.DefaultRequestDirector tryConnect
> INFO: Retrying connect
> Tests run: 4, Failures: 0, Errors: 0, Skipped: 0, Time elapsed: 1.953 sec
> Running org.apache.http.conn.routing.TestRouteTracker
> Tests run: 8, Failures: 0, Errors: 0, Skipped: 0, Time elapsed: 0.012 sec
>
> Results :
>
> Tests run: 483, Failures: 0, Errors: 0, Skipped: 0
>
> [HUDSON] Recording test results
> [INFO] [jar:jar {execution: default-jar}]
> [INFO] Building jar: <http://hudson.zones.apache.org/hudson/job/HttpComponents%20Client/ws/httpclient-trunk/httpclient/target/httpclient-4.1-alpha2-SNAPSHOT.jar>
> [INFO] [jar:test-jar {execution: default}]
> [INFO] Building jar: <http://hudson.zones.apache.org/hudson/job/HttpComponents%20Client/ws/httpclient-trunk/httpclient/target/httpclient-4.1-alpha2-SNAPSHOT-tests.jar>
> [INFO] Preparing source:jar
> [WARNING] Removing: jar from forked lifecycle, to prevent recursive invocation.
> [INFO] No goals needed for project - skipping
> [INFO] [source:jar {execution: attach-sources}]
> [INFO] Building jar: <http://hudson.zones.apache.org/hudson/job/HttpComponents%20Client/ws/httpclient-trunk/httpclient/target/httpclient-4.1-alpha2-SNAPSHOT-sources.jar>
> [INFO] [install:install {execution: default-install}]
> [INFO] Installing <http://hudson.zones.apache.org/hudson/job/HttpComponents%20Client/ws/httpclient-trunk/httpclient/target/httpclient-4.1-alpha2-SNAPSHOT.jar>
to /export/home/hudson/.m2/repository/org/apache/httpcomponents/httpclient/4.1-alpha2-SNAPSHOT/httpclient-4.1-alpha2-SNAPSHOT.jar
> [INFO] Installing <http://hudson.zones.apache.org/hudson/job/HttpComponents%20Client/ws/httpclient-trunk/httpclient/target/httpclient-4.1-alpha2-SNAPSHOT-tests.jar>
to /export/home/hudson/.m2/repository/org/apache/httpcomponents/httpclient/4.1-alpha2-SNAPSHOT/httpclient-4.1-alpha2-SNAPSHOT-tests.jar
> [INFO] Installing <http://hudson.zones.apache.org/hudson/job/HttpComponents%20Client/ws/httpclient-trunk/httpclient/target/httpclient-4.1-alpha2-SNAPSHOT-sources.jar>
to /export/home/hudson/.m2/repository/org/apache/httpcomponents/httpclient/4.1-alpha2-SNAPSHOT/httpclient-4.1-alpha2-SNAPSHOT-sources.jar
> [HUDSON] Archiving <http://hudson.zones.apache.org/hudson/job/HttpComponents%20Client/ws/httpclient-trunk/httpclient/pom.xml>
to /export/home/hudson/hudson/jobs/HttpComponents Client/modules/org.apache.httpcomponents$httpclient/builds/2010-02-20_00-21-23/archive/org.apache.httpcomponents/httpclient/4.1-alpha2-SNAPSHOT/pom.xml
> [HUDSON] Archiving <http://hudson.zones.apache.org/hudson/job/HttpComponents%20Client/ws/httpclient-trunk/httpclient/target/httpclient-4.1-alpha2-SNAPSHOT.jar>
to /export/home/hudson/hudson/jobs/HttpComponents Client/modules/org.apache.httpcomponents$httpclient/builds/2010-02-20_00-21-23/archive/org.apache.httpcomponents/httpclient/4.1-alpha2-SNAPSHOT/httpclient-4.1-alpha2-SNAPSHOT.jar
> [HUDSON] Archiving <http://hudson.zones.apache.org/hudson/job/HttpComponents%20Client/ws/httpclient-trunk/httpclient/target/httpclient-4.1-alpha2-SNAPSHOT-tests.jar>
to /export/home/hudson/hudson/jobs/HttpComponents Client/modules/org.apache.httpcomponents$httpclient/builds/2010-02-20_00-21-23/archive/org.apache.httpcomponents/httpclient/4.1-alpha2-SNAPSHOT/httpclient-4.1-alpha2-SNAPSHOT-tests.jar
> [HUDSON] Archiving <http://hudson.zones.apache.org/hudson/job/HttpComponents%20Client/ws/httpclient-trunk/httpclient/target/httpclient-4.1-alpha2-SNAPSHOT-sources.jar>
to /export/home/hudson/hudson/jobs/HttpComponents Client/modules/org.apache.httpcomponents$httpclient/builds/2010-02-20_00-21-23/archive/org.apache.httpcomponents/httpclient/4.1-alpha2-SNAPSHOT/httpclient-4.1-alpha2-SNAPSHOT-sources.jar
> [INFO] ------------------------------------------------------------------------
> [INFO] Building HttpMime
> [INFO]    task-segment: [clean, install]
> [INFO] ------------------------------------------------------------------------
> [INFO] [clean:clean {execution: default-clean}]
> [INFO] [resources:resources {execution: default-resources}]
> [INFO] Using 'UTF-8' encoding to copy filtered resources.
> [INFO] Copying 0 resource
> [INFO] Copying 1 resource
> [INFO] Copying 1 resource to META-INF
> [INFO] Copying 1 resource to META-INF
> [INFO] [compiler:compile {execution: default-compile}]
> [INFO] Compiling 12 source files to <http://hudson.zones.apache.org/hudson/job/HttpComponents%20Client/ws/httpclient-trunk/httpmime/target/classes>
> [INFO] [resources:testResources {execution: default-testResources}]
> [INFO] Using 'UTF-8' encoding to copy filtered resources.
> [INFO] skip non existing resourceDirectory <http://hudson.zones.apache.org/hudson/job/HttpComponents%20Client/ws/httpclient-trunk/httpmime/src/test/resources>
> [INFO] [compiler:testCompile {execution: default-testCompile}]
> [INFO] Compiling 3 source files to <http://hudson.zones.apache.org/hudson/job/HttpComponents%20Client/ws/httpclient-trunk/httpmime/target/test-classes>
> [INFO] [surefire:test {execution: default-test}]
> [INFO] Surefire report directory: <http://hudson.zones.apache.org/hudson/job/HttpComponents%20Client/ws/httpclient-trunk/httpmime/target/surefire-reports>
>
> -------------------------------------------------------
>  T E S T S
> -------------------------------------------------------
> Running org.apache.http.entity.mime.TestMultipartContentBody
> Tests run: 2, Failures: 0, Errors: 0, Skipped: 0, Time elapsed: 2.118 sec
> Running org.apache.http.entity.mime.TestMultipartFormHttpEntity
> Tests run: 4, Failures: 0, Errors: 0, Skipped: 0, Time elapsed: 0.079 sec
> Running org.apache.http.entity.mime.TestMultipartForm
> Tests run: 6, Failures: 0, Errors: 0, Skipped: 0, Time elapsed: 0.023 sec
>
> Results :
>
> Tests run: 12, Failures: 0, Errors: 0, Skipped: 0
>
> [HUDSON] Recording test results
> [INFO] [jar:jar {execution: default-jar}]
> [INFO] Building jar: <http://hudson.zones.apache.org/hudson/job/HttpComponents%20Client/ws/httpclient-trunk/httpmime/target/httpmime-4.1-alpha2-SNAPSHOT.jar>
> [INFO] Preparing source:jar
> [WARNING] Removing: jar from forked lifecycle, to prevent recursive invocation.
> [INFO] No goals needed for project - skipping
> [INFO] [source:jar {execution: attach-sources}]
> [INFO] Building jar: <http://hudson.zones.apache.org/hudson/job/HttpComponents%20Client/ws/httpclient-trunk/httpmime/target/httpmime-4.1-alpha2-SNAPSHOT-sources.jar>
> [INFO] [install:install {execution: default-install}]
> [INFO] Installing <http://hudson.zones.apache.org/hudson/job/HttpComponents%20Client/ws/httpclient-trunk/httpmime/target/httpmime-4.1-alpha2-SNAPSHOT.jar>
to /export/home/hudson/.m2/repository/org/apache/httpcomponents/httpmime/4.1-alpha2-SNAPSHOT/httpmime-4.1-alpha2-SNAPSHOT.jar
> [INFO] Installing <http://hudson.zones.apache.org/hudson/job/HttpComponents%20Client/ws/httpclient-trunk/httpmime/target/httpmime-4.1-alpha2-SNAPSHOT-sources.jar>
to /export/home/hudson/.m2/repository/org/apache/httpcomponents/httpmime/4.1-alpha2-SNAPSHOT/httpmime-4.1-alpha2-SNAPSHOT-sources.jar
> [HUDSON] Archiving <http://hudson.zones.apache.org/hudson/job/HttpComponents%20Client/ws/httpclient-trunk/httpmime/pom.xml>
to /export/home/hudson/hudson/jobs/HttpComponents Client/modules/org.apache.httpcomponents$httpmime/builds/2010-02-20_00-21-23/archive/org.apache.httpcomponents/httpmime/4.1-alpha2-SNAPSHOT/pom.xml
> [HUDSON] Archiving <http://hudson.zones.apache.org/hudson/job/HttpComponents%20Client/ws/httpclient-trunk/httpmime/target/httpmime-4.1-alpha2-SNAPSHOT.jar>
to /export/home/hudson/hudson/jobs/HttpComponents Client/modules/org.apache.httpcomponents$httpmime/builds/2010-02-20_00-21-23/archive/org.apache.httpcomponents/httpmime/4.1-alpha2-SNAPSHOT/httpmime-4.1-alpha2-SNAPSHOT.jar
> [HUDSON] Archiving <http://hudson.zones.apache.org/hudson/job/HttpComponents%20Client/ws/httpclient-trunk/httpmime/target/httpmime-4.1-alpha2-SNAPSHOT-sources.jar>
to /export/home/hudson/hudson/jobs/HttpComponents Client/modules/org.apache.httpcomponents$httpmime/builds/2010-02-20_00-21-23/archive/org.apache.httpcomponents/httpmime/4.1-alpha2-SNAPSHOT/httpmime-4.1-alpha2-SNAPSHOT-sources.jar
> [INFO] ------------------------------------------------------------------------
> [INFO] Building HttpClient OSGi bundle
> [INFO]    task-segment: [clean, install]
> [INFO] ------------------------------------------------------------------------
> [INFO] [clean:clean {execution: default-clean}]
> [INFO] [resources:resources {execution: default-resources}]
> [INFO] Using 'UTF-8' encoding to copy filtered resources.
> [INFO] skip non existing resourceDirectory <http://hudson.zones.apache.org/hudson/job/HttpComponents%20Client/ws/httpclient-trunk/httpclient-osgi/src/main/resources>
> [INFO] [compiler:compile {execution: default-compile}]
> [INFO] No sources to compile
> [INFO] [resources:testResources {execution: default-testResources}]
> [INFO] Using 'UTF-8' encoding to copy filtered resources.
> [INFO] skip non existing resourceDirectory <http://hudson.zones.apache.org/hudson/job/HttpComponents%20Client/ws/httpclient-trunk/httpclient-osgi/src/test/resources>
> [INFO] [compiler:testCompile {execution: default-testCompile}]
> [INFO] No sources to compile
> [HUDSON] Recording test results
> [INFO] [surefire:test {execution: default-test}]
> [INFO] No tests to run.
> [INFO] [bundle:bundle {execution: default-bundle}]
> [INFO] Preparing source:jar
> [WARNING] Removing: jar from forked lifecycle, to prevent recursive invocation.
> [INFO] No goals needed for project - skipping
> [INFO] [source:jar {execution: attach-sources}]
> [INFO] Building jar: <http://hudson.zones.apache.org/hudson/job/HttpComponents%20Client/ws/httpclient-trunk/httpclient-osgi/target/org.apache.httpcomponents.httpclient_4.1-alpha2-SNAPSHOT-sources.jar>
> [INFO] [install:install {execution: default-install}]
> [INFO] Installing <http://hudson.zones.apache.org/hudson/job/HttpComponents%20Client/ws/httpclient-trunk/httpclient-osgi/target/org.apache.httpcomponents.httpclient_4.1-alpha2-SNAPSHOT.jar>
to /export/home/hudson/.m2/repository/org/apache/httpcomponents/httpclient-osgi/4.1-alpha2-SNAPSHOT/httpclient-osgi-4.1-alpha2-SNAPSHOT.jar
> [INFO] Installing <http://hudson.zones.apache.org/hudson/job/HttpComponents%20Client/ws/httpclient-trunk/httpclient-osgi/target/org.apache.httpcomponents.httpclient_4.1-alpha2-SNAPSHOT-sources.jar>
to /export/home/hudson/.m2/repository/org/apache/httpcomponents/httpclient-osgi/4.1-alpha2-SNAPSHOT/httpclient-osgi-4.1-alpha2-SNAPSHOT-sources.jar
> [INFO] [bundle:install {execution: default-install}]
> [INFO] Parsing file:/export/home/hudson/.m2/repository/repository.xml
> [Fatal Error] :-1:-1: Premature end of file.
> org.xml.sax.SAXParseException: Premature end of file.
>        at com.sun.org.apache.xerces.internal.parsers.DOMParser.parse(DOMParser.java:264)
>        at com.sun.org.apache.xerces.internal.jaxp.DocumentBuilderImpl.parse(DocumentBuilderImpl.java:292)
>        at javax.xml.parsers.DocumentBuilder.parse(DocumentBuilder.java:172)
>        at org.apache.felix.obrplugin.ObrUpdate.parseFile(ObrUpdate.java:347)
>        at org.apache.felix.obrplugin.ObrUpdate.parseRepositoryXml(ObrUpdate.java:324)
>        at org.apache.felix.obrplugin.ObrInstall.execute(ObrInstall.java:140)
>        at org.apache.maven.plugin.DefaultPluginManager.executeMojo(DefaultPluginManager.java:490)
>        at hudson.maven.agent.PluginManagerInterceptor.executeMojo(PluginManagerInterceptor.java:182)
>        at org.apache.maven.lifecycle.DefaultLifecycleExecutor.executeGoals(DefaultLifecycleExecutor.java:694)
>        at org.apache.maven.lifecycle.DefaultLifecycleExecutor.executeGoalWithLifecycle(DefaultLifecycleExecutor.java:556)
>        at org.apache.maven.lifecycle.DefaultLifecycleExecutor.executeGoal(DefaultLifecycleExecutor.java:535)
>        at org.apache.maven.lifecycle.DefaultLifecycleExecutor.executeGoalAndHandleFailures(DefaultLifecycleExecutor.java:387)
>        at org.apache.maven.lifecycle.DefaultLifecycleExecutor.executeTaskSegments(DefaultLifecycleExecutor.java:348)
>        at org.apache.maven.lifecycle.DefaultLifecycleExecutor.execute(DefaultLifecycleExecutor.java:180)
>        at org.apache.maven.lifecycle.LifecycleExecutorInterceptor.execute(LifecycleExecutorInterceptor.java:65)
>        at org.apache.maven.DefaultMaven.doExecute(DefaultMaven.java:328)
>        at org.apache.maven.DefaultMaven.execute(DefaultMaven.java:138)
>        at org.apache.maven.cli.MavenCli.main(MavenCli.java:362)
>        at sun.reflect.NativeMethodAccessorImpl.invoke0(Native Method)
>        at sun.reflect.NativeMethodAccessorImpl.invoke(NativeMethodAccessorImpl.java:39)
>        at sun.reflect.DelegatingMethodAccessorImpl.invoke(DelegatingMethodAccessorImpl.java:25)
>        at java.lang.reflect.Method.invoke(Method.java:585)
>        at org.codehaus.classworlds.Launcher.launchEnhanced(Launcher.java:315)
>        at org.codehaus.classworlds.Launcher.launch(Launcher.java:255)
>        at hudson.maven.agent.Main.launch(Main.java:165)
>        at hudson.maven.MavenBuilder.call(MavenBuilder.java:159)
>        at hudson.maven.MavenModuleSetBuild$Builder.call(MavenModuleSetBuild.java:688)
>        at hudson.maven.MavenModuleSetBuild$Builder.call(MavenModuleSetBuild.java:632)
>        at hudson.remoting.UserRequest.perform(UserRequest.java:114)
>        at hudson.remoting.UserRequest.perform(UserRequest.java:48)
>        at hudson.remoting.Request$2.run(Request.java:270)
>        at java.util.concurrent.Executors$RunnableAdapter.call(Executors.java:417)
>        at java.util.concurrent.FutureTask$Sync.innerRun(FutureTask.java:269)
>        at java.util.concurrent.FutureTask.run(FutureTask.java:123)
>        at java.util.concurrent.ThreadPoolExecutor$Worker.runTask(ThreadPoolExecutor.java:650)
>        at java.util.concurrent.ThreadPoolExecutor$Worker.run(ThreadPoolExecutor.java:675)
>        at java.lang.Thread.run(Thread.java:595)
> [INFO] Writing OBR metadata
> [HUDSON] Archiving <http://hudson.zones.apache.org/hudson/job/HttpComponents%20Client/ws/httpclient-trunk/httpclient-osgi/pom.xml>
to /export/home/hudson/hudson/jobs/HttpComponents Client/modules/org.apache.httpcomponents$httpclient-osgi/builds/2010-02-20_00-21-23/archive/org.apache.httpcomponents/httpclient-osgi/4.1-alpha2-SNAPSHOT/pom.xml
> [HUDSON] Archiving <http://hudson.zones.apache.org/hudson/job/HttpComponents%20Client/ws/httpclient-trunk/httpclient-osgi/target/org.apache.httpcomponents.httpclient_4.1-alpha2-SNAPSHOT.jar>
to /export/home/hudson/hudson/jobs/HttpComponents Client/modules/org.apache.httpcomponents$httpclient-osgi/builds/2010-02-20_00-21-23/archive/org.apache.httpcomponents/httpclient-osgi/4.1-alpha2-SNAPSHOT/org.apache.httpcomponents.httpclient_4.1-alpha2-SNAPSHOT.jar
> [HUDSON] Archiving <http://hudson.zones.apache.org/hudson/job/HttpComponents%20Client/ws/httpclient-trunk/httpclient-osgi/target/org.apache.httpcomponents.httpclient_4.1-alpha2-SNAPSHOT-sources.jar>
to /export/home/hudson/hudson/jobs/HttpComponents Client/modules/org.apache.httpcomponents$httpclient-osgi/builds/2010-02-20_00-21-23/archive/org.apache.httpcomponents/httpclient-osgi/4.1-alpha2-SNAPSHOT/org.apache.httpcomponents.httpclient_4.1-alpha2-SNAPSHOT-sources.jar
> [INFO]
> [INFO]
> [INFO] ------------------------------------------------------------------------
> [INFO] Reactor Summary:
> [INFO] ------------------------------------------------------------------------
> [INFO] HttpComponents Client ................................. SUCCESS [18.992s]
> [INFO] HttpClient ............................................ SUCCESS [2:01.794s]
> [INFO] HttpMime .............................................. SUCCESS [8.971s]
> [INFO] HttpClient OSGi bundle ................................ SUCCESS [4.509s]
> [INFO] ------------------------------------------------------------------------
> [INFO] ------------------------------------------------------------------------
> [INFO] BUILD SUCCESSFUL
> [INFO] ------------------------------------------------------------------------
> [INFO] Total time: 2 minutes 43 seconds
> [INFO] Finished at: Sat Feb 20 00:24:09 UTC 2010
> [INFO] Final Memory: 37M/191M
> [INFO] ------------------------------------------------------------------------
> Waiting for Hudson to finish collecting data
> channel stopped
> Deploying artifacts to https://repository.apache.org/content/repositories/snapshots
> Deploying the main artifact httpclient-4.1-alpha2-SNAPSHOT.jar
> [INFO ] Retrieving previous build number from
> ERROR: Error deploying artifact: Failed to transfer file: https://repository.apache.org/content/repositories/snapshots/org/apache/httpcomponents/httpclient/4.1-alpha2-SNAPSHOT/httpclient-4.1-alpha2-SNAPSHOT.jar.
Return code is: 401
> org.apache.maven.artifact.deployer.ArtifactDeploymentException: Error deploying artifact:
Failed to transfer file: https://repository.apache.org/content/repositories/snapshots/org/apache/httpcomponents/httpclient/4.1-alpha2-SNAPSHOT/httpclient-4.1-alpha2-SNAPSHOT.jar.
Return code is: 401
>        at org.apache.maven.artifact.deployer.DefaultArtifactDeployer.deploy(DefaultArtifactDeployer.java:94)
>        at hudson.maven.reporters.MavenArtifactRecord.deploy(MavenArtifactRecord.java:119)
>        at hudson.maven.reporters.MavenAggregatedArtifactRecord.deploy(MavenAggregatedArtifactRecord.java:79)
>        at hudson.maven.RedeployPublisher.perform(RedeployPublisher.java:96)
>        at hudson.tasks.BuildStepMonitor$1.perform(BuildStepMonitor.java:19)
>        at hudson.model.AbstractBuild$AbstractRunner.perform(AbstractBuild.java:582)
>        at hudson.model.AbstractBuild$AbstractRunner.performAllBuildStep(AbstractBuild.java:563)
>        at hudson.maven.MavenModuleSetBuild$RunnerImpl.post2(MavenModuleSetBuild.java:594)
>        at hudson.model.AbstractBuild$AbstractRunner.post(AbstractBuild.java:528)
>        at hudson.model.Run.run(Run.java:1221)
>        at hudson.maven.MavenModuleSetBuild.run(MavenModuleSetBuild.java:304)
>        at hudson.model.ResourceController.execute(ResourceController.java:88)
>        at hudson.model.Executor.run(Executor.java:122)
> Caused by: org.apache.maven.wagon.TransferFailedException: Failed to transfer file: https://repository.apache.org/content/repositories/snapshots/org/apache/httpcomponents/httpclient/4.1-alpha2-SNAPSHOT/httpclient-4.1-alpha2-SNAPSHOT.jar.
Return code is: 401
>        at org.apache.maven.wagon.providers.http.LightweightHttpWagon.put(LightweightHttpWagon.java:172)
>        at org.apache.maven.artifact.manager.DefaultWagonManager.putRemoteFile(DefaultWagonManager.java:244)
>        at org.apache.maven.artifact.manager.DefaultWagonManager.putArtifact(DefaultWagonManager.java:160)
>        at org.apache.maven.artifact.deployer.DefaultArtifactDeployer.deploy(DefaultArtifactDeployer.java:80)
>        ... 12 more
>
>
> ---------------------------------------------------------------------
> To unsubscribe, e-mail: dev-unsubscribe@hc.apache.org
> For additional commands, e-mail: dev-help@hc.apache.org
>
>



-- 
yours,

Julius Davies
250-592-2284 (Home)
250-893-4579 (Mobile)
http://juliusdavies.ca/logging.html

---------------------------------------------------------------------
To unsubscribe, e-mail: dev-unsubscribe@hc.apache.org
For additional commands, e-mail: dev-help@hc.apache.org


Mime
View raw message