hc-dev mailing list archives

Site index · List index
Message view « Date » · « Thread »
Top « Date » · « Thread »
From Stefan Bodewig <bode...@apache.org>
Subject [GUMP@vmgump]: Project httpcomponents-core-tests (in module httpcomponents) failed
Date Sat, 14 Feb 2009 03:10:06 GMT
To whom it may engage...
        
This is an automated request, but not an unsolicited one. For 
more information please visit http://gump.apache.org/nagged.html, 
and/or contact the folk at general@gump.apache.org.

Project httpcomponents-core-tests has an issue affecting its community integration.
This issue affects 1 projects.
The current state of this project is 'Failed', with reason 'Build Failed'.
For reference only, the following projects are affected by this:
    - httpcomponents-core-tests :  Unit Tests for HTTP Component: Core


Full details are available at:
    http://vmgump.apache.org/gump/public/httpcomponents/httpcomponents-core-tests/index.html

That said, some information snippets are provided here.

The following annotations (debug/informational/warning/error messages) were provided:
 -WARNING- Overriding Maven2 settings: [/srv/gump/public/workspace/httpcomponents/httpcore/gump_mvn_settings.xml]
 -DEBUG- (Gump generated) Maven2 Settings in: /srv/gump/public/workspace/httpcomponents/httpcore/gump_mvn_settings.xml
 -INFO- Failed with reason build failed
 -DEBUG- Maven POM in: /srv/gump/public/workspace/httpcomponents/httpcore/pom.xml
 -INFO- Project Reports in: /srv/gump/public/workspace/httpcomponents/httpcore/module-main/target/surefire-reports



The following work was performed:
http://vmgump.apache.org/gump/public/httpcomponents/httpcomponents-core-tests/gump_work/build_httpcomponents_httpcomponents-core-tests.html
Work Name: build_httpcomponents_httpcomponents-core-tests (Type: Build)
Work ended in a state of : Failed
Elapsed: 46 secs
Command Line: mvn --batch-mode --settings /srv/gump/public/workspace/httpcomponents/httpcore/gump_mvn_settings.xml
test 
[Working Directory: /srv/gump/public/workspace/httpcomponents/httpcore]
CLASSPATH: /usr/lib/jvm/java-6-sun/lib/tools.jar:/srv/gump/public/workspace/httpcomponents/httpcore/module-nio/target/httpcore-nio-4.0-beta4-SNAPSHOT.jar:/srv/gump/public/workspace/httpcomponents/httpcore/module-main/target/httpcore-4.0-beta4-SNAPSHOT.jar:/srv/gump/public/workspace/junit/dist/junit-14022009.jar:/srv/gump/packages/jsse1.0.3/lib/jcert.jar:/srv/gump/packages/jsse1.0.3/lib/jnet.jar:/srv/gump/packages/jsse1.0.3/lib/jsse.jar
---------------------------------------------
Tests run: 7, Failures: 0, Errors: 0, Skipped: 0, Time elapsed: 0.659 sec
Running org.apache.http.impl.nio.reactor.TestDefaultIOReactors
Tests run: 4, Failures: 0, Errors: 0, Skipped: 0, Time elapsed: 3.097 sec
Running org.apache.http.impl.nio.codecs.TestIdentityDecoder
Tests run: 8, Failures: 0, Errors: 0, Skipped: 0, Time elapsed: 0.023 sec
Running org.apache.http.impl.nio.codecs.TestLengthDelimitedEncoder
Tests run: 9, Failures: 0, Errors: 0, Skipped: 0, Time elapsed: 0.016 sec
Running org.apache.http.impl.nio.reactor.TestDefaultIOReactorsSSL
Tests run: 2, Failures: 0, Errors: 0, Skipped: 0, Time elapsed: 0.46 sec
Running org.apache.http.impl.nio.reactor.TestSessionInOutBuffers
Tests run: 8, Failures: 0, Errors: 0, Skipped: 0, Time elapsed: 0.011 sec
Running org.apache.http.impl.nio.codecs.TestHttpMessageParser
Tests run: 17, Failures: 0, Errors: 0, Skipped: 0, Time elapsed: 0.021 sec
Running org.apache.http.nio.protocol.TestThrottlingNHttpHandlers
Tests run: 10, Failures: 1, Errors: 0, Skipped: 0, Time elapsed: 23.249 sec <<< FAILURE!
Running org.apache.http.impl.nio.codecs.TestLengthDelimitedDecoder
Tests run: 12, Failures: 0, Errors: 0, Skipped: 0, Time elapsed: 0.028 sec
Running org.apache.http.nio.protocol.TestAsyncNHttpHandlers
Tests run: 12, Failures: 0, Errors: 0, Skipped: 0, Time elapsed: 1.66 sec
Running org.apache.http.nio.util.TestBuffers
Tests run: 7, Failures: 0, Errors: 0, Skipped: 0, Time elapsed: 0.011 sec
Running org.apache.http.impl.nio.codecs.TestChunkDecoder
Tests run: 13, Failures: 0, Errors: 0, Skipped: 0, Time elapsed: 0.014 sec
Running org.apache.http.impl.nio.codecs.TestChunkEncoder
Tests run: 6, Failures: 0, Errors: 0, Skipped: 0, Time elapsed: 0.007 sec
Running org.apache.http.impl.nio.codecs.TestIdentityEncoder
Tests run: 4, Failures: 0, Errors: 0, Skipped: 0, Time elapsed: 0.006 sec
Running org.apache.http.impl.nio.reactor.TestBaseIOReactorSSL
Tests run: 1, Failures: 0, Errors: 0, Skipped: 0, Time elapsed: 0.117 sec

Results :

Failed tests: 
  testSimpleHttpPostsWithContentLength(org.apache.http.nio.protocol.TestThrottlingNHttpHandlers)

Tests run: 128, Failures: 1, Errors: 0, Skipped: 0

[INFO] ------------------------------------------------------------------------
[ERROR] BUILD FAILURE
[INFO] ------------------------------------------------------------------------
[INFO] There are test failures.

Please refer to /srv/gump/public/workspace/httpcomponents/httpcore/module-nio/target/surefire-reports
for the individual test results.
[INFO] ------------------------------------------------------------------------
[INFO] For more information, run Maven with the -e switch
[INFO] ------------------------------------------------------------------------
[INFO] Total time: 44 seconds
[INFO] Finished at: Sat Feb 14 03:10:02 GMT-08:00 2009
[INFO] Final Memory: 19M/39M
[INFO] ------------------------------------------------------------------------
---------------------------------------------

To subscribe to this information via syndicated feeds:
- RSS: http://vmgump.apache.org/gump/public/httpcomponents/httpcomponents-core-tests/rss.xml
- Atom: http://vmgump.apache.org/gump/public/httpcomponents/httpcomponents-core-tests/atom.xml

============================== Gump Tracking Only ===
Produced by Gump version 2.3.
Gump Run 12000014022009, vmgump:vmgump-public:12000014022009
Gump E-mail Identifier (unique within run) #39.

--
Apache Gump
http://gump.apache.org/ [Instance: vmgump]

---------------------------------------------------------------------
To unsubscribe, e-mail: dev-unsubscribe@hc.apache.org
For additional commands, e-mail: dev-help@hc.apache.org


Mime
View raw message