hc-dev mailing list archives

Site index · List index
Message view « Date » · « Thread »
Top « Date » · « Thread »
From Stefan Bodewig <bode...@apache.org>
Subject [GUMP@vmgump]: Project httpcomponents-core-tests (in module httpcomponents) failed
Date Wed, 20 Aug 2008 07:31:04 GMT
To whom it may engage...
        
This is an automated request, but not an unsolicited one. For 
more information please visit http://gump.apache.org/nagged.html, 
and/or contact the folk at general@gump.apache.org.

Project httpcomponents-core-tests has an issue affecting its community integration.
This issue affects 1 projects,
 and has been outstanding for 57 runs.
The current state of this project is 'Failed', with reason 'Build Failed'.
For reference only, the following projects are affected by this:
    - httpcomponents-core-tests :  Unit Tests for HTTP Component: Core


Full details are available at:
    http://vmgump.apache.org/gump/public/httpcomponents/httpcomponents-core-tests/index.html

That said, some information snippets are provided here.

The following annotations (debug/informational/warning/error messages) were provided:
 -WARNING- Overriding Maven2 settings: [/srv/gump/public/workspace/httpcomponents/httpcore/gump_mvn_settings.xml]
 -DEBUG- (Gump generated) Maven2 Settings in: /srv/gump/public/workspace/httpcomponents/httpcore/gump_mvn_settings.xml
 -INFO- Failed with reason build failed
 -DEBUG- Maven POM in: /srv/gump/public/workspace/httpcomponents/httpcore/pom.xml
 -INFO- Project Reports in: /srv/gump/public/workspace/httpcomponents/httpcore/module-main/target/surefire-reports



The following work was performed:
http://vmgump.apache.org/gump/public/httpcomponents/httpcomponents-core-tests/gump_work/build_httpcomponents_httpcomponents-core-tests.html
Work Name: build_httpcomponents_httpcomponents-core-tests (Type: Build)
Work ended in a state of : Failed
Elapsed: 1 min 1 sec
Command Line: mvn --batch-mode --settings /srv/gump/public/workspace/httpcomponents/httpcore/gump_mvn_settings.xml
test 
[Working Directory: /srv/gump/public/workspace/httpcomponents/httpcore]
CLASSPATH: /usr/lib/jvm/java-1.5.0-sun/lib/tools.jar:/srv/gump/public/workspace/httpcomponents/httpcore/module-nio/target/httpcore-nio-4.0-beta3-SNAPSHOT.jar:/srv/gump/public/workspace/httpcomponents/httpcore/module-main/target/httpcore-4.0-beta3-SNAPSHOT.jar:/srv/gump/public/workspace/junit/dist/junit-20082008.jar:/srv/gump/packages/jsse1.0.3/lib/jcert.jar:/srv/gump/packages/jsse1.0.3/lib/jnet.jar:/srv/gump/packages/jsse1.0.3/lib/jsse.jar
---------------------------------------------
 T E S T S
-------------------------------------------------------
Running org.apache.http.TestAll
Tests run: 405, Failures: 0, Errors: 0, Skipped: 0, Time elapsed: 2.152 sec

Results :

Tests run: 405, Failures: 0, Errors: 0, Skipped: 0

[INFO] ------------------------------------------------------------------------
[INFO] Building HttpCore (NIO extensions module)
[INFO]    task-segment: [test]
[INFO] ------------------------------------------------------------------------
[INFO] [resources:resources]
[INFO] Using default encoding to copy filtered resources.
[INFO] [compiler:compile]
[INFO] Nothing to compile - all classes are up to date
[INFO] [resources:testResources]
[INFO] Using default encoding to copy filtered resources.
[INFO] [compiler:testCompile]
[INFO] Compiling 38 source files to /srv/gump/public/workspace/httpcomponents/httpcore/module-nio/target/test-classes
[INFO] [surefire:test]
[INFO] Surefire report directory: /srv/gump/public/workspace/httpcomponents/httpcore/module-nio/target/surefire-reports

-------------------------------------------------------
 T E S T S
-------------------------------------------------------
Running org.apache.http.nio.TestAll
Tests run: 127, Failures: 1, Errors: 0, Skipped: 0, Time elapsed: 38.127 sec <<<
FAILURE!

Results :

Failed tests: 
  testSimpleHttpPostsHTTP10(org.apache.http.nio.protocol.TestThrottlingNHttpHandlers)

Tests run: 127, Failures: 1, Errors: 0, Skipped: 0

[INFO] ------------------------------------------------------------------------
[ERROR] BUILD FAILURE
[INFO] ------------------------------------------------------------------------
[INFO] There are test failures.

Please refer to /srv/gump/public/workspace/httpcomponents/httpcore/module-nio/target/surefire-reports
for the individual test results.
[INFO] ------------------------------------------------------------------------
[INFO] For more information, run Maven with the -e switch
[INFO] ------------------------------------------------------------------------
[INFO] Total time: 59 seconds
[INFO] Finished at: Wed Aug 20 06:30:59 GMT-08:00 2008
[INFO] Final Memory: 9M/24M
[INFO] ------------------------------------------------------------------------
---------------------------------------------

To subscribe to this information via syndicated feeds:
- RSS: http://vmgump.apache.org/gump/public/httpcomponents/httpcomponents-core-tests/rss.xml
- Atom: http://vmgump.apache.org/gump/public/httpcomponents/httpcomponents-core-tests/atom.xml

============================== Gump Tracking Only ===
Produced by Gump version 2.3.
Gump Run 46000020082008, vmgump:vmgump-public:46000020082008
Gump E-mail Identifier (unique within run) #32.

--
Apache Gump
http://gump.apache.org/ [Instance: vmgump]

---------------------------------------------------------------------
To unsubscribe, e-mail: dev-unsubscribe@hc.apache.org
For additional commands, e-mail: dev-help@hc.apache.org


Mime
View raw message