hc-dev mailing list archives

Site index · List index
Message view « Date » · « Thread »
Top « Date » · « Thread »
From sebb <seb...@gmail.com>
Subject Re: [continuum] BUILD FAILURE: HttpComponents - HttpComponents Client - Build Def:
Date Sun, 11 May 2008 18:59:54 GMT
Here's the full report.

Maybe the WARNINGS are significant?

[INFO] Scanning for projects...
[INFO] Reactor build order:
[INFO]   HttpComponents Client
[INFO]   HttpClient (base module)
[INFO]   HttpClient (MIME entities)
[INFO] ----------------------------------------------------------------------------
[INFO] Building HttpComponents Client
[INFO]    task-segment: [clean, package]
[INFO] ----------------------------------------------------------------------------
[INFO] [clean:clean]
[INFO] Deleting directory /home/continuum/data/working-directory/353/target
[INFO] Deleting directory
/home/continuum/data/working-directory/353/target/classes
[INFO] Deleting directory
/home/continuum/data/working-directory/353/target/test-classes
[INFO] Deleting directory /home/continuum/data/working-directory/353/target/site
[INFO] [site:attach-descriptor]
[WARNING] Unable to load parent project from repository: Could not
find the model file
'/home/continuum/data/working-directory/353/../project/pom.xml'. for
project unknown
[INFO] Preparing source:jar
[WARNING] Removing: jar from forked lifecycle, to prevent recursive invocation.
[INFO] No goals needed for project - skipping
[INFO] [source:jar {execution: attach-sources}]
[INFO] ----------------------------------------------------------------------------
[INFO] Building HttpClient (base module)
[INFO]    task-segment: [clean, package]
[INFO] ----------------------------------------------------------------------------
[INFO] [clean:clean]
[INFO] Deleting directory
/home/continuum/data/working-directory/353/module-client/target
[INFO] Deleting directory
/home/continuum/data/working-directory/353/module-client/target/classes
[INFO] Deleting directory
/home/continuum/data/working-directory/353/module-client/target/test-classes
[INFO] Deleting directory
/home/continuum/data/working-directory/353/module-client/target/site
[INFO] [resources:resources]
[INFO] Using default encoding to copy filtered resources.
[INFO] [compiler:compile]
[INFO] Compiling 193 source files to
/home/continuum/data/working-directory/353/module-client/target/classes
[INFO] ------------------------------------------------------------------------
[ERROR] BUILD FAILURE
[INFO] ------------------------------------------------------------------------
[INFO] Compilation failure

/home/continuum/data/working-directory/353/module-client/src/main/java/org/apache/http/impl/client/AbstractHttpClient.java:[59,32]
cannot find symbol
symbol  : class DefaultedHttpContext
location: package org.apache.http.protocol

/home/continuum/data/working-directory/353/module-client/src/main/java/org/apache/http/impl/client/AbstractHttpClient.java:[491,34]
cannot find symbol
symbol  : class DefaultedHttpContext
location: class org.apache.http.impl.client.AbstractHttpClient

/home/continuum/data/working-directory/353/module-client/src/main/java/org/apache/http/impl/client/RequestWrapper.java:[145,8]
headergroup has private access in
org.apache.http.message.AbstractHttpMessage


[INFO] ------------------------------------------------------------------------
[INFO] For more information, run Maven with the -e switch
[INFO] ------------------------------------------------------------------------
[INFO] Total time: 19 seconds
[INFO] Finished at: Sun May 11 11:38:33 PDT 2008
[INFO] Final Memory: 10M/29M
[INFO] ------------------------------------------------------------------------


On 11/05/0008, Continuum@vmbuild.apache.org <commits@hc.apache.org> wrote:
> Online report :
> http://vmbuild.apache.org/continuum/buildResult.action?buildId=88791&projectId=353
>
>  Build statistics:
>   State: Failed
>   Previous Build: No previous build.
>   Started at: Sun 11 May 2008 11:38:03 -0700
>   Finished at: Sun 11 May 2008 11:38:33 -0700
>   Total time: 30s
>   Build Trigger: Forced
>   Build Number: 62
>   Exit code: 1
>   Building machine hostname: vmbuild.apache.org
>   Operating system : Linux(unknown)
>   Java Home version :         java version "1.5.0_12"
>          Java(TM) 2 Runtime Environment, Standard Edition (build
> 1.5.0_12-b04)
>          Java HotSpot(TM) Client VM (build 1.5.0_12-b04, mixed mode,
> sharing)
>         Builder version :
>          Maven version: 2.0.7
>          Java version: 1.5.0_12
>          OS name: "linux" version: "2.6.20-16-server" arch: "i386"
>
> ****************************************************************************
>  SCM Changes:
> ****************************************************************************
>  No files changed
>
> ****************************************************************************
>  Dependencies Changes:
> ****************************************************************************
>  No dependencies changed
>
>
> ****************************************************************************
>  Build Defintion:
> ****************************************************************************
>  POM filename: pom.xml
>  Goals: clean package   Arguments: --batch-mode
>
>  Build Fresh: false
>  Always Build: false
>  Default Build Definition: true
>  Schedule: DEFAULT_SCHEDULE
>  Profile Name: Java 5
>  Description:
> ****************************************************************************
>  Test Summary:
> ****************************************************************************
>  Tests: 10
>  Failures: 0
>  Total time: 0.774
>
>
>
>
>

---------------------------------------------------------------------
To unsubscribe, e-mail: dev-unsubscribe@hc.apache.org
For additional commands, e-mail: dev-help@hc.apache.org


Mime
View raw message