hc-dev mailing list archives

Site index · List index
Message view « Date » · « Thread »
Top « Date » · « Thread »
From GUMP <ossf...@dubioso.net>
Subject [GUMP@vmgump]: Project httpcomponents-core (in module httpcomponents) failed
Date Tue, 28 Aug 2007 00:30:22 GMT
To whom it may engage...
        
This is an automated request, but not an unsolicited one. For 
more information please visit http://gump.apache.org/nagged.html, 
and/or contact the folk at general@gump.apache.org.

Project httpcomponents-core has an issue affecting its community integration.
This issue affects 3 projects,
 and has been outstanding for 58 runs.
The current state of this project is 'Failed', with reason 'Build Failed'.
For reference only, the following projects are affected by this:
    - httpcomponents-client :  HTTP Component: Client
    - httpcomponents-core :  HTTP Component: Core
    - httpcomponents-core-tests :  Unit Tests for HTTP Component: Core


Full details are available at:
    http://vmgump.apache.org/gump/public/httpcomponents/httpcomponents-core/index.html

That said, some information snippets are provided here.

The following annotations (debug/informational/warning/error messages) were provided:
 -DEBUG- (Gump generated) Maven Properties in: /srv/gump/public/workspace/httpcomponents/httpcore/profiles.xml
 -INFO- Failed with reason build failed
 -DEBUG- Maven POM in: /srv/gump/public/workspace/httpcomponents/httpcore/pom.xml
 -INFO- Project Reports in: /srv/gump/public/workspace/httpcomponents/httpcore/module-main/target/surefire-reports
 -DEBUG- Extracted fallback artifacts from Gump Repository



The following work was performed:
http://vmgump.apache.org/gump/public/httpcomponents/httpcomponents-core/gump_work/build_httpcomponents_httpcomponents-core.html
Work Name: build_httpcomponents_httpcomponents-core (Type: Build)
Work ended in a state of : Failed
Elapsed: 47 secs
Command Line: mvn install 
[Working Directory: /srv/gump/public/workspace/httpcomponents/httpcore]
CLASSPATH: /usr/lib/jvm/java-1.5.0-sun/lib/tools.jar
---------------------------------------------
Running org.apache.http.TestAll
Tests run: 370, Failures: 0, Errors: 0, Skipped: 0, Time elapsed: 1.207 sec

Results :

Tests run: 370, Failures: 0, Errors: 0, Skipped: 0

[INFO] [jar:jar]
[INFO] Building jar: /srv/gump/public/workspace/httpcomponents/httpcore/module-main/target/httpcore-4.0-alpha6-SNAPSHOT.jar
[INFO] [install:install]
[INFO] Installing /srv/gump/public/workspace/httpcomponents/httpcore/module-main/target/httpcore-4.0-alpha6-SNAPSHOT.jar
to /home/gump/.m2/repository/org/apache/httpcomponents/httpcore/4.0-alpha6-SNAPSHOT/httpcore-4.0-alpha6-SNAPSHOT.jar
[INFO] ----------------------------------------------------------------------------
[INFO] Building HttpCore (NIO extensions module)
[INFO]    task-segment: [install]
[INFO] ----------------------------------------------------------------------------
[INFO] [resources:resources]
[INFO] Using default encoding to copy filtered resources.
[INFO] [compiler:compile]
[INFO] Compiling 84 source files to /srv/gump/public/workspace/httpcomponents/httpcore/module-nio/target/classes
[INFO] [resources:testResources]
[INFO] Using default encoding to copy filtered resources.
[INFO] [compiler:testCompile]
[INFO] Compiling 25 source files to /srv/gump/public/workspace/httpcomponents/httpcore/module-nio/target/test-classes
[INFO] [surefire:test]
[INFO] Surefire report directory: /srv/gump/public/workspace/httpcomponents/httpcore/module-nio/target/surefire-reports

-------------------------------------------------------
 T E S T S
-------------------------------------------------------
Running org.apache.http.nio.TestAll
Tests run: 104, Failures: 1, Errors: 0, Skipped: 0, Time elapsed: 11.152 sec <<<
FAILURE!

Results :

Failed tests: 
  testHttpPostsWithExpectContinue(org.apache.http.nio.protocol.TestNIOHttp)

Tests run: 104, Failures: 1, Errors: 0, Skipped: 0

[INFO] ------------------------------------------------------------------------
[ERROR] BUILD FAILURE
[INFO] ------------------------------------------------------------------------
[INFO] There are test failures.
[INFO] ------------------------------------------------------------------------
[INFO] For more information, run Maven with the -e switch
[INFO] ------------------------------------------------------------------------
[INFO] Total time: 46 seconds
[INFO] Finished at: Mon Aug 27 23:30:21 GMT-08:00 2007
[INFO] Final Memory: 12M/28M
[INFO] ------------------------------------------------------------------------
---------------------------------------------

To subscribe to this information via syndicated feeds:
- RSS: http://vmgump.apache.org/gump/public/httpcomponents/httpcomponents-core/rss.xml
- Atom: http://vmgump.apache.org/gump/public/httpcomponents/httpcomponents-core/atom.xml

============================== Gump Tracking Only ===
Produced by Gump version 2.3.
Gump Run 20000028082007, vmgump:vmgump-public:20000028082007
Gump E-mail Identifier (unique within run) #1.

--
Apache Gump
http://gump.apache.org/ [Instance: vmgump]

---------------------------------------------------------------------
To unsubscribe, e-mail: httpcomponents-dev-unsubscribe@jakarta.apache.org
For additional commands, e-mail: httpcomponents-dev-help@jakarta.apache.org


Mime
View raw message