hc-commits mailing list archives

Site index · List index
Message view « Date » · « Thread »
Top « Date » · « Thread »
From Apache Jenkins Server <jenk...@builds.apache.org>
Subject Build failed in Jenkins: httpcomponents-core-5.x #297
Date Mon, 08 Jan 2018 12:48:58 GMT
See <https://builds.apache.org/job/httpcomponents-core-5.x/297/display/redirect?page=changes>

Changes:

[olegk] Added immutable, completed Future implementation

------------------------------------------
Started by an SCM change
[EnvInject] - Loading node environment variables.
Building remotely on H12 (Hadoop xenial) in workspace <https://builds.apache.org/job/httpcomponents-core-5.x/ws/>
 > git rev-parse --is-inside-work-tree # timeout=10
Fetching changes from the remote Git repository
 > git config remote.origin.url https://git-wip-us.apache.org/repos/asf/httpcomponents-core.git
# timeout=10
Fetching upstream changes from https://git-wip-us.apache.org/repos/asf/httpcomponents-core.git
 > git --version # timeout=10
 > git fetch --tags --progress https://git-wip-us.apache.org/repos/asf/httpcomponents-core.git
+refs/heads/*:refs/remotes/origin/*
 > git rev-parse refs/remotes/origin/master^{commit} # timeout=10
 > git rev-parse refs/remotes/origin/origin/master^{commit} # timeout=10
Checking out Revision 820953a938a764459e1dbc9a7dd1643b82026534 (refs/remotes/origin/master)
 > git config core.sparsecheckout # timeout=10
 > git checkout -f 820953a938a764459e1dbc9a7dd1643b82026534
Commit message: "Added immutable, completed Future implementation"
 > git rev-list 694db38c1ec148a0d8e2f37aa07f3f6f2089a5d2 # timeout=10
Parsing POMs
Modules changed, recalculating dependency graph
Established TCP socket on 44803
maven33-agent.jar already up to date
maven33-interceptor.jar already up to date
maven3-interceptor-commons.jar already up to date
[httpcomponents-core-5.x] $ /home/jenkins/tools/java/latest1.8/bin/java -Xmx2g -Xms256m -cp
/home/jenkins/jenkins-slave/maven33-agent.jar:/home/jenkins/tools/maven/apache-maven-3.3.9/boot/plexus-classworlds-2.5.2.jar:/home/jenkins/tools/maven/apache-maven-3.3.9/conf/logging
jenkins.maven3.agent.Maven33Main /home/jenkins/tools/maven/apache-maven-3.3.9 /home/jenkins/jenkins-slave/slave.jar
/home/jenkins/jenkins-slave/maven33-interceptor.jar /home/jenkins/jenkins-slave/maven3-interceptor-commons.jar
44803
<===[JENKINS REMOTING CAPACITY]===>   channel started
Executing Maven:  -B -f <https://builds.apache.org/job/httpcomponents-core-5.x/ws/pom.xml>
-Dmaven.repo.local=/home/jenkins/jenkins-slave/maven-repositories/1 clean install -P-lax-doclint
[INFO] Scanning for projects...
[INFO] ------------------------------------------------------------------------
[INFO] Reactor Build Order:
[INFO] 
[INFO] Apache HttpComponents Core Parent
[INFO] Apache HttpComponents Core HTTP/1.1
[INFO] Apache HttpComponents Core HTTP/2
[INFO] Apache HttpComponents Core OSGi Bundle
[INFO] Apache HttpComponents Core Integration Tests
[INFO]                                                                         
[INFO] ------------------------------------------------------------------------
[INFO] Building Apache HttpComponents Core Parent 5.0-beta2-SNAPSHOT
[INFO] ------------------------------------------------------------------------
[INFO] 
[INFO] --- maven-clean-plugin:3.0.0:clean (default-clean) @ httpcore5-parent ---
[INFO] Deleting <https://builds.apache.org/job/httpcomponents-core-5.x/ws/target>
[INFO] 
[INFO] --- maven-checkstyle-plugin:2.17:checkstyle (validate) @ httpcore5-parent ---
[INFO] 
[INFO] --- maven-checkstyle-plugin:2.17:checkstyle (validate-main) @ httpcore5-parent ---
[INFO] 
[INFO] --- maven-checkstyle-plugin:2.17:checkstyle (validate-test) @ httpcore5-parent ---
[INFO] 
[INFO] --- maven-checkstyle-plugin:2.17:checkstyle (validate-examples) @ httpcore5-parent
---
[INFO] 
[INFO] --- build-helper-maven-plugin:3.0.0:parse-version (parse-version) @ httpcore5-parent
---
[INFO] 
[INFO] --- maven-toolchains-plugin:1.1:toolchain (default) @ httpcore5-parent ---
[INFO] Required toolchain: jdk [ version='1.7' ]
[INFO] Found matching toolchain for type jdk: JDK[/home/jenkins/tools/java/latest1.7/]
[INFO] 
[INFO] --- maven-remote-resources-plugin:1.5:process (process-resource-bundles) @ httpcore5-parent
---
[INFO] 
[INFO] --- animal-sniffer-maven-plugin:1.16:check (checkAPIcompatibility) @ httpcore5-parent
---
[INFO] Checking unresolved references to org.codehaus.mojo.signature:java17:1.0
[INFO] 
[INFO] >>> maven-source-plugin:3.0.1:jar (attach-sources) > generate-sources @
httpcore5-parent >>>
[INFO] 
[INFO] --- maven-checkstyle-plugin:2.17:checkstyle (validate) @ httpcore5-parent ---
[INFO] Starting audit...
Audit done.
[INFO] 
[INFO] --- maven-checkstyle-plugin:2.17:checkstyle (validate-main) @ httpcore5-parent ---
[INFO] Starting audit...
Audit done.
[INFO] 
[INFO] --- maven-checkstyle-plugin:2.17:checkstyle (validate-test) @ httpcore5-parent ---
[INFO] Starting audit...
Audit done.
[INFO] 
[INFO] --- maven-checkstyle-plugin:2.17:checkstyle (validate-examples) @ httpcore5-parent
---
[INFO] Starting audit...
Audit done.
[INFO] 
[INFO] --- build-helper-maven-plugin:3.0.0:parse-version (parse-version) @ httpcore5-parent
---
[INFO] 
[INFO] --- maven-toolchains-plugin:1.1:toolchain (default) @ httpcore5-parent ---
[INFO] Required toolchain: jdk [ version='1.7' ]
[INFO] Found matching toolchain for type jdk: JDK[/home/jenkins/tools/java/latest1.7/]
[WARNING] Failed to getClass for org.apache.maven.plugins.source.SourceJarMojo
[INFO] 
[INFO] <<< maven-source-plugin:3.0.1:jar (attach-sources) < generate-sources @
httpcore5-parent <<<
[INFO] 
[INFO] --- maven-source-plugin:3.0.1:jar (attach-sources) @ httpcore5-parent ---
[INFO] 
[INFO] --- maven-javadoc-plugin:3.0.0-M1:jar (attach-javadocs) @ httpcore5-parent ---
[INFO] Not executing Javadoc as the project is not a Java classpath-capable package
[INFO] 
[INFO] --- maven-site-plugin:3.6:attach-descriptor (attach-descriptor) @ httpcore5-parent
---
[INFO] No site descriptor found: nothing to attach.
[INFO] 
[INFO] --- apache-rat-plugin:0.11:check (default) @ httpcore5-parent ---
[INFO] 55 implicit excludes (use -debug for more details).
[INFO] Exclude: DEPENDENCIES
[INFO] Exclude: .pmd
[INFO] Exclude: **/.checkstyle
[INFO] Exclude: **/.pmd
[INFO] Exclude: **/*.iml
[INFO] Exclude: **/.externalToolBuilders/**
[INFO] Exclude: maven-eclipse.xml
[INFO] Exclude: src/docbkx/resources/**
[INFO] Exclude: src/test/resources/*.truststore
[INFO] Exclude: **/.dockerignore
[INFO] 19 resources included (use -debug for more details)
[INFO] Rat check: Summary of files. Unapproved: 0 unknown: 0 generated: 0 approved: 11 licence.
[INFO] 
[INFO] --- maven-install-plugin:2.5.2:install (default-install) @ httpcore5-parent ---
[INFO] Installing <https://builds.apache.org/job/httpcomponents-core-5.x/ws/pom.xml>
to /home/jenkins/jenkins-slave/maven-repositories/1/org/apache/httpcomponents/core5/httpcore5-parent/5.0-beta2-SNAPSHOT/httpcore5-parent-5.0-beta2-SNAPSHOT.pom
[INFO]                                                                         
[INFO] ------------------------------------------------------------------------
[INFO] Building Apache HttpComponents Core HTTP/1.1 5.0-beta2-SNAPSHOT
[INFO] ------------------------------------------------------------------------
[INFO] 
[INFO] --- maven-clean-plugin:3.0.0:clean (default-clean) @ httpcore5 ---
[INFO] Deleting <https://builds.apache.org/job/httpcomponents-core-5.x/ws/httpcore5/target>
[INFO] 
[INFO] --- maven-checkstyle-plugin:2.17:checkstyle (validate) @ httpcore5 ---
[INFO] Starting audit...
Audit done.
[INFO] 
[INFO] --- maven-checkstyle-plugin:2.17:checkstyle (validate-main) @ httpcore5 ---
[INFO] Starting audit...
Audit done.
[INFO] 
[INFO] --- maven-checkstyle-plugin:2.17:checkstyle (validate-test) @ httpcore5 ---
[INFO] Starting audit...
Audit done.
[INFO] 
[INFO] --- maven-checkstyle-plugin:2.17:checkstyle (validate-examples) @ httpcore5 ---
[INFO] Starting audit...
Audit done.
[INFO] 
[INFO] --- build-helper-maven-plugin:3.0.0:parse-version (parse-version) @ httpcore5 ---
[INFO] 
[INFO] --- maven-toolchains-plugin:1.1:toolchain (default) @ httpcore5 ---
[INFO] Required toolchain: jdk [ version='1.7' ]
[INFO] Found matching toolchain for type jdk: JDK[/home/jenkins/tools/java/latest1.7/]
[INFO] 
[INFO] --- maven-remote-resources-plugin:1.5:process (process-resource-bundles) @ httpcore5
---
[INFO] 
[INFO] --- maven-resources-plugin:3.0.2:resources (default-resources) @ httpcore5 ---
[INFO] Using 'UTF-8' encoding to copy filtered resources.
[INFO] Copying 1 resource
[INFO] Copying 3 resources
[INFO] 
[INFO] --- maven-compiler-plugin:3.7.0:compile (default-compile) @ httpcore5 ---
[INFO] Toolchain in maven-compiler-plugin: JDK[/home/jenkins/tools/java/latest1.7/]
[INFO] Changes detected - recompiling the module!
[INFO] Compiling 447 source files to <https://builds.apache.org/job/httpcomponents-core-5.x/ws/httpcore5/target/classes>
[INFO] -------------------------------------------------------------
[ERROR] COMPILATION ERROR : 
[INFO] -------------------------------------------------------------
[ERROR] <https://builds.apache.org/job/httpcomponents-core-5.x/ws/httpcore5/src/main/java/org/apache/hc/core5/concurrent/CompletedFuture.java>:[32,42]
error: package jdk.nashorn.internal.ir.annotations does not exist
[ERROR] <https://builds.apache.org/job/httpcomponents-core-5.x/ws/httpcore5/src/main/java/org/apache/hc/core5/concurrent/CompletedFuture.java>:[40,1]
error: cannot find symbol
  symbol: class Immutable
[INFO] 2 errors 
[INFO] -------------------------------------------------------------
[INFO] ------------------------------------------------------------------------
[INFO] Reactor Summary:
[INFO] 
[INFO] Apache HttpComponents Core Parent .................. SUCCESS [ 11.085 s]
[INFO] Apache HttpComponents Core HTTP/1.1 ................ FAILURE [ 10.854 s]
[INFO] Apache HttpComponents Core HTTP/2 .................. SKIPPED
[INFO] Apache HttpComponents Core OSGi Bundle ............. SKIPPED
[INFO] Apache HttpComponents Core Integration Tests ....... SKIPPED
[INFO] ------------------------------------------------------------------------
[INFO] BUILD FAILURE
[INFO] ------------------------------------------------------------------------
[INFO] Total time: 31.207 s
[INFO] Finished at: 2018-01-08T12:48:52+00:00
[INFO] Final Memory: 43M/629M
[INFO] ------------------------------------------------------------------------
[ERROR] Failed to execute goal org.apache.maven.plugins:maven-compiler-plugin:3.7.0:compile
(default-compile) on project httpcore5: Compilation failure: Compilation failure:
[ERROR] <https://builds.apache.org/job/httpcomponents-core-5.x/ws/httpcore5/src/main/java/org/apache/hc/core5/concurrent/CompletedFuture.java>:[32,42]
error: package jdk.nashorn.internal.ir.annotations does not exist
[ERROR] <https://builds.apache.org/job/httpcomponents-core-5.x/ws/httpcore5/src/main/java/org/apache/hc/core5/concurrent/CompletedFuture.java>:[40,1]
error: cannot find symbol
[ERROR] symbol: class Immutable
[ERROR] -> [Help 1]
[ERROR] 
[ERROR] To see the full stack trace of the errors, re-run Maven with the -e switch.
[ERROR] Re-run Maven using the -X switch to enable full debug logging.
[ERROR] 
[ERROR] For more information about the errors and possible solutions, please read the following
articles:
[ERROR] [Help 1] http://cwiki.apache.org/confluence/display/MAVEN/MojoFailureException
[ERROR] 
[ERROR] After correcting the problems, you can resume the build with the command
[ERROR]   mvn <goals> -rf :httpcore5
[JENKINS] Archiving <https://builds.apache.org/job/httpcomponents-core-5.x/ws/httpcore5-h2/pom.xml>
to org.apache.httpcomponents.core5/httpcore5-h2/5.0-beta2-SNAPSHOT/httpcore5-h2-5.0-beta2-SNAPSHOT.pom
[JENKINS] Archiving <https://builds.apache.org/job/httpcomponents-core-5.x/ws/pom.xml>
to org.apache.httpcomponents.core5/httpcore5-parent/5.0-beta2-SNAPSHOT/httpcore5-parent-5.0-beta2-SNAPSHOT.pom
[JENKINS] Archiving <https://builds.apache.org/job/httpcomponents-core-5.x/ws/httpcore5/pom.xml>
to org.apache.httpcomponents.core5/httpcore5/5.0-beta2-SNAPSHOT/httpcore5-5.0-beta2-SNAPSHOT.pom
[JENKINS] Archiving <https://builds.apache.org/job/httpcomponents-core-5.x/ws/httpcore5-osgi/pom.xml>
to org.apache.httpcomponents.core5/httpcore5-osgi/5.0-beta2-SNAPSHOT/httpcore5-osgi-5.0-beta2-SNAPSHOT.pom
[JENKINS] Archiving <https://builds.apache.org/job/httpcomponents-core-5.x/ws/httpcore5-testing/pom.xml>
to org.apache.httpcomponents.core5/httpcore5-testing/5.0-beta2-SNAPSHOT/httpcore5-testing-5.0-beta2-SNAPSHOT.pom
Sending e-mails to: commits@hc.apache.org
channel stopped

Mime
View raw message