hc-commits mailing list archives

Site index · List index
Message view « Date » · « Thread »
Top « Date » · « Thread »
From Apache Jenkins Server <jenk...@builds.apache.org>
Subject Build failed in Jenkins: httpcomponents-core-4.4.x #225
Date Tue, 05 Dec 2017 22:31:09 GMT
See <https://builds.apache.org/job/httpcomponents-core-4.4.x/225/display/redirect?page=changes>

Changes:

[ggregory] [HTTPCORE-497] Add API Add API

------------------------------------------
Started by an SCM change
[EnvInject] - Loading node environment variables.
Building remotely on ubuntu-4 (ubuntu trusty) in workspace <https://builds.apache.org/job/httpcomponents-core-4.4.x/ws/>
 > git rev-parse --is-inside-work-tree # timeout=10
Fetching changes from the remote Git repository
 > git config remote.origin.url https://git-wip-us.apache.org/repos/asf/httpcomponents-core.git
# timeout=10
Fetching upstream changes from https://git-wip-us.apache.org/repos/asf/httpcomponents-core.git
 > git --version # timeout=10
 > git fetch --tags --progress https://git-wip-us.apache.org/repos/asf/httpcomponents-core.git
+refs/heads/*:refs/remotes/origin/*
 > git rev-parse refs/remotes/origin/4.4.x^{commit} # timeout=10
 > git rev-parse refs/remotes/origin/origin/4.4.x^{commit} # timeout=10
Checking out Revision 58d72ebd7e496597830fb8d75690207fe66ed95d (refs/remotes/origin/4.4.x)
 > git config core.sparsecheckout # timeout=10
 > git checkout -f 58d72ebd7e496597830fb8d75690207fe66ed95d
Commit message: "[HTTPCORE-497] Add API Add API org.apache.http.nio.protocol.UriHttpAsyncRequestHandlerMapper.getUriPatternMatcher()."
 > git rev-list 276949dd1fbd03cd3b894962ba16bb1e76489ca9 # timeout=10
Parsing POMs
Established TCP socket on 59041
maven33-agent.jar already up to date
maven33-interceptor.jar already up to date
maven3-interceptor-commons.jar already up to date
[httpcomponents-core-4.4.x] $ /home/jenkins/tools/java/latest1.7/bin/java -Xmx2g -Xms256m
-cp /home/jenkins/jenkins-slave/maven33-agent.jar:/home/jenkins/tools/maven/apache-maven-3.3.9/boot/plexus-classworlds-2.5.2.jar:/home/jenkins/tools/maven/apache-maven-3.3.9/conf/logging
jenkins.maven3.agent.Maven33Main /home/jenkins/tools/maven/apache-maven-3.3.9 /home/jenkins/jenkins-slave/slave.jar
/home/jenkins/jenkins-slave/maven33-interceptor.jar /home/jenkins/jenkins-slave/maven3-interceptor-commons.jar
59041
<===[JENKINS REMOTING CAPACITY]===>   channel started
ERROR: ================================================================================
ERROR: Invalid project setup: jenkins/security/MasterToSlaveCallable : Unsupported major.minor
version 52.0
ERROR: [JENKINS-18403][JENKINS-28294] JDK 'JDK 1.7 (latest)' not supported to run Maven projects.
ERROR: Maven projects have to be launched with a Java version greater or equal to the minimum
version required by the master.
ERROR: Use the Maven JDK Toolchains (plugin) to build your maven project with an older JDK.
ERROR: Retrying with slave Java and setting compile/test properties to point to /home/jenkins/tools/java/latest1.7.
ERROR: ================================================================================
Established TCP socket on 52984
maven33-agent.jar already up to date
maven33-interceptor.jar already up to date
maven3-interceptor-commons.jar already up to date
[httpcomponents-core-4.4.x] $ /usr/local/asfpackages/java/jdk1.8.0_131/jre/bin/java -Xmx2g
-Xms256m -cp /home/jenkins/jenkins-slave/maven33-agent.jar:/home/jenkins/tools/maven/apache-maven-3.3.9/boot/plexus-classworlds-2.5.2.jar:/home/jenkins/tools/maven/apache-maven-3.3.9/conf/logging
jenkins.maven3.agent.Maven33Main /home/jenkins/tools/maven/apache-maven-3.3.9 /home/jenkins/jenkins-slave/slave.jar
/home/jenkins/jenkins-slave/maven33-interceptor.jar /home/jenkins/jenkins-slave/maven3-interceptor-commons.jar
52984
<===[JENKINS REMOTING CAPACITY]===>   channel started
Executing Maven:  -B -f <https://builds.apache.org/job/httpcomponents-core-4.4.x/ws/pom.xml>
-Dmaven.repo.local=/home/jenkins/jenkins-slave/maven-repositories/0 clean install clirr:check
-DdisableOSGiTests=true
[INFO] Scanning for projects...
[WARNING] 
[WARNING] Some problems were encountered while building the effective model for org.apache.httpcomponents:httpcore:jar:4.4.9-SNAPSHOT
[WARNING] 'build.pluginManagement.plugins.plugin.(groupId:artifactId)' must be unique but
found duplicate declaration of plugin org.apache.maven.plugins:maven-project-info-reports-plugin
@ org.apache.httpcomponents:httpcomponents-parent:9, /home/jenkins/jenkins-slave/maven-repositories/0/org/apache/httpcomponents/httpcomponents-parent/9/httpcomponents-parent-9.pom,
line 692, column 17
[WARNING] 
[WARNING] Some problems were encountered while building the effective model for org.apache.httpcomponents:httpcore-nio:jar:4.4.9-SNAPSHOT
[WARNING] 'build.pluginManagement.plugins.plugin.(groupId:artifactId)' must be unique but
found duplicate declaration of plugin org.apache.maven.plugins:maven-project-info-reports-plugin
@ org.apache.httpcomponents:httpcomponents-parent:9, /home/jenkins/jenkins-slave/maven-repositories/0/org/apache/httpcomponents/httpcomponents-parent/9/httpcomponents-parent-9.pom,
line 692, column 17
[WARNING] 
[WARNING] Some problems were encountered while building the effective model for org.apache.httpcomponents:httpcore-osgi:bundle:4.4.9-SNAPSHOT
[WARNING] 'build.pluginManagement.plugins.plugin.(groupId:artifactId)' must be unique but
found duplicate declaration of plugin org.apache.maven.plugins:maven-project-info-reports-plugin
@ org.apache.httpcomponents:httpcomponents-parent:9, /home/jenkins/jenkins-slave/maven-repositories/0/org/apache/httpcomponents/httpcomponents-parent/9/httpcomponents-parent-9.pom,
line 692, column 17
[WARNING] 
[WARNING] Some problems were encountered while building the effective model for org.apache.httpcomponents:httpcore-ab:jar:4.4.9-SNAPSHOT
[WARNING] 'build.pluginManagement.plugins.plugin.(groupId:artifactId)' must be unique but
found duplicate declaration of plugin org.apache.maven.plugins:maven-project-info-reports-plugin
@ org.apache.httpcomponents:httpcomponents-parent:9, /home/jenkins/jenkins-slave/maven-repositories/0/org/apache/httpcomponents/httpcomponents-parent/9/httpcomponents-parent-9.pom,
line 692, column 17
[WARNING] 
[WARNING] Some problems were encountered while building the effective model for org.apache.httpcomponents:httpcomponents-core:pom:4.4.9-SNAPSHOT
[WARNING] 'build.pluginManagement.plugins.plugin.(groupId:artifactId)' must be unique but
found duplicate declaration of plugin org.apache.maven.plugins:maven-project-info-reports-plugin
@ org.apache.httpcomponents:httpcomponents-parent:9, /home/jenkins/jenkins-slave/maven-repositories/0/org/apache/httpcomponents/httpcomponents-parent/9/httpcomponents-parent-9.pom,
line 692, column 17
[WARNING] 
[WARNING] It is highly recommended to fix these problems because they threaten the stability
of your build.
[WARNING] 
[WARNING] For this reason, future Maven versions might no longer support building such malformed
projects.
[WARNING] 
[INFO] ------------------------------------------------------------------------
[INFO] Reactor Build Order:
[INFO] 
[INFO] Apache HttpComponents Core
[INFO] Apache HttpCore
[INFO] Apache HttpCore NIO
[INFO] Apache HttpCore OSGi bundle
[INFO] Apache HttpCore Benchmarking Tool
[INFO]                                                                         
[INFO] ------------------------------------------------------------------------
[INFO] Building Apache HttpComponents Core 4.4.9-SNAPSHOT
[INFO] ------------------------------------------------------------------------
[INFO] 
[INFO] --- maven-clean-plugin:3.0.0:clean (default-clean) @ httpcomponents-core ---
[INFO] Deleting <https://builds.apache.org/job/httpcomponents-core-4.4.x/ws/target>
[INFO] 
[INFO] --- maven-checkstyle-plugin:2.9.1:checkstyle (validate) @ httpcomponents-core ---
[INFO] 
[INFO] --- maven-checkstyle-plugin:2.9.1:checkstyle (validate-main) @ httpcomponents-core
---
[INFO] 
[INFO] --- maven-checkstyle-plugin:2.9.1:checkstyle (validate-test) @ httpcomponents-core
---
[INFO] 
[INFO] --- maven-checkstyle-plugin:2.9.1:checkstyle (validate-examples) @ httpcomponents-core
---
[INFO] 
[INFO] --- build-helper-maven-plugin:3.0.0:parse-version (parse-version) @ httpcomponents-core
---
[INFO] 
[INFO] --- maven-toolchains-plugin:1.1:toolchain (default) @ httpcomponents-core ---
[INFO] Required toolchain: jdk [ version='1.6' ]
[INFO] Found matching toolchain for type jdk: JDK[/home/jenkins/tools/java/latest1.6/]
[INFO] 
[INFO] --- maven-remote-resources-plugin:1.5:process (process-resource-bundles) @ httpcomponents-core
---
[INFO] 
[INFO] --- animal-sniffer-maven-plugin:1.16:check (checkAPIcompatibility) @ httpcomponents-core
---
[INFO] Checking unresolved references to org.codehaus.mojo.signature:java16:1.0
[INFO] 
[INFO] >>> maven-source-plugin:3.0.1:jar (attach-sources) > generate-sources @
httpcomponents-core >>>
[INFO] 
[INFO] --- maven-checkstyle-plugin:2.9.1:checkstyle (validate) @ httpcomponents-core ---
[INFO] 
[INFO] --- maven-checkstyle-plugin:2.9.1:checkstyle (validate-main) @ httpcomponents-core
---
[INFO] 
[INFO] --- maven-checkstyle-plugin:2.9.1:checkstyle (validate-test) @ httpcomponents-core
---
[INFO] 
[INFO] --- maven-checkstyle-plugin:2.9.1:checkstyle (validate-examples) @ httpcomponents-core
---
[INFO] 
[INFO] --- build-helper-maven-plugin:3.0.0:parse-version (parse-version) @ httpcomponents-core
---
[INFO] 
[INFO] --- maven-toolchains-plugin:1.1:toolchain (default) @ httpcomponents-core ---
[INFO] Required toolchain: jdk [ version='1.6' ]
[INFO] Found matching toolchain for type jdk: JDK[/home/jenkins/tools/java/latest1.6/]
[WARNING] Failed to getClass for org.apache.maven.plugins.source.SourceJarMojo
[INFO] 
[INFO] <<< maven-source-plugin:3.0.1:jar (attach-sources) < generate-sources @
httpcomponents-core <<<
[INFO] 
[INFO] --- maven-source-plugin:3.0.1:jar (attach-sources) @ httpcomponents-core ---
[INFO] 
[INFO] --- maven-javadoc-plugin:3.0.0-M1:jar (attach-javadocs) @ httpcomponents-core ---
[INFO] Not executing Javadoc as the project is not a Java classpath-capable package
[INFO] 
[INFO] --- maven-site-plugin:3.6:attach-descriptor (attach-descriptor) @ httpcomponents-core
---
[INFO] No site descriptor found: nothing to attach.
[INFO] 
[INFO] --- apache-rat-plugin:0.12:check (default) @ httpcomponents-core ---
[INFO] Enabled default license matchers.
[INFO] Will parse SCM ignores for exclusions...
[INFO] Parsing exclusions from <https://builds.apache.org/job/httpcomponents-core-4.4.x/ws/.gitignore>
[INFO] Finished adding exclusions from SCM ignore files.
[INFO] 71 implicit excludes (use -debug for more details).
[INFO] Exclude: DEPENDENCIES
[INFO] Exclude: .pmd
[INFO] Exclude: **/.externalToolBuilders/**
[INFO] Exclude: **/.pmd
[INFO] Exclude: **/maven-eclipse.xml
[INFO] Exclude: **/.checkstyle
[INFO] Exclude: src/docbkx/resources/**
[INFO] Exclude: src/test/resources/*.truststore
[INFO] 14 resources included (use -debug for more details)
[INFO] Rat check: Summary over all files. Unapproved: 0, unknown: 0, generated: 0, approved:
9 licenses.
[INFO] 
[INFO] --- maven-install-plugin:2.5.2:install (default-install) @ httpcomponents-core ---
[INFO] Installing <https://builds.apache.org/job/httpcomponents-core-4.4.x/ws/pom.xml>
to /home/jenkins/jenkins-slave/maven-repositories/0/org/apache/httpcomponents/httpcomponents-core/4.4.9-SNAPSHOT/httpcomponents-core-4.4.9-SNAPSHOT.pom
[INFO] 
[INFO] >>> clirr-maven-plugin:2.8:check (default-cli) > compile @ httpcomponents-core
>>>
[INFO] 
[INFO] --- maven-checkstyle-plugin:2.9.1:checkstyle (validate) @ httpcomponents-core ---
[INFO] 
[INFO] --- maven-checkstyle-plugin:2.9.1:checkstyle (validate-main) @ httpcomponents-core
---
[INFO] 
[INFO] --- maven-checkstyle-plugin:2.9.1:checkstyle (validate-test) @ httpcomponents-core
---
[INFO] 
[INFO] --- maven-checkstyle-plugin:2.9.1:checkstyle (validate-examples) @ httpcomponents-core
---
[INFO] 
[INFO] --- build-helper-maven-plugin:3.0.0:parse-version (parse-version) @ httpcomponents-core
---
[INFO] 
[INFO] --- maven-toolchains-plugin:1.1:toolchain (default) @ httpcomponents-core ---
[INFO] Required toolchain: jdk [ version='1.6' ]
[INFO] Found matching toolchain for type jdk: JDK[/home/jenkins/tools/java/latest1.6/]
[INFO] 
[INFO] --- maven-remote-resources-plugin:1.5:process (process-resource-bundles) @ httpcomponents-core
---
[WARNING] Failed to getClass for org.codehaus.mojo.clirr.ClirrCheckMojo
[INFO] 
[INFO] <<< clirr-maven-plugin:2.8:check (default-cli) < compile @ httpcomponents-core
<<<
[INFO] 
[INFO] --- clirr-maven-plugin:2.8:check (default-cli) @ httpcomponents-core ---
[INFO] Not generating Clirr report as there are no classes generated by the project
[INFO]                                                                         
[INFO] ------------------------------------------------------------------------
[INFO] Building Apache HttpCore 4.4.9-SNAPSHOT
[INFO] ------------------------------------------------------------------------
[INFO] 
[INFO] --- maven-clean-plugin:3.0.0:clean (default-clean) @ httpcore ---
[INFO] Deleting <https://builds.apache.org/job/httpcomponents-core-4.4.x/ws/httpcore/target>
[INFO] 
[INFO] --- maven-checkstyle-plugin:2.9.1:checkstyle (validate) @ httpcore ---
[INFO] Starting audit...
<https://builds.apache.org/job/httpcomponents-core-4.4.x/ws/httpcore/src/main/java/org/apache/http/protocol/UriPatternMatcher.java>:51:
Trailing whitespace
<https://builds.apache.org/job/httpcomponents-core-4.4.x/ws/httpcore/src/main/java/org/apache/http/protocol/UriPatternMatcher.java>:67:
Trailing whitespace
<https://builds.apache.org/job/httpcomponents-core-4.4.x/ws/httpcore/src/main/java/org/apache/http/protocol/UriPatternMatcher.java>:76:
Trailing whitespace
Audit done.

[INFO] ------------------------------------------------------------------------
[INFO] Reactor Summary:
[INFO] 
[INFO] Apache HttpComponents Core ......................... SUCCESS [ 14.523 s]
[INFO] Apache HttpCore .................................... FAILURE [  2.629 s]
[INFO] Apache HttpCore NIO ................................ SKIPPED
[INFO] Apache HttpCore OSGi bundle ........................ SKIPPED
[INFO] Apache HttpCore Benchmarking Tool .................. SKIPPED
[INFO] ------------------------------------------------------------------------
[INFO] BUILD FAILURE
[INFO] ------------------------------------------------------------------------
[INFO] Total time: 27.347 s
[INFO] Finished at: 2017-12-05T22:31:04+00:00
[INFO] Final Memory: 43M/482M
[INFO] ------------------------------------------------------------------------
[ERROR] Failed to execute goal org.apache.maven.plugins:maven-checkstyle-plugin:2.9.1:checkstyle
(validate) on project httpcore: An error has occurred in Checkstyle report generation. Failed
during checkstyle execution: There are 3 checkstyle errors. -> [Help 1]
[ERROR] 
[ERROR] To see the full stack trace of the errors, re-run Maven with the -e switch.
[ERROR] Re-run Maven using the -X switch to enable full debug logging.
[ERROR] 
[ERROR] For more information about the errors and possible solutions, please read the following
articles:
[ERROR] [Help 1] http://cwiki.apache.org/confluence/display/MAVEN/MojoExecutionException
[ERROR] 
[ERROR] After correcting the problems, you can resume the build with the command
[ERROR]   mvn <goals> -rf :httpcore
[JENKINS] Archiving <https://builds.apache.org/job/httpcomponents-core-4.4.x/ws/httpcore/pom.xml>
to org.apache.httpcomponents/httpcore/4.4.9-SNAPSHOT/httpcore-4.4.9-SNAPSHOT.pom
[JENKINS] Archiving <https://builds.apache.org/job/httpcomponents-core-4.4.x/ws/httpcore-osgi/pom.xml>
to org.apache.httpcomponents/httpcore-osgi/4.4.9-SNAPSHOT/httpcore-osgi-4.4.9-SNAPSHOT.pom
[JENKINS] Archiving <https://builds.apache.org/job/httpcomponents-core-4.4.x/ws/httpcore-ab/pom.xml>
to org.apache.httpcomponents/httpcore-ab/4.4.9-SNAPSHOT/httpcore-ab-4.4.9-SNAPSHOT.pom
[JENKINS] Archiving <https://builds.apache.org/job/httpcomponents-core-4.4.x/ws/pom.xml>
to org.apache.httpcomponents/httpcomponents-core/4.4.9-SNAPSHOT/httpcomponents-core-4.4.9-SNAPSHOT.pom
[JENKINS] Archiving <https://builds.apache.org/job/httpcomponents-core-4.4.x/ws/httpcore-nio/pom.xml>
to org.apache.httpcomponents/httpcore-nio/4.4.9-SNAPSHOT/httpcore-nio-4.4.9-SNAPSHOT.pom
channel stopped

Mime
View raw message