hc-commits mailing list archives

Site index · List index
Message view « Date » · « Thread »
Top « Date » · « Thread »
From Apache Jenkins Server <jenk...@builds.apache.org>
Subject Build failed in Jenkins: httpcomponents-core-5.x #241
Date Fri, 20 Oct 2017 14:45:48 GMT
See <https://builds.apache.org/job/httpcomponents-core-5.x/241/display/redirect?page=changes>

Changes:

[olegk] Silence doclint warning about missing @param and @throws

[olegk] HTTPCORE-495: add context details to ParseException

[olegk] Upgraded httpcomponents-parent to version 9

------------------------------------------
[...truncated 44.33 KB...]
[INFO] Tests run: 11, Failures: 0, Errors: 0, Skipped: 0, Time elapsed: 0.007 s - in org.apache.hc.core5.http.message.TestHeaderGroup
[INFO] Running org.apache.hc.core5.http.message.TestHeaderElement
[INFO] Tests run: 5, Failures: 0, Errors: 0, Skipped: 0, Time elapsed: 0 s - in org.apache.hc.core5.http.message.TestHeaderElement
[INFO] Running org.apache.hc.core5.http.message.TestBasicHeaderIterator
[INFO] Tests run: 5, Failures: 0, Errors: 0, Skipped: 0, Time elapsed: 0.002 s - in org.apache.hc.core5.http.message.TestBasicHeaderIterator
[INFO] Running org.apache.hc.core5.http.message.TestBasicTokenIterator
[INFO] Tests run: 6, Failures: 0, Errors: 0, Skipped: 0, Time elapsed: 0.002 s - in org.apache.hc.core5.http.message.TestBasicTokenIterator
[INFO] Running org.apache.hc.core5.http.message.TestTokenParser
[INFO] Tests run: 10, Failures: 0, Errors: 0, Skipped: 0, Time elapsed: 0.002 s - in org.apache.hc.core5.http.message.TestTokenParser
[INFO] Running org.apache.hc.core5.http.protocol.TestUriRegexMatcher
[INFO] Tests run: 9, Failures: 0, Errors: 0, Skipped: 0, Time elapsed: 0.005 s - in org.apache.hc.core5.http.protocol.TestUriRegexMatcher
[INFO] Running org.apache.hc.core5.http.protocol.TestStandardInterceptors
[INFO] Tests run: 78, Failures: 0, Errors: 0, Skipped: 0, Time elapsed: 0.071 s - in org.apache.hc.core5.http.protocol.TestStandardInterceptors
[INFO] Running org.apache.hc.core5.http.protocol.TestChainBuilder
[INFO] Tests run: 1, Failures: 0, Errors: 0, Skipped: 0, Time elapsed: 0 s - in org.apache.hc.core5.http.protocol.TestChainBuilder
[INFO] Running org.apache.hc.core5.http.protocol.TestUriPatternMatcher
[INFO] Tests run: 7, Failures: 0, Errors: 0, Skipped: 0, Time elapsed: 0.001 s - in org.apache.hc.core5.http.protocol.TestUriPatternMatcher
[INFO] Running org.apache.hc.core5.http.protocol.TestHttpExecutionContext
[INFO] Tests run: 3, Failures: 0, Errors: 0, Skipped: 0, Time elapsed: 0 s - in org.apache.hc.core5.http.protocol.TestHttpExecutionContext
[INFO] Running org.apache.hc.core5.http.protocol.TestRequestHandlerRegistry
[INFO] Tests run: 5, Failures: 0, Errors: 0, Skipped: 0, Time elapsed: 0.004 s - in org.apache.hc.core5.http.protocol.TestRequestHandlerRegistry
[INFO] Running org.apache.hc.core5.http.impl.io.TestRequestParser
[INFO] Tests run: 5, Failures: 0, Errors: 0, Skipped: 0, Time elapsed: 0.007 s - in org.apache.hc.core5.http.impl.io.TestRequestParser
[INFO] Running org.apache.hc.core5.http.impl.io.TestHttpService
[INFO] Tests run: 10, Failures: 0, Errors: 0, Skipped: 0, Time elapsed: 0.682 s - in org.apache.hc.core5.http.impl.io.TestHttpService
[INFO] Running org.apache.hc.core5.http.impl.io.TestDefaultBHttpServerConnection
[INFO] Tests run: 12, Failures: 0, Errors: 0, Skipped: 0, Time elapsed: 0.248 s - in org.apache.hc.core5.http.impl.io.TestDefaultBHttpServerConnection
[INFO] Running org.apache.hc.core5.http.impl.io.TestIdentityOutputStream
[INFO] Tests run: 4, Failures: 0, Errors: 0, Skipped: 0, Time elapsed: 0.001 s - in org.apache.hc.core5.http.impl.io.TestIdentityOutputStream
[INFO] Running org.apache.hc.core5.http.impl.io.TestBHttpConnectionBase
[INFO] Tests run: 19, Failures: 0, Errors: 0, Skipped: 0, Time elapsed: 0.107 s - in org.apache.hc.core5.http.impl.io.TestBHttpConnectionBase
[INFO] Running org.apache.hc.core5.http.impl.io.TestHttpRequestExecutor
[INFO] Tests run: 12, Failures: 0, Errors: 0, Skipped: 0, Time elapsed: 0.121 s - in org.apache.hc.core5.http.impl.io.TestHttpRequestExecutor
[INFO] Running org.apache.hc.core5.http.impl.io.TestIdentityInputStream
[INFO] Tests run: 4, Failures: 0, Errors: 0, Skipped: 0, Time elapsed: 0 s - in org.apache.hc.core5.http.impl.io.TestIdentityInputStream
[INFO] Running org.apache.hc.core5.http.impl.io.TestSessionInOutBuffers
[INFO] Tests run: 21, Failures: 0, Errors: 0, Skipped: 0, Time elapsed: 0.124 s - in org.apache.hc.core5.http.impl.io.TestSessionInOutBuffers
[INFO] Running org.apache.hc.core5.http.impl.io.TestMessageParser
[INFO] Tests run: 7, Failures: 0, Errors: 0, Skipped: 0, Time elapsed: 0.001 s - in org.apache.hc.core5.http.impl.io.TestMessageParser
[INFO] Running org.apache.hc.core5.http.impl.io.TestDefaultBHttpClientConnection
[INFO] Tests run: 14, Failures: 0, Errors: 0, Skipped: 0, Time elapsed: 0.013 s - in org.apache.hc.core5.http.impl.io.TestDefaultBHttpClientConnection
[INFO] Running org.apache.hc.core5.http.impl.io.TestResponseParser
[INFO] Tests run: 5, Failures: 0, Errors: 0, Skipped: 0, Time elapsed: 0 s - in org.apache.hc.core5.http.impl.io.TestResponseParser
[INFO] Running org.apache.hc.core5.http.impl.io.TestContentLengthOutputStream
[INFO] Tests run: 2, Failures: 0, Errors: 0, Skipped: 0, Time elapsed: 0 s - in org.apache.hc.core5.http.impl.io.TestContentLengthOutputStream
[INFO] Running org.apache.hc.core5.http.impl.io.TestChunkCoding
[INFO] Tests run: 25, Failures: 0, Errors: 0, Skipped: 0, Time elapsed: 0.007 s - in org.apache.hc.core5.http.impl.io.TestChunkCoding
[INFO] Running org.apache.hc.core5.http.impl.io.TestContentLengthInputStream
[INFO] Tests run: 5, Failures: 0, Errors: 0, Skipped: 0, Time elapsed: 0 s - in org.apache.hc.core5.http.impl.io.TestContentLengthInputStream
[INFO] Running org.apache.hc.core5.http.impl.nio.ExceptionEventTest
[INFO] Tests run: 3, Failures: 0, Errors: 0, Skipped: 0, Time elapsed: 0 s - in org.apache.hc.core5.http.impl.nio.ExceptionEventTest
[INFO] Running org.apache.hc.core5.http.impl.nio.TestChunkDecoder
[INFO] Tests run: 21, Failures: 0, Errors: 0, Skipped: 0, Time elapsed: 0.011 s - in org.apache.hc.core5.http.impl.nio.TestChunkDecoder
[INFO] Running org.apache.hc.core5.http.impl.nio.TestSessionInOutBuffers
[INFO] Tests run: 21, Failures: 0, Errors: 0, Skipped: 0, Time elapsed: 0.007 s - in org.apache.hc.core5.http.impl.nio.TestSessionInOutBuffers
[INFO] Running org.apache.hc.core5.http.impl.nio.TestLengthDelimitedEncoder
[INFO] Tests run: 23, Failures: 0, Errors: 0, Skipped: 0, Time elapsed: 0.15 s - in org.apache.hc.core5.http.impl.nio.TestLengthDelimitedEncoder
[INFO] Running org.apache.hc.core5.http.impl.nio.TestChunkEncoder
[INFO] Tests run: 9, Failures: 0, Errors: 0, Skipped: 0, Time elapsed: 0.002 s - in org.apache.hc.core5.http.impl.nio.TestChunkEncoder
[INFO] Running org.apache.hc.core5.http.impl.nio.TestLengthDelimitedDecoder
[INFO] Tests run: 15, Failures: 0, Errors: 0, Skipped: 0, Time elapsed: 0.007 s - in org.apache.hc.core5.http.impl.nio.TestLengthDelimitedDecoder
[INFO] Running org.apache.hc.core5.http.impl.nio.TestIdentityDecoder
[INFO] Tests run: 8, Failures: 0, Errors: 0, Skipped: 0, Time elapsed: 0.002 s - in org.apache.hc.core5.http.impl.nio.TestIdentityDecoder
[INFO] Running org.apache.hc.core5.http.impl.nio.TestIdentityEncoder
[INFO] Tests run: 20, Failures: 0, Errors: 0, Skipped: 0, Time elapsed: 0.034 s - in org.apache.hc.core5.http.impl.nio.TestIdentityEncoder
[INFO] Running org.apache.hc.core5.http.impl.TestEnglishReasonPhraseCatalog
[INFO] Tests run: 3, Failures: 0, Errors: 0, Skipped: 0, Time elapsed: 0.001 s - in org.apache.hc.core5.http.impl.TestEnglishReasonPhraseCatalog
[INFO] Running org.apache.hc.core5.http.impl.TestDefaultContentLengthStrategy
[INFO] Tests run: 7, Failures: 0, Errors: 0, Skipped: 0, Time elapsed: 0.001 s - in org.apache.hc.core5.http.impl.TestDefaultContentLengthStrategy
[INFO] Running org.apache.hc.core5.http.impl.TestDefaultConnectionReuseStrategy
[INFO] Tests run: 25, Failures: 0, Errors: 0, Skipped: 0, Time elapsed: 0.007 s - in org.apache.hc.core5.http.impl.TestDefaultConnectionReuseStrategy
[INFO] Running org.apache.hc.core5.http.TestContentType
[INFO] Tests run: 10, Failures: 0, Errors: 0, Skipped: 0, Time elapsed: 0.002 s - in org.apache.hc.core5.http.TestContentType
[INFO] Running org.apache.hc.core5.net.TestURIAuthority
[INFO] Tests run: 7, Failures: 0, Errors: 0, Skipped: 0, Time elapsed: 0.002 s - in org.apache.hc.core5.net.TestURIAuthority
[INFO] Running org.apache.hc.core5.net.TestURLEncodedUtils
[INFO] Tests run: 8, Failures: 0, Errors: 0, Skipped: 0, Time elapsed: 0 s - in org.apache.hc.core5.net.TestURLEncodedUtils
[INFO] Running org.apache.hc.core5.net.TestURIBuilder
[INFO] Tests run: 28, Failures: 0, Errors: 0, Skipped: 0, Time elapsed: 0.003 s - in org.apache.hc.core5.net.TestURIBuilder
[INFO] Running org.apache.hc.core5.net.TestInetAddressUtils
[INFO] Tests run: 7, Failures: 0, Errors: 0, Skipped: 0, Time elapsed: 0.003 s - in org.apache.hc.core5.net.TestInetAddressUtils
[INFO] Running org.apache.hc.core5.util.TestTimeValue
[INFO] Tests run: 14, Failures: 0, Errors: 0, Skipped: 0, Time elapsed: 0.005 s - in org.apache.hc.core5.util.TestTimeValue
[INFO] Running org.apache.hc.core5.util.TestTimeout
[INFO] Tests run: 15, Failures: 0, Errors: 0, Skipped: 0, Time elapsed: 0.005 s - in org.apache.hc.core5.util.TestTimeout
[INFO] Running org.apache.hc.core5.util.TestArgs
[INFO] Tests run: 33, Failures: 0, Errors: 0, Skipped: 0, Time elapsed: 0.01 s - in org.apache.hc.core5.util.TestArgs
[INFO] Running org.apache.hc.core5.util.TestLangUtils
[INFO] Tests run: 5, Failures: 0, Errors: 0, Skipped: 0, Time elapsed: 0 s - in org.apache.hc.core5.util.TestLangUtils
[INFO] Running org.apache.hc.core5.util.TestCharArrayBuffer
[INFO] Tests run: 22, Failures: 0, Errors: 0, Skipped: 0, Time elapsed: 0.005 s - in org.apache.hc.core5.util.TestCharArrayBuffer
[INFO] Running org.apache.hc.core5.util.TestByteArrayBuffer
[INFO] Tests run: 15, Failures: 0, Errors: 0, Skipped: 0, Time elapsed: 0.004 s - in org.apache.hc.core5.util.TestByteArrayBuffer
[INFO] Running org.apache.hc.core5.util.TestAsserts
[INFO] Tests run: 8, Failures: 0, Errors: 0, Skipped: 0, Time elapsed: 0.001 s - in org.apache.hc.core5.util.TestAsserts
[INFO] Running org.apache.hc.core5.util.TestTextUtils
[INFO] Tests run: 4, Failures: 0, Errors: 0, Skipped: 0, Time elapsed: 0 s - in org.apache.hc.core5.util.TestTextUtils
[INFO] 
[INFO] Results:
[INFO] 
[INFO] Tests run: 867, Failures: 0, Errors: 0, Skipped: 0
[INFO] 
[JENKINS] Recording test results
[INFO] 
[INFO] --- maven-jar-plugin:3.0.2:jar (default-jar) @ httpcore5 ---
[INFO] Building jar: <https://builds.apache.org/job/httpcomponents-core-5.x/ws/httpcore5/target/httpcore5-5.0-alpha5-SNAPSHOT.jar>
[INFO] 
[INFO] >>> maven-source-plugin:3.0.1:jar (attach-sources) > generate-sources @
httpcore5 >>>
[INFO] 
[INFO] --- maven-checkstyle-plugin:2.9.1:checkstyle (validate) @ httpcore5 ---
[INFO] Starting audit...
Audit done.

[INFO] 
[INFO] --- maven-checkstyle-plugin:2.9.1:checkstyle (validate-main) @ httpcore5 ---
[INFO] Starting audit...
Audit done.

[INFO] 
[INFO] --- maven-checkstyle-plugin:2.9.1:checkstyle (validate-test) @ httpcore5 ---
[INFO] Starting audit...
Audit done.

[INFO] 
[INFO] --- maven-checkstyle-plugin:2.9.1:checkstyle (validate-examples) @ httpcore5 ---
[INFO] Starting audit...
Audit done.

[INFO] 
[INFO] --- build-helper-maven-plugin:3.0.0:parse-version (parse-version) @ httpcore5 ---
[INFO] 
[INFO] --- maven-toolchains-plugin:1.1:toolchain (default) @ httpcore5 ---
[INFO] Required toolchain: jdk [ version='1.7' ]
[INFO] Found matching toolchain for type jdk: JDK[/home/jenkins/tools/java/latest1.7/]
[WARNING] Failed to getClass for org.apache.maven.plugins.source.SourceJarMojo
[INFO] 
[INFO] <<< maven-source-plugin:3.0.1:jar (attach-sources) < generate-sources @
httpcore5 <<<
[INFO] 
[INFO] --- maven-source-plugin:3.0.1:jar (attach-sources) @ httpcore5 ---
[INFO] Building jar: <https://builds.apache.org/job/httpcomponents-core-5.x/ws/httpcore5/target/httpcore5-5.0-alpha5-SNAPSHOT-sources.jar>
[INFO] 
[INFO] --- maven-javadoc-plugin:3.0.0-M1:jar (attach-javadocs) @ httpcore5 ---
[INFO] Toolchain in maven-javadoc-plugin: JDK[/home/jenkins/tools/java/latest1.7/]
[INFO] 
usage: javadoc [options] [packagenames] [sourcefiles] [@files]
-overview <file>          Read overview documentation from HTML file
-public                   Show only public classes and members
-protected                Show protected/public classes and members (default)
-package                  Show package/protected/public classes and members
-private                  Show all classes and members
-help                     Display command line options and exit
-doclet <class>           Generate output via alternate doclet
-docletpath <path>        Specify where to find doclet class files
-sourcepath <pathlist>    Specify where to find source files
-classpath <pathlist>     Specify where to find user class files
-exclude <pkglist>        Specify a list of packages to exclude
-subpackages <subpkglist> Specify subpackages to recursively load
-breakiterator            Compute 1st sentence with BreakIterator
-bootclasspath <pathlist> Override location of class files loaded
			  by the bootstrap class loader
-source <release>         Provide source compatibility with specified release
-extdirs <dirlist>        Override location of installed extensions
-verbose                  Output messages about what Javadoc is doing
-locale <name>            Locale to be used, e.g. en_US or en_US_WIN
-encoding <name>          Source file encoding name
-quiet                    Do not display status messages
-J<flag>                  Pass <flag> directly to the runtime system
-X                        Print a synopsis of nonstandard options

Provided by Standard doclet:
-d <directory>                    Destination directory for output files
-use                              Create class and package usage pages
-version                          Include @version paragraphs
-author                           Include @author paragraphs
-docfilessubdirs                  Recursively copy doc-file subdirectories
-splitindex                       Split index into one file per letter
-windowtitle <text>               Browser window title for the documenation
-doctitle <html-code>             Include title for the overview page
-header <html-code>               Include header text for each page
-footer <html-code>               Include footer text for each page
-top    <html-code>               Include top text for each page
-bottom <html-code>               Include bottom text for each page
-link <url>                       Create links to javadoc output at <url>
-linkoffline <url> <url2>         Link to docs at <url> using package list
at <url2>
-excludedocfilessubdir <name1>:.. Exclude any doc-files subdirectories with given name.
-group <name> <p1>:<p2>..         Group specified packages together in overview
page
-nocomment                        Supress description and tags, generate only declarations.
-nodeprecated                     Do not include @deprecated information
-noqualifier <name1>:<name2>:...  Exclude the list of qualifiers from the output.
-nosince                          Do not include @since information
-notimestamp                      Do not include hidden time stamp
-nodeprecatedlist                 Do not generate deprecated list
-notree                           Do not generate class hierarchy
-noindex                          Do not generate index
-nohelp                           Do not generate help link
-nonavbar                         Do not generate navigation bar
-serialwarn                       Generate warning about @serial tag
-tag <name>:<locations>:<header>  Specify single argument custom tags
-taglet                           The fully qualified name of Taglet to register
-tagletpath                       The path to Taglets
-Xdocrootparent <url>             Replaces all appearances of @docRoot followed by /..
in doc comments with <url>
-charset <charset>                Charset for cross-platform viewing of generated documentation.
-helpfile <file>                  Include file that help link links to
-linksource                       Generate source in HTML
-sourcetab <tab length>           Specify the number of spaces each tab takes up in
the source
-keywords                         Include HTML meta tags with package, class and member info
-stylesheetfile <path>            File to change style of the generated documentation
-docencoding <name>               Output encoding name
1 error
[INFO] ------------------------------------------------------------------------
[INFO] Reactor Summary:
[INFO] 
[INFO] Apache HttpComponents Core Parent .................. SUCCESS [ 28.408 s]
[INFO] Apache HttpComponents Core HTTP/1.1 ................ FAILURE [01:41 min]
[INFO] Apache HttpComponents Core HTTP/2 .................. SKIPPED
[INFO] Apache HttpComponents Core OSGi Bundle ............. SKIPPED
[INFO] Apache HttpComponents Core Integration Tests ....... SKIPPED
[INFO] ------------------------------------------------------------------------
[INFO] BUILD FAILURE
[INFO] ------------------------------------------------------------------------
[INFO] Total time: 02:59 min
[INFO] Finished at: 2017-10-20T14:44:55+00:00
[INFO] Final Memory: 46M/664M
[INFO] ------------------------------------------------------------------------
[ERROR] Failed to execute goal org.apache.maven.plugins:maven-javadoc-plugin:3.0.0-M1:jar
(attach-javadocs) on project httpcore5: MavenReportException: Error while generating Javadoc:
[ERROR] Exit code: 1 - javadoc: error - invalid flag: -Xdoclint:-missing
[ERROR] 
[ERROR] Command line was: /home/jenkins/tools/java/latest1.7/bin/javadoc @options @packages
[ERROR] 
[ERROR] Refer to the generated Javadoc files in '<https://builds.apache.org/job/httpcomponents-core-5.x/ws/httpcore5/target/apidocs'>
dir.
[ERROR] -> [Help 1]
[ERROR] 
[ERROR] To see the full stack trace of the errors, re-run Maven with the -e switch.
[ERROR] Re-run Maven using the -X switch to enable full debug logging.
[ERROR] 
[ERROR] For more information about the errors and possible solutions, please read the following
articles:
[ERROR] [Help 1] http://cwiki.apache.org/confluence/display/MAVEN/MojoExecutionException
[ERROR] 
[ERROR] After correcting the problems, you can resume the build with the command
[ERROR]   mvn <goals> -rf :httpcore5
[JENKINS] Archiving <https://builds.apache.org/job/httpcomponents-core-5.x/ws/httpcore5-h2/pom.xml>
to org.apache.httpcomponents.core5/httpcore5-h2/5.0-alpha5-SNAPSHOT/httpcore5-h2-5.0-alpha5-SNAPSHOT.pom
[JENKINS] Archiving <https://builds.apache.org/job/httpcomponents-core-5.x/ws/pom.xml>
to org.apache.httpcomponents.core5/httpcore5-parent/5.0-alpha5-SNAPSHOT/httpcore5-parent-5.0-alpha5-SNAPSHOT.pom
[JENKINS] Archiving <https://builds.apache.org/job/httpcomponents-core-5.x/ws/httpcore5/pom.xml>
to org.apache.httpcomponents.core5/httpcore5/5.0-alpha5-SNAPSHOT/httpcore5-5.0-alpha5-SNAPSHOT.pom
[JENKINS] Archiving <https://builds.apache.org/job/httpcomponents-core-5.x/ws/httpcore5/target/httpcore5-5.0-alpha5-SNAPSHOT.jar>
to org.apache.httpcomponents.core5/httpcore5/5.0-alpha5-SNAPSHOT/httpcore5-5.0-alpha5-SNAPSHOT.jar
[JENKINS] Archiving <https://builds.apache.org/job/httpcomponents-core-5.x/ws/httpcore5/target/httpcore5-5.0-alpha5-SNAPSHOT-sources.jar>
to org.apache.httpcomponents.core5/httpcore5/5.0-alpha5-SNAPSHOT/httpcore5-5.0-alpha5-SNAPSHOT-sources.jar
[JENKINS] Archiving <https://builds.apache.org/job/httpcomponents-core-5.x/ws/httpcore5-osgi/pom.xml>
to org.apache.httpcomponents.core5/httpcore5-osgi/5.0-alpha5-SNAPSHOT/httpcore5-osgi-5.0-alpha5-SNAPSHOT.pom
[JENKINS] Archiving <https://builds.apache.org/job/httpcomponents-core-5.x/ws/httpcore5-testing/pom.xml>
to org.apache.httpcomponents.core5/httpcore5-testing/5.0-alpha5-SNAPSHOT/httpcore5-testing-5.0-alpha5-SNAPSHOT.pom
Sending e-mails to: commits@hc.apache.org
channel stopped

Mime
View raw message