hc-commits mailing list archives

Site index · List index
Message view « Date » · « Thread »
Top « Date » · « Thread »
From Apache Jenkins Server <jenk...@builds.apache.org>
Subject Build failed in Jenkins: httpcomponents-client-4.6.x #29
Date Mon, 23 Oct 2017 09:19:54 GMT
See <https://builds.apache.org/job/httpcomponents-client-4.6.x/29/display/redirect?page=changes>

Changes:

[olegk] HTTPCLIENT-1873: Config option for Kerberos delegation

------------------------------------------
Started by an SCM change
[EnvInject] - Loading node environment variables.
Building remotely on beam8 (beam) in workspace <https://builds.apache.org/job/httpcomponents-client-4.6.x/ws/>
 > git rev-parse --is-inside-work-tree # timeout=10
Fetching changes from the remote Git repository
 > git config remote.origin.url https://git-wip-us.apache.org/repos/asf/httpcomponents-client.git
# timeout=10
Fetching upstream changes from https://git-wip-us.apache.org/repos/asf/httpcomponents-client.git
 > git --version # timeout=10
 > git fetch --tags --progress https://git-wip-us.apache.org/repos/asf/httpcomponents-client.git
+refs/heads/*:refs/remotes/origin/*
 > git rev-parse refs/remotes/origin/4.6.x^{commit} # timeout=10
 > git rev-parse refs/remotes/origin/origin/4.6.x^{commit} # timeout=10
Checking out Revision cc58de13c5361d5ff98a839adc7b46eceb2f2bef (refs/remotes/origin/4.6.x)
Commit message: "HTTPCLIENT-1873: Config option for Kerberos delegation"
 > git config core.sparsecheckout # timeout=10
 > git checkout -f cc58de13c5361d5ff98a839adc7b46eceb2f2bef
 > git rev-list ba47719c3adcc328fd800296ab5189d965ee216c # timeout=10
Parsing POMs
Established TCP socket on 41595
maven33-agent.jar already up to date
maven33-interceptor.jar already up to date
maven3-interceptor-commons.jar already up to date
[httpcomponents-client-4.6.x] $ /home/jenkins/tools/java/latest1.8/bin/java -Xmx2g -Xms256m
-cp /home/jenkins/jenkins-slave/maven33-agent.jar:/home/jenkins/tools/maven/apache-maven-3.3.9/boot/plexus-classworlds-2.5.2.jar:/home/jenkins/tools/maven/apache-maven-3.3.9/conf/logging
jenkins.maven3.agent.Maven33Main /home/jenkins/tools/maven/apache-maven-3.3.9 /home/jenkins/jenkins-slave/slave.jar
/home/jenkins/jenkins-slave/maven33-interceptor.jar /home/jenkins/jenkins-slave/maven3-interceptor-commons.jar
41595
<===[JENKINS REMOTING CAPACITY]===>   channel started
Executing Maven:  -B -f <https://builds.apache.org/job/httpcomponents-client-4.6.x/ws/pom.xml>
-Dmaven.repo.local=/home/jenkins/jenkins-slave/maven-repositories/0 clean install
[INFO] Scanning for projects...
[ERROR] [ERROR] Some problems were encountered while processing the POMs:
[WARNING] 'build.pluginManagement.plugins.plugin.(groupId:artifactId)' must be unique but
found duplicate declaration of plugin org.apache.maven.plugins:maven-project-info-reports-plugin
@ org.apache.httpcomponents:httpcomponents-parent:9, /home/jenkins/jenkins-slave/maven-repositories/0/org/apache/httpcomponents/httpcomponents-parent/9/httpcomponents-parent-9.pom,
line 692, column 17
[WARNING] 'build.pluginManagement.plugins.plugin.(groupId:artifactId)' must be unique but
found duplicate declaration of plugin org.apache.maven.plugins:maven-project-info-reports-plugin
@ org.apache.httpcomponents:httpcomponents-parent:9, /home/jenkins/jenkins-slave/maven-repositories/0/org/apache/httpcomponents/httpcomponents-parent/9/httpcomponents-parent-9.pom,
line 692, column 17
[WARNING] 'build.pluginManagement.plugins.plugin.(groupId:artifactId)' must be unique but
found duplicate declaration of plugin org.apache.maven.plugins:maven-project-info-reports-plugin
@ org.apache.httpcomponents:httpcomponents-parent:9, /home/jenkins/jenkins-slave/maven-repositories/0/org/apache/httpcomponents/httpcomponents-parent/9/httpcomponents-parent-9.pom,
line 692, column 17
[WARNING] 'build.pluginManagement.plugins.plugin.(groupId:artifactId)' must be unique but
found duplicate declaration of plugin org.apache.maven.plugins:maven-project-info-reports-plugin
@ org.apache.httpcomponents:httpcomponents-parent:9, /home/jenkins/jenkins-slave/maven-repositories/0/org/apache/httpcomponents/httpcomponents-parent/9/httpcomponents-parent-9.pom,
line 692, column 17
[WARNING] 'build.pluginManagement.plugins.plugin.(groupId:artifactId)' must be unique but
found duplicate declaration of plugin org.apache.maven.plugins:maven-project-info-reports-plugin
@ org.apache.httpcomponents:httpcomponents-parent:9, /home/jenkins/jenkins-slave/maven-repositories/0/org/apache/httpcomponents/httpcomponents-parent/9/httpcomponents-parent-9.pom,
line 692, column 17
[WARNING] 'build.pluginManagement.plugins.plugin.(groupId:artifactId)' must be unique but
found duplicate declaration of plugin org.apache.maven.plugins:maven-project-info-reports-plugin
@ org.apache.httpcomponents:httpcomponents-parent:9, /home/jenkins/jenkins-slave/maven-repositories/0/org/apache/httpcomponents/httpcomponents-parent/9/httpcomponents-parent-9.pom,
line 692, column 17
[ERROR] Unresolveable build extension: Plugin org.apache.felix:maven-bundle-plugin:3.3.0 or
one of its dependencies could not be resolved: Failure to find org.apache.felix:maven-bundle-plugin:jar:3.3.0
in https://repo.maven.apache.org/maven2 was cached in the local repository, resolution will
not be reattempted until the update interval of central has elapsed or updates are forced
@ 
[ERROR] Unknown packaging: bundle @ org.apache.httpcomponents:httpclient-osgi:[unknown-version],
<https://builds.apache.org/job/httpcomponents-client-4.6.x/ws/httpclient-osgi/pom.xml,>
line 40, column 14
[WARNING] 'build.pluginManagement.plugins.plugin.(groupId:artifactId)' must be unique but
found duplicate declaration of plugin org.apache.maven.plugins:maven-project-info-reports-plugin
@ org.apache.httpcomponents:httpcomponents-parent:9, /home/jenkins/jenkins-slave/maven-repositories/0/org/apache/httpcomponents/httpcomponents-parent/9/httpcomponents-parent-9.pom,
line 692, column 17
 @ 
[ERROR] The build could not read 1 project -> [Help 1]
[ERROR]   
[ERROR]   The project org.apache.httpcomponents:httpclient-osgi:4.6.0-alpha1-SNAPSHOT (<https://builds.apache.org/job/httpcomponents-client-4.6.x/ws/httpclient-osgi/pom.xml)>
has 2 errors
[ERROR]     Unresolveable build extension: Plugin org.apache.felix:maven-bundle-plugin:3.3.0
or one of its dependencies could not be resolved: Failure to find org.apache.felix:maven-bundle-plugin:jar:3.3.0
in https://repo.maven.apache.org/maven2 was cached in the local repository, resolution will
not be reattempted until the update interval of central has elapsed or updates are forced
-> [Help 2]
[ERROR]     Unknown packaging: bundle @ org.apache.httpcomponents:httpclient-osgi:[unknown-version],
<https://builds.apache.org/job/httpcomponents-client-4.6.x/ws/httpclient-osgi/pom.xml,>
line 40, column 14
[ERROR] 
[ERROR] To see the full stack trace of the errors, re-run Maven with the -e switch.
[ERROR] Re-run Maven using the -X switch to enable full debug logging.
[ERROR] 
[ERROR] For more information about the errors and possible solutions, please read the following
articles:
[ERROR] [Help 1] http://cwiki.apache.org/confluence/display/MAVEN/ProjectBuildingException
[ERROR] [Help 2] http://cwiki.apache.org/confluence/display/MAVEN/PluginManagerException
channel stopped

Mime
View raw message