hc-commits mailing list archives

Site index · List index
Message view « Date » · « Thread »
Top « Date » · « Thread »
From Apache Jenkins Server <jenk...@builds.apache.org>
Subject Build failed in Jenkins: httpcomponents-core-4.4.x #211
Date Thu, 28 Sep 2017 20:48:59 GMT
See <https://builds.apache.org/job/httpcomponents-core-4.4.x/211/display/redirect?page=changes>

Changes:

[ggregory] Javadoc: @since 4.4.8.

------------------------------------------
[...truncated 39.93 KB...]
[INFO] Running org.apache.http.entity.TestInputStreamEntity
[INFO] Tests run: 7, Failures: 0, Errors: 0, Skipped: 0, Time elapsed: 0.002 s - in org.apache.http.entity.TestInputStreamEntity
[INFO] Running org.apache.http.entity.TestEntityTemplate
[INFO] Tests run: 4, Failures: 0, Errors: 0, Skipped: 0, Time elapsed: 0.002 s - in org.apache.http.entity.TestEntityTemplate
[INFO] Running org.apache.http.entity.TestContentType
[INFO] Tests run: 18, Failures: 0, Errors: 0, Skipped: 0, Time elapsed: 0.008 s - in org.apache.http.entity.TestContentType
[INFO] Running org.apache.http.entity.TestStringEntity
[INFO] Tests run: 5, Failures: 0, Errors: 0, Skipped: 0, Time elapsed: 0.001 s - in org.apache.http.entity.TestStringEntity
[INFO] Running org.apache.http.entity.TestHttpEntityWrapper
[INFO] Tests run: 4, Failures: 0, Errors: 0, Skipped: 0, Time elapsed: 0.001 s - in org.apache.http.entity.TestHttpEntityWrapper
[INFO] Running org.apache.http.entity.TestBufferedHttpEntity
[INFO] Tests run: 5, Failures: 0, Errors: 0, Skipped: 0, Time elapsed: 0.001 s - in org.apache.http.entity.TestBufferedHttpEntity
[INFO] Running org.apache.http.entity.TestAbstractHttpEntity
[INFO] Tests run: 3, Failures: 0, Errors: 0, Skipped: 0, Time elapsed: 0.001 s - in org.apache.http.entity.TestAbstractHttpEntity
[INFO] Running org.apache.http.TestHttpExceptions
[INFO] Tests run: 1, Failures: 0, Errors: 0, Skipped: 0, Time elapsed: 0 s - in org.apache.http.TestHttpExceptions
[INFO] Running org.apache.http.config.TestRegistry
[INFO] Tests run: 1, Failures: 0, Errors: 0, Skipped: 0, Time elapsed: 0 s - in org.apache.http.config.TestRegistry
[INFO] Running org.apache.http.protocol.TestHttpRequestExecutor
[INFO] Tests run: 12, Failures: 0, Errors: 0, Skipped: 0, Time elapsed: 0.038 s - in org.apache.http.protocol.TestHttpRequestExecutor
[INFO] Running org.apache.http.protocol.TestHttpService
[INFO] Tests run: 14, Failures: 0, Errors: 0, Skipped: 0, Time elapsed: 0.061 s - in org.apache.http.protocol.TestHttpService
[INFO] Running org.apache.http.protocol.TestHttpExecutionContext
[INFO] Tests run: 3, Failures: 0, Errors: 0, Skipped: 0, Time elapsed: 0 s - in org.apache.http.protocol.TestHttpExecutionContext
[INFO] Running org.apache.http.protocol.TestStandardInterceptors
[INFO] Tests run: 70, Failures: 0, Errors: 0, Skipped: 0, Time elapsed: 0.041 s - in org.apache.http.protocol.TestStandardInterceptors
[INFO] Running org.apache.http.protocol.TestUriPatternMatcher
[INFO] Tests run: 7, Failures: 0, Errors: 0, Skipped: 0, Time elapsed: 0.001 s - in org.apache.http.protocol.TestUriPatternMatcher
[INFO] Running org.apache.http.protocol.TestChainBuilder
[INFO] Tests run: 1, Failures: 0, Errors: 0, Skipped: 0, Time elapsed: 0 s - in org.apache.http.protocol.TestChainBuilder
[INFO] Running org.apache.http.protocol.TestUriHttpRequestHandlerMapper
[INFO] Tests run: 5, Failures: 0, Errors: 0, Skipped: 0, Time elapsed: 0.017 s - in org.apache.http.protocol.TestUriHttpRequestHandlerMapper
[INFO] Running org.apache.http.message.TestBufferedHeader
[INFO] Tests run: 5, Failures: 0, Errors: 0, Skipped: 0, Time elapsed: 0.002 s - in org.apache.http.message.TestBufferedHeader
[INFO] Running org.apache.http.message.TestBasicLineParser
[INFO] Tests run: 7, Failures: 0, Errors: 0, Skipped: 0, Time elapsed: 0.003 s - in org.apache.http.message.TestBasicLineParser
[INFO] Running org.apache.http.message.TestBasicLineFormatter
[INFO] Tests run: 8, Failures: 0, Errors: 0, Skipped: 0, Time elapsed: 0.002 s - in org.apache.http.message.TestBasicLineFormatter
[INFO] Running org.apache.http.message.TestNameValuePair
[INFO] Tests run: 6, Failures: 0, Errors: 0, Skipped: 0, Time elapsed: 0.001 s - in org.apache.http.message.TestNameValuePair
[INFO] Running org.apache.http.message.TestBasicTokenIterator
[INFO] Tests run: 9, Failures: 0, Errors: 0, Skipped: 0, Time elapsed: 0.003 s - in org.apache.http.message.TestBasicTokenIterator
[INFO] Running org.apache.http.message.TestBasicHttpResponse
[INFO] Tests run: 3, Failures: 0, Errors: 0, Skipped: 0, Time elapsed: 0 s - in org.apache.http.message.TestBasicHttpResponse
[INFO] Running org.apache.http.message.TestStatusLine
[INFO] Tests run: 5, Failures: 0, Errors: 0, Skipped: 0, Time elapsed: 0.002 s - in org.apache.http.message.TestStatusLine
[INFO] Running org.apache.http.message.TestRequestLine
[INFO] Tests run: 4, Failures: 0, Errors: 0, Skipped: 0, Time elapsed: 0.002 s - in org.apache.http.message.TestRequestLine
[INFO] Running org.apache.http.message.TestHeader
[INFO] Tests run: 7, Failures: 0, Errors: 0, Skipped: 0, Time elapsed: 0.002 s - in org.apache.http.message.TestHeader
[INFO] Running org.apache.http.message.TestHeaderGroup
[INFO] Tests run: 11, Failures: 0, Errors: 0, Skipped: 0, Time elapsed: 0.005 s - in org.apache.http.message.TestHeaderGroup
[INFO] Running org.apache.http.message.TestBasicHeaderElementIterator
[INFO] Tests run: 3, Failures: 0, Errors: 0, Skipped: 0, Time elapsed: 0.001 s - in org.apache.http.message.TestBasicHeaderElementIterator
[INFO] Running org.apache.http.message.TestBasicHeaderValueFormatter
[INFO] Tests run: 6, Failures: 0, Errors: 0, Skipped: 0, Time elapsed: 0.001 s - in org.apache.http.message.TestBasicHeaderValueFormatter
[INFO] Running org.apache.http.message.TestTokenParser
[INFO] Tests run: 10, Failures: 0, Errors: 0, Skipped: 0, Time elapsed: 0.002 s - in org.apache.http.message.TestTokenParser
[INFO] Running org.apache.http.message.TestHeaderElement
[INFO] Tests run: 8, Failures: 0, Errors: 0, Skipped: 0, Time elapsed: 0.001 s - in org.apache.http.message.TestHeaderElement
[INFO] Running org.apache.http.message.TestBasicHeaderValueParser
[INFO] Tests run: 10, Failures: 0, Errors: 0, Skipped: 0, Time elapsed: 0.002 s - in org.apache.http.message.TestBasicHeaderValueParser
[INFO] Running org.apache.http.message.TestAbstractMessage
[INFO] Tests run: 3, Failures: 0, Errors: 0, Skipped: 0, Time elapsed: 0.001 s - in org.apache.http.message.TestAbstractMessage
[INFO] Running org.apache.http.message.TestBasicMessages
[INFO] Tests run: 7, Failures: 0, Errors: 0, Skipped: 0, Time elapsed: 0.001 s - in org.apache.http.message.TestBasicMessages
[INFO] Running org.apache.http.message.TestBasicHeaderIterator
[INFO] Tests run: 5, Failures: 0, Errors: 0, Skipped: 0, Time elapsed: 0 s - in org.apache.http.message.TestBasicHeaderIterator
[INFO] 
[INFO] Results:
[INFO] 
[INFO] Tests run: 656, Failures: 0, Errors: 0, Skipped: 0
[INFO] 
[JENKINS] Recording test results
[INFO] 
[INFO] --- maven-jar-plugin:3.0.2:jar (default-jar) @ httpcore ---
[INFO] Building jar: <https://builds.apache.org/job/httpcomponents-core-4.4.x/ws/httpcore/target/httpcore-4.4.8-SNAPSHOT.jar>
[INFO] 
[INFO] >>> maven-source-plugin:3.0.1:jar (attach-sources) > generate-sources @
httpcore >>>
[INFO] 
[INFO] --- maven-checkstyle-plugin:2.9.1:checkstyle (validate) @ httpcore ---
[INFO] Starting audit...
Audit done.

[INFO] 
[INFO] --- maven-checkstyle-plugin:2.9.1:checkstyle (validate-main) @ httpcore ---
[INFO] Starting audit...
Audit done.

[INFO] 
[INFO] --- maven-checkstyle-plugin:2.9.1:checkstyle (validate-test) @ httpcore ---
[INFO] Starting audit...
Audit done.

[INFO] 
[INFO] --- maven-checkstyle-plugin:2.9.1:checkstyle (validate-examples) @ httpcore ---
[INFO] Starting audit...
Audit done.

[INFO] 
[INFO] --- build-helper-maven-plugin:1.8:parse-version (parse-version) @ httpcore ---
[INFO] 
[INFO] --- maven-toolchains-plugin:1.1:toolchain (default) @ httpcore ---
[INFO] Required toolchain: jdk [ version='1.6' ]
[INFO] Found matching toolchain for type jdk: JDK[/home/jenkins/tools/java/latest1.6/]
[INFO] 
[INFO] --- build-helper-maven-plugin:1.8:add-source (add-source) @ httpcore ---
[INFO] Source directory: <https://builds.apache.org/job/httpcomponents-core-4.4.x/ws/httpcore/src/main/java-deprecated>
added.
[WARNING] Failed to getClass for org.apache.maven.plugins.source.SourceJarMojo
[INFO] 
[INFO] <<< maven-source-plugin:3.0.1:jar (attach-sources) < generate-sources @
httpcore <<<
[INFO] 
[INFO] --- maven-source-plugin:3.0.1:jar (attach-sources) @ httpcore ---
[INFO] Building jar: <https://builds.apache.org/job/httpcomponents-core-4.4.x/ws/httpcore/target/httpcore-4.4.8-SNAPSHOT-sources.jar>
[INFO] 
[INFO] --- maven-javadoc-plugin:3.0.0-M1:jar (attach-javadocs) @ httpcore ---
[INFO] Toolchain in maven-javadoc-plugin: JDK[/home/jenkins/tools/java/latest1.6/]
[INFO] Fixed Javadoc frame injection vulnerability (CVE-2013-1571) in 1 files.
[INFO] Building jar: <https://builds.apache.org/job/httpcomponents-core-4.4.x/ws/httpcore/target/httpcore-4.4.8-SNAPSHOT-javadoc.jar>
[INFO] 
[INFO] --- maven-site-plugin:3.6:attach-descriptor (attach-descriptor) @ httpcore ---
[INFO] Skipping because packaging 'jar' is not pom.
[INFO] 
[INFO] --- maven-jar-plugin:3.0.2:test-jar (default) @ httpcore ---
[INFO] Building jar: <https://builds.apache.org/job/httpcomponents-core-4.4.x/ws/httpcore/target/httpcore-4.4.8-SNAPSHOT-tests.jar>
[INFO] 
[INFO] --- apache-rat-plugin:0.12:check (default) @ httpcore ---
[INFO] Enabled default license matchers.
[INFO] Will parse SCM ignores for exclusions...
[INFO] Finished adding exclusions from SCM ignore files.
[INFO] 61 implicit excludes (use -debug for more details).
[INFO] Exclude: DEPENDENCIES
[INFO] Exclude: .pmd
[INFO] Exclude: **/.externalToolBuilders/**
[INFO] Exclude: **/.pmd
[INFO] Exclude: **/maven-eclipse.xml
[INFO] Exclude: **/.checkstyle
[INFO] Exclude: src/docbkx/resources/**
[INFO] Exclude: src/test/resources/*.truststore
[INFO] 358 resources included (use -debug for more details)
[INFO] Rat check: Summary over all files. Unapproved: 0, unknown: 0, generated: 0, approved:
352 licenses.
[INFO] 
[INFO] --- maven-install-plugin:2.5.2:install (default-install) @ httpcore ---
[INFO] Installing <https://builds.apache.org/job/httpcomponents-core-4.4.x/ws/httpcore/target/httpcore-4.4.8-SNAPSHOT.jar>
to /home/jenkins/jenkins-slave/maven-repositories/1/org/apache/httpcomponents/httpcore/4.4.8-SNAPSHOT/httpcore-4.4.8-SNAPSHOT.jar
[INFO] Installing <https://builds.apache.org/job/httpcomponents-core-4.4.x/ws/httpcore/pom.xml>
to /home/jenkins/jenkins-slave/maven-repositories/1/org/apache/httpcomponents/httpcore/4.4.8-SNAPSHOT/httpcore-4.4.8-SNAPSHOT.pom
[INFO] Installing <https://builds.apache.org/job/httpcomponents-core-4.4.x/ws/httpcore/target/httpcore-4.4.8-SNAPSHOT-sources.jar>
to /home/jenkins/jenkins-slave/maven-repositories/1/org/apache/httpcomponents/httpcore/4.4.8-SNAPSHOT/httpcore-4.4.8-SNAPSHOT-sources.jar
[INFO] Installing <https://builds.apache.org/job/httpcomponents-core-4.4.x/ws/httpcore/target/httpcore-4.4.8-SNAPSHOT-javadoc.jar>
to /home/jenkins/jenkins-slave/maven-repositories/1/org/apache/httpcomponents/httpcore/4.4.8-SNAPSHOT/httpcore-4.4.8-SNAPSHOT-javadoc.jar
[INFO] Installing <https://builds.apache.org/job/httpcomponents-core-4.4.x/ws/httpcore/target/httpcore-4.4.8-SNAPSHOT-tests.jar>
to /home/jenkins/jenkins-slave/maven-repositories/1/org/apache/httpcomponents/httpcore/4.4.8-SNAPSHOT/httpcore-4.4.8-SNAPSHOT-tests.jar
[INFO] 
[INFO] >>> clirr-maven-plugin:2.8:check (default-cli) > compile @ httpcore >>>
[INFO] 
[INFO] --- maven-checkstyle-plugin:2.9.1:checkstyle (validate) @ httpcore ---
[INFO] Starting audit...
Audit done.

[INFO] 
[INFO] --- maven-checkstyle-plugin:2.9.1:checkstyle (validate-main) @ httpcore ---
[INFO] Starting audit...
Audit done.

[INFO] 
[INFO] --- maven-checkstyle-plugin:2.9.1:checkstyle (validate-test) @ httpcore ---
[INFO] Starting audit...
Audit done.

[INFO] 
[INFO] --- maven-checkstyle-plugin:2.9.1:checkstyle (validate-examples) @ httpcore ---
[INFO] Starting audit...
Audit done.

[INFO] 
[INFO] --- build-helper-maven-plugin:1.8:parse-version (parse-version) @ httpcore ---
[INFO] 
[INFO] --- maven-toolchains-plugin:1.1:toolchain (default) @ httpcore ---
[INFO] Required toolchain: jdk [ version='1.6' ]
[INFO] Found matching toolchain for type jdk: JDK[/home/jenkins/tools/java/latest1.6/]
[INFO] 
[INFO] --- build-helper-maven-plugin:1.8:add-source (add-source) @ httpcore ---
[INFO] Source directory: <https://builds.apache.org/job/httpcomponents-core-4.4.x/ws/httpcore/src/main/java-deprecated>
added.
[INFO] 
[INFO] --- maven-remote-resources-plugin:1.5:process (process-resource-bundles) @ httpcore
---
[INFO] 
[INFO] --- maven-resources-plugin:3.0.2:resources (default-resources) @ httpcore ---
[INFO] Using 'UTF-8' encoding to copy filtered resources.
[INFO] Copying 1 resource
[INFO] Copying 3 resources
[INFO] Copying 3 resources
[INFO] 
[INFO] --- maven-compiler-plugin:3.7.0:compile (default-compile) @ httpcore ---
[INFO] Toolchain in maven-compiler-plugin: JDK[/home/jenkins/tools/java/latest1.6/]
[WARNING] Toolchains are ignored, 'executable' parameter is set to /home/jenkins/tools/java/latest1.7/bin/javac
[INFO] Changes detected - recompiling the module!
[INFO] Compiling 256 source files to <https://builds.apache.org/job/httpcomponents-core-4.4.x/ws/httpcore/target/classes>
[WARNING] Failed to getClass for org.codehaus.mojo.clirr.ClirrCheckMojo
[INFO] 
[INFO] <<< clirr-maven-plugin:2.8:check (default-cli) < compile @ httpcore <<<
[INFO] 
[INFO] --- clirr-maven-plugin:2.8:check (default-cli) @ httpcore ---
[INFO] Comparing to version: 4.4
[INFO] Succeeded with 0 errors; 0 warnings; and 11 other changes.
[INFO]                                                                         
[INFO] ------------------------------------------------------------------------
[INFO] Building Apache HttpCore NIO 4.4.8-SNAPSHOT
[INFO] ------------------------------------------------------------------------
[INFO] 
[INFO] --- maven-clean-plugin:3.0.0:clean (default-clean) @ httpcore-nio ---
[INFO] Deleting <https://builds.apache.org/job/httpcomponents-core-4.4.x/ws/httpcore-nio/target>
[INFO] 
[INFO] --- maven-checkstyle-plugin:2.9.1:checkstyle (validate) @ httpcore-nio ---
[INFO] Starting audit...
<https://builds.apache.org/job/httpcomponents-core-4.4.x/ws/httpcore-nio/src/main/java/org/apache/http/nio/protocol/ErrorResponseProducer.java>:43:
Trailing whitespace
<https://builds.apache.org/job/httpcomponents-core-4.4.x/ws/httpcore-nio/src/main/java/org/apache/http/nio/protocol/HttpAsyncService.java>:1092:
Trailing whitespace
Audit done.

[INFO] ------------------------------------------------------------------------
[INFO] Reactor Summary:
[INFO] 
[INFO] Apache HttpComponents Core ......................... SUCCESS [ 12.357 s]
[INFO] Apache HttpCore .................................... SUCCESS [ 52.898 s]
[INFO] Apache HttpCore NIO ................................ FAILURE [  1.345 s]
[INFO] Apache HttpCore OSGi bundle ........................ SKIPPED
[INFO] Apache HttpCore Benchmarking Tool .................. SKIPPED
[INFO] ------------------------------------------------------------------------
[INFO] BUILD FAILURE
[INFO] ------------------------------------------------------------------------
[INFO] Total time: 01:20 min
[INFO] Finished at: 2017-09-28T20:48:39+00:00
[INFO] Final Memory: 53M/773M
[INFO] ------------------------------------------------------------------------
[ERROR] Failed to execute goal org.apache.maven.plugins:maven-checkstyle-plugin:2.9.1:checkstyle
(validate) on project httpcore-nio: An error has occurred in Checkstyle report generation.
Failed during checkstyle execution: There are 2 checkstyle errors. -> [Help 1]
[ERROR] 
[ERROR] To see the full stack trace of the errors, re-run Maven with the -e switch.
[ERROR] Re-run Maven using the -X switch to enable full debug logging.
[ERROR] 
[ERROR] For more information about the errors and possible solutions, please read the following
articles:
[ERROR] [Help 1] http://cwiki.apache.org/confluence/display/MAVEN/MojoExecutionException
[ERROR] 
[ERROR] After correcting the problems, you can resume the build with the command
[ERROR]   mvn <goals> -rf :httpcore-nio
[JENKINS] Archiving <https://builds.apache.org/job/httpcomponents-core-4.4.x/ws/httpcore/pom.xml>
to org.apache.httpcomponents/httpcore/4.4.8-SNAPSHOT/httpcore-4.4.8-SNAPSHOT.pom
[JENKINS] Archiving <https://builds.apache.org/job/httpcomponents-core-4.4.x/ws/httpcore/target/httpcore-4.4.8-SNAPSHOT.jar>
to org.apache.httpcomponents/httpcore/4.4.8-SNAPSHOT/httpcore-4.4.8-SNAPSHOT.jar
[JENKINS] Archiving <https://builds.apache.org/job/httpcomponents-core-4.4.x/ws/httpcore/target/httpcore-4.4.8-SNAPSHOT-sources.jar>
to org.apache.httpcomponents/httpcore/4.4.8-SNAPSHOT/httpcore-4.4.8-SNAPSHOT-sources.jar
[JENKINS] Archiving <https://builds.apache.org/job/httpcomponents-core-4.4.x/ws/httpcore/target/httpcore-4.4.8-SNAPSHOT-javadoc.jar>
to org.apache.httpcomponents/httpcore/4.4.8-SNAPSHOT/httpcore-4.4.8-SNAPSHOT-javadoc.jar
[JENKINS] Archiving <https://builds.apache.org/job/httpcomponents-core-4.4.x/ws/httpcore/target/httpcore-4.4.8-SNAPSHOT-tests.jar>
to org.apache.httpcomponents/httpcore/4.4.8-SNAPSHOT/httpcore-4.4.8-SNAPSHOT-tests.jar
[JENKINS] Archiving <https://builds.apache.org/job/httpcomponents-core-4.4.x/ws/httpcore-osgi/pom.xml>
to org.apache.httpcomponents/httpcore-osgi/4.4.8-SNAPSHOT/httpcore-osgi-4.4.8-SNAPSHOT.pom
[JENKINS] Archiving <https://builds.apache.org/job/httpcomponents-core-4.4.x/ws/httpcore-ab/pom.xml>
to org.apache.httpcomponents/httpcore-ab/4.4.8-SNAPSHOT/httpcore-ab-4.4.8-SNAPSHOT.pom
[JENKINS] Archiving <https://builds.apache.org/job/httpcomponents-core-4.4.x/ws/pom.xml>
to org.apache.httpcomponents/httpcomponents-core/4.4.8-SNAPSHOT/httpcomponents-core-4.4.8-SNAPSHOT.pom
[JENKINS] Archiving <https://builds.apache.org/job/httpcomponents-core-4.4.x/ws/httpcore-nio/pom.xml>
to org.apache.httpcomponents/httpcore-nio/4.4.8-SNAPSHOT/httpcore-nio-4.4.8-SNAPSHOT.pom
channel stopped

Mime
View raw message